nixbot

builds

failed kandev-0.97.0 checks.aarch64-linux.pkgs-kandev · build #6686 · raw

1elastic-arm-62273820: building r9gc6dvv6lr2c3rxa0nwqmf21xjy9ll6-kandev-0.97.0.drv2Using versionCheckHook
unpackPhase
3unpacking source archive /nix/store/z0fnw2vsb8ax2gwlmqspg34gk96vi6vh-source4source root is source
patchPhase
5applying patch /nix/store/58lyy1i35l7fyj60lrd130jd2cvr2rxq-prefer-native-acp-runtimes.patch6patching file apps/backend/internal/agent/agents/copilot_acp.go7patching file apps/backend/internal/agent/agents/copilot_acp_test.go8patching file apps/backend/internal/agent/agents/droid_acp.go9patching file apps/backend/internal/agent/agents/gemini.go10patching file apps/backend/internal/agent/agents/kilocode_acp.go11patching file apps/backend/internal/agent/agents/native_binary_agents_test.go12patching file apps/backend/internal/agent/agents/qwen_acp.go13patching file apps/backend/internal/agent/hostutility/manager.go14Hunk #1 succeeded at 7 (offset 2 lines).15Hunk #2 succeeded at 26 (offset 2 lines).16Hunk #3 FAILED at 840.171 out of 3 hunks FAILED -- saving rejects to file apps/backend/internal/agent/hostutility/manager.go.rej18patching file apps/backend/internal/agent/hostutility/native_binary_test.go19patching file apps/backend/internal/agent/registry/provider.go20Hunk #2 succeeded at 134 (offset 8 lines).21patching file apps/backend/internal/agent/runtime/lifecycle/manager_launch.go22Hunk #1 succeeded at 711 (offset 102 lines).23patching file apps/backend/internal/agent/runtime/lifecycle/manager_launch_test.go24patching file apps/backend/internal/agent/runtime/lifecycle/utility.go25Hunk #2 succeeded at 80 (offset 3 lines).26Hunk #3 FAILED at 89.27Hunk #4 FAILED at 172.282 out of 4 hunks FAILED -- saving rejects to file apps/backend/internal/agent/runtime/lifecycle/utility.go.rej29patching file apps/backend/internal/agent/runtime/lifecycle/utility_test.go30patching file apps/backend/internal/agent/settings/controller/agent_config.go31patching file apps/backend/internal/agent/settings/controller/controller_test.go32patching file apps/backend/internal/agentctl/server/utility/acp_executor.go33Hunk #1 succeeded at 1294 with fuzz 2 (offset 51 lines).34Hunk #2 succeeded at 1311 (offset 52 lines).35patching file apps/backend/internal/agentctl/server/utility/probe_allowlist_test.go