setup
checks.aarch64-darwin.pkgs-kandev
· build #6686
· raw
1these 2 derivations will be built:2 /nix/store/9cacbhrzy179ylsdnwkhsg24xgn2s52m-kandev-0.97.0.drv3 /nix/store/6f9ksyii51z4s58whk5h8sdqiknsrg9f-check-kandev.drv4error: build of '/nix/store/9cacbhrzy179ylsdnwkhsg24xgn2s52m-kandev-0.97.0.drv' on 'ssh-ng://customer@mac02.m.ntd.one' failed: Cannot build '/nix/store/9cacbhrzy179ylsdnwkhsg24xgn2s52m-kandev-0.97.0.drv'.5 Reason: builder failed with exit code 1.6 Output paths:7 /nix/store/s0sxz05sck3xfii0nnkdi3d3m3lvzvpv-kandev-0.97.08 Last 25 log lines:9 > patching file apps/backend/internal/agent/agents/native_binary_agents_test.go10 > patching file apps/backend/internal/agent/agents/qwen_acp.go11 > patching file apps/backend/internal/agent/hostutility/manager.go12 > Hunk #1 succeeded at 7 (offset 2 lines).13 > Hunk #2 succeeded at 26 (offset 2 lines).14 > Hunk #3 FAILED at 840.15 > 1 out of 3 hunks FAILED -- saving rejects to file apps/backend/internal/agent/hostutility/manager.go.rej16 > patching file apps/backend/internal/agent/hostutility/native_binary_test.go17 > patching file apps/backend/internal/agent/registry/provider.go18 > Hunk #2 succeeded at 134 (offset 8 lines).19 > patching file apps/backend/internal/agent/runtime/lifecycle/manager_launch.go20 > Hunk #1 succeeded at 711 (offset 102 lines).21 > patching file apps/backend/internal/agent/runtime/lifecycle/manager_launch_test.go22 > patching file apps/backend/internal/agent/runtime/lifecycle/utility.go23 > Hunk #2 succeeded at 80 (offset 3 lines).24 > Hunk #3 FAILED at 89.25 > Hunk #4 FAILED at 172.26 > 2 out of 4 hunks FAILED -- saving rejects to file apps/backend/internal/agent/runtime/lifecycle/utility.go.rej27 > patching file apps/backend/internal/agent/runtime/lifecycle/utility_test.go28 > patching file apps/backend/internal/agent/settings/controller/agent_config.go29 > patching file apps/backend/internal/agent/settings/controller/controller_test.go30 > patching file apps/backend/internal/agentctl/server/utility/acp_executor.go31 > Hunk #1 succeeded at 1294 with fuzz 2 (offset 51 lines).32 > Hunk #2 succeeded at 1311 (offset 52 lines).33 > patching file apps/backend/internal/agentctl/server/utility/probe_allowlist_test.go34 For full logs, run:35 nix log /nix/store/9cacbhrzy179ylsdnwkhsg24xgn2s52m-kandev-0.97.0.drv36error: Cannot build '/nix/store/9cacbhrzy179ylsdnwkhsg24xgn2s52m-kandev-0.97.0.drv'.37 Reason: builder failed with exit code 1.38 Output paths:39 /nix/store/s0sxz05sck3xfii0nnkdi3d3m3lvzvpv-kandev-0.97.040error: Cannot build '/nix/store/6f9ksyii51z4s58whk5h8sdqiknsrg9f-check-kandev.drv'.41 Reason: 1 dependency failed.42 Output paths:43 /nix/store/f890nx1cawk78rwxhkjakwp90abdbc5v-check-kandev