these 2 derivations will be built: /nix/store/k3ld8pga7w7mchzm0l3dw84xflisb44k-aven-0.1.45.drv /nix/store/ggr675j4jd28bgwvl6rb2s0b5hjhclhy-check-aven.drv building '/nix/store/k3ld8pga7w7mchzm0l3dw84xflisb44k-aven-0.1.45.drv' aven-0.1.45> Using versionCheckHook aven-0.1.45> Running phase: unpackPhase aven-0.1.45> unpacking source archive /nix/store/68fpc8vxdi2v2mhf9v9r17ar8xvply9p-source aven-0.1.45> source root is source aven-0.1.45> Executing cargoSetupPostUnpackHook aven-0.1.45> Finished cargoSetupPostUnpackHook aven-0.1.45> Running phase: patchPhase aven-0.1.45> applying patch /nix/store/ly5lhdxax9l9307l5pibhip820xznj5b-daemon-status-unknown-without-gui-domain.patch aven-0.1.45> patching file src/daemon/service.rs aven-0.1.45> Hunk #1 FAILED at 240. aven-0.1.45> 1 out of 1 hunk FAILED -- saving rejects to file src/daemon/service.rs.rej error: Cannot build '/nix/store/k3ld8pga7w7mchzm0l3dw84xflisb44k-aven-0.1.45.drv'. Reason: builder failed with exit code 1. Output paths: /nix/store/302bb1ablxq90wx2z400wissbcv7z4z5-aven-0.1.45 Last 11 log lines: > Using versionCheckHook > Running phase: unpackPhase > unpacking source archive /nix/store/68fpc8vxdi2v2mhf9v9r17ar8xvply9p-source > source root is source > Executing cargoSetupPostUnpackHook > Finished cargoSetupPostUnpackHook > Running phase: patchPhase > applying patch /nix/store/ly5lhdxax9l9307l5pibhip820xznj5b-daemon-status-unknown-without-gui-domain.patch > patching file src/daemon/service.rs > Hunk #1 FAILED at 240. > 1 out of 1 hunk FAILED -- saving rejects to file src/daemon/service.rs.rej For full logs, run: nix log /nix/store/k3ld8pga7w7mchzm0l3dw84xflisb44k-aven-0.1.45.drv error: Cannot build '/nix/store/ggr675j4jd28bgwvl6rb2s0b5hjhclhy-check-aven.drv'. Reason: 1 dependency failed. Output paths: /nix/store/js6mvlv6ka0w8wql85i20xrl33fwz5w4-check-aven