setup
checks.aarch64-linux.pkgs-kandev
· build #6675
· raw
1these 6 derivations will be built:2 /nix/store/cgr7ybjcd3gidc5d9w9w71dpxl8rync8-source.drv3 /nix/store/a7r2fwgaz2vcrn3kv2h21iggzvlvxcma-kandev-web-pnpm-deps.drv4 /nix/store/y84wvffww81wsk917fc18afy5py2q5kn-kandev-web-0.97.0.drv5 /nix/store/88glji5i5xisl2a3iyy986a8rn0ys5k7-kandev-0.97.0-go-modules.drv6 /nix/store/r9gc6dvv6lr2c3rxa0nwqmf21xjy9ll6-kandev-0.97.0.drv7 /nix/store/340gj8crdjvawiiix78v5scv2lg1h6sz-check-kandev.drv8error: build of '/nix/store/r9gc6dvv6lr2c3rxa0nwqmf21xjy9ll6-kandev-0.97.0.drv' on 'grpc://farm.numtide.com:50051?client-cert=/run/secrets/vars/per-machine/bld1/nix-farm-ci/crt&client-key=/run/secrets/vars/per-machine/bld1/nix-farm-ci/key&connect-timeout=20&system=aarch64-linux' failed: Cannot build '/nix/store/r9gc6dvv6lr2c3rxa0nwqmf21xjy9ll6-kandev-0.97.0.drv'.9 Reason: builder failed with exit code 1.10 Output paths:11 /nix/store/crir1shfs912fq5mxd94hfrbg4cazb4v-kandev-0.97.012 Last 25 log lines:13 > patching file apps/backend/internal/agent/agents/native_binary_agents_test.go14 > patching file apps/backend/internal/agent/agents/qwen_acp.go15 > patching file apps/backend/internal/agent/hostutility/manager.go16 > Hunk #1 succeeded at 7 (offset 2 lines).17 > Hunk #2 succeeded at 26 (offset 2 lines).18 > Hunk #3 FAILED at 840.19 > 1 out of 3 hunks FAILED -- saving rejects to file apps/backend/internal/agent/hostutility/manager.go.rej20 > patching file apps/backend/internal/agent/hostutility/native_binary_test.go21 > patching file apps/backend/internal/agent/registry/provider.go22 > Hunk #2 succeeded at 134 (offset 8 lines).23 > patching file apps/backend/internal/agent/runtime/lifecycle/manager_launch.go24 > Hunk #1 succeeded at 711 (offset 102 lines).25 > patching file apps/backend/internal/agent/runtime/lifecycle/manager_launch_test.go26 > patching file apps/backend/internal/agent/runtime/lifecycle/utility.go27 > Hunk #2 succeeded at 80 (offset 3 lines).28 > Hunk #3 FAILED at 89.29 > Hunk #4 FAILED at 172.30 > 2 out of 4 hunks FAILED -- saving rejects to file apps/backend/internal/agent/runtime/lifecycle/utility.go.rej31 > patching file apps/backend/internal/agent/runtime/lifecycle/utility_test.go32 > patching file apps/backend/internal/agent/settings/controller/agent_config.go33 > patching file apps/backend/internal/agent/settings/controller/controller_test.go34 > patching file apps/backend/internal/agentctl/server/utility/acp_executor.go35 > Hunk #1 succeeded at 1294 with fuzz 2 (offset 51 lines).36 > Hunk #2 succeeded at 1311 (offset 52 lines).37 > patching file apps/backend/internal/agentctl/server/utility/probe_allowlist_test.go38 For full logs, run:39 nix log /nix/store/r9gc6dvv6lr2c3rxa0nwqmf21xjy9ll6-kandev-0.97.0.drv40error: Cannot build '/nix/store/r9gc6dvv6lr2c3rxa0nwqmf21xjy9ll6-kandev-0.97.0.drv'.41 Reason: builder failed with exit code 1.42 Output paths:43 /nix/store/crir1shfs912fq5mxd94hfrbg4cazb4v-kandev-0.97.044error: Cannot build '/nix/store/340gj8crdjvawiiix78v5scv2lg1h6sz-check-kandev.drv'.45 Reason: 1 dependency failed.46 Output paths:47 /nix/store/9fjhs2vfag3bmw46sr9mhb8nnks3lky6-check-kandev