mcptoon-0.8.7
checks.aarch64-linux.pkgs-mcptoon
· build #6481
· raw
1elastic-arm-e8571b84: building iyvpyjlf7vd0xmw3pi8sxlcg8hp3cmdw-mcptoon-0.8.7.drv2Sourcing python-remove-tests-dir-hook3Sourcing python-catch-conflicts-hook.sh4Sourcing python-remove-bin-bytecode-hook.sh5Sourcing pypa-build-hook6Using pypaBuildPhase7Sourcing python-runtime-deps-check-hook8Using pythonRuntimeDepsCheckHook9Sourcing pypa-install-hook10Using pypaInstallPhase11Sourcing python-imports-check-hook.sh12Using pythonImportsCheckPhase13Sourcing python-namespaces-hook14Sourcing python-catch-conflicts-hook.sh15Sourcing pytest-check-hook16Using pytestCheckPhase
unpackPhase
17unpacking source archive /nix/store/z3wqddwjjljcwn5h6dfbjrqm8jfkm17w-source18source root is source19setting SOURCE_DATE_EPOCH to timestamp 315619200 of file "source/tests/test_watch.py"configurePhase
20no configure script, doing nothingbuildPhase
21Executing pypaBuildPhase22Creating a wheel...23pypa build flags: --no-isolation --outdir dist/ --wheel24* Getting build dependencies for wheel...25/nix/store/isv6zwb5wfnn6sb1w1skg3cvlq83mh3n-python3.14-setuptools-83.0.0/lib/python3.14/site-packages/setuptools/config/_apply_pyprojecttoml.py:82: SetuptoolsDeprecationWarning: `project.license` as a TOML table is deprecated26!!2728 ********************************************************************************29 Please use a simple string containing a SPDX expression for `project.license`. You can also use `project.license-files`. (Both options available on setuptools>=77.0.0).3031 By 2027-Feb-18, you need to update your project and remove deprecated calls32 or your builds will no longer be supported.3334 See https://packaging.python.org/en/latest/guides/writing-pyproject-toml/#license for details.35 ********************************************************************************3637!!38 corresp(dist, value, root_dir)39/nix/store/isv6zwb5wfnn6sb1w1skg3cvlq83mh3n-python3.14-setuptools-83.0.0/lib/python3.14/site-packages/setuptools/config/_apply_pyprojecttoml.py:61: SetuptoolsDeprecationWarning: License classifiers are deprecated.40!!4142 ********************************************************************************43 Please consider removing the following classifiers in favor of a SPDX license expression:4445 License :: OSI Approved :: Apache Software License4647 See https://packaging.python.org/en/latest/guides/writing-pyproject-toml/#license for details.48 ********************************************************************************4950!!51 dist._finalize_license_expression()52/nix/store/isv6zwb5wfnn6sb1w1skg3cvlq83mh3n-python3.14-setuptools-83.0.0/lib/python3.14/site-packages/setuptools/dist.py:765: SetuptoolsDeprecationWarning: License classifiers are deprecated.53!!5455 ********************************************************************************56 Please consider removing the following classifiers in favor of a SPDX license expression:5758 License :: OSI Approved :: Apache Software License5960 See https://packaging.python.org/en/latest/guides/writing-pyproject-toml/#license for details.61 ********************************************************************************6263!!64 self._finalize_license_expression()65running egg_info66creating src/mcptoon.egg-info67writing src/mcptoon.egg-info/PKG-INFO68writing dependency_links to src/mcptoon.egg-info/dependency_links.txt69writing entry points to src/mcptoon.egg-info/entry_points.txt70writing requirements to src/mcptoon.egg-info/requires.txt71writing top-level names to src/mcptoon.egg-info/top_level.txt72writing manifest file 'src/mcptoon.egg-info/SOURCES.txt'73reading manifest file 'src/mcptoon.egg-info/SOURCES.txt'74adding license file 'LICENSE'75adding license file 'NOTICE'76writing manifest file 'src/mcptoon.egg-info/SOURCES.txt'77* Building wheel...78/nix/store/isv6zwb5wfnn6sb1w1skg3cvlq83mh3n-python3.14-setuptools-83.0.0/lib/python3.14/site-packages/setuptools/config/_apply_pyprojecttoml.py:82: SetuptoolsDeprecationWarning: `project.license` as a TOML table is deprecated79!!8081 ********************************************************************************82 Please use a simple string containing a SPDX expression for `project.license`. You can also use `project.license-files`. (Both options available on setuptools>=77.0.0).8384 By 2027-Feb-18, you need to update your project and remove deprecated calls85 or your builds will no longer be supported.8687 See https://packaging.python.org/en/latest/guides/writing-pyproject-toml/#license for details.88 ********************************************************************************8990!!91 corresp(dist, value, root_dir)92/nix/store/isv6zwb5wfnn6sb1w1skg3cvlq83mh3n-python3.14-setuptools-83.0.0/lib/python3.14/site-packages/setuptools/config/_apply_pyprojecttoml.py:61: SetuptoolsDeprecationWarning: License classifiers are deprecated.93!!9495 ********************************************************************************96 Please consider removing the following classifiers in favor of a SPDX license expression:9798 License :: OSI Approved :: Apache Software License99100 See https://packaging.python.org/en/latest/guides/writing-pyproject-toml/#license for details.101 ********************************************************************************102103!!104 dist._finalize_license_expression()105/nix/store/isv6zwb5wfnn6sb1w1skg3cvlq83mh3n-python3.14-setuptools-83.0.0/lib/python3.14/site-packages/setuptools/dist.py:765: SetuptoolsDeprecationWarning: License classifiers are deprecated.106!!107108 ********************************************************************************109 Please consider removing the following classifiers in favor of a SPDX license expression:110111 License :: OSI Approved :: Apache Software License112113 See https://packaging.python.org/en/latest/guides/writing-pyproject-toml/#license for details.114 ********************************************************************************115116!!117 self._finalize_license_expression()118running bdist_wheel119running build120running build_py121creating build/lib/mcptoon122copying src/mcptoon/usage.py -> build/lib/mcptoon123copying src/mcptoon/compressor.py -> build/lib/mcptoon124copying src/mcptoon/headers.py -> build/lib/mcptoon125copying src/mcptoon/report.py -> build/lib/mcptoon126copying src/mcptoon/sync.py -> build/lib/mcptoon127copying src/mcptoon/packs.py -> build/lib/mcptoon128copying src/mcptoon/update.py -> build/lib/mcptoon129copying src/mcptoon/config.py -> build/lib/mcptoon130copying src/mcptoon/native_tools.py -> build/lib/mcptoon131copying src/mcptoon/cli.py -> build/lib/mcptoon132copying src/mcptoon/errors.py -> build/lib/mcptoon133copying src/mcptoon/manifest.py -> build/lib/mcptoon134copying src/mcptoon/plugin.py -> build/lib/mcptoon135copying src/mcptoon/footer.py -> build/lib/mcptoon136copying src/mcptoon/bench.py -> build/lib/mcptoon137copying src/mcptoon/toon_vendored.py -> build/lib/mcptoon138copying src/mcptoon/bench_tokens.py -> build/lib/mcptoon139copying src/mcptoon/serve.py -> build/lib/mcptoon140copying src/mcptoon/watch.py -> build/lib/mcptoon141copying src/mcptoon/health.py -> build/lib/mcptoon142copying src/mcptoon/__main__.py -> build/lib/mcptoon143copying src/mcptoon/discover.py -> build/lib/mcptoon144copying src/mcptoon/skills.py -> build/lib/mcptoon145copying src/mcptoon/router.py -> build/lib/mcptoon146copying src/mcptoon/cache.py -> build/lib/mcptoon147copying src/mcptoon/output.py -> build/lib/mcptoon148copying src/mcptoon/demo.py -> build/lib/mcptoon149copying src/mcptoon/installer.py -> build/lib/mcptoon150copying src/mcptoon/__init__.py -> build/lib/mcptoon151copying src/mcptoon/client.py -> build/lib/mcptoon152copying src/mcptoon/ccr.py -> build/lib/mcptoon153copying src/mcptoon/demo_server.py -> build/lib/mcptoon154copying src/mcptoon/schema_simplifier.py -> build/lib/mcptoon155copying src/mcptoon/welcome.py -> build/lib/mcptoon156creating build/lib/mcptoon/_toon157copying src/mcptoon/_toon/writer.py -> build/lib/mcptoon/_toon158copying src/mcptoon/_toon/primitives.py -> build/lib/mcptoon/_toon159copying src/mcptoon/_toon/normalize.py -> build/lib/mcptoon/_toon160copying src/mcptoon/_toon/constants.py -> build/lib/mcptoon/_toon161copying src/mcptoon/_toon/decoder.py -> build/lib/mcptoon/_toon162copying src/mcptoon/_toon/encoder.py -> build/lib/mcptoon/_toon163copying src/mcptoon/_toon/types.py -> build/lib/mcptoon/_toon164copying src/mcptoon/_toon/__init__.py -> build/lib/mcptoon/_toon165copying src/mcptoon/_toon/encoders.py -> build/lib/mcptoon/_toon166running egg_info167writing src/mcptoon.egg-info/PKG-INFO168writing dependency_links to src/mcptoon.egg-info/dependency_links.txt169writing entry points to src/mcptoon.egg-info/entry_points.txt170writing requirements to src/mcptoon.egg-info/requires.txt171writing top-level names to src/mcptoon.egg-info/top_level.txt172reading manifest file 'src/mcptoon.egg-info/SOURCES.txt'173adding license file 'LICENSE'174adding license file 'NOTICE'175writing manifest file 'src/mcptoon.egg-info/SOURCES.txt'176copying src/mcptoon/packs.json -> build/lib/mcptoon177creating build/lib/mcptoon/skill178copying src/mcptoon/skill/SKILL.md -> build/lib/mcptoon/skill179installing to build/bdist.linux-aarch64/wheel180running install181running install_lib182creating build/bdist.linux-aarch64/wheel183creating build/bdist.linux-aarch64/wheel/mcptoon184creating build/bdist.linux-aarch64/wheel/mcptoon/skill185copying build/lib/mcptoon/skill/SKILL.md -> build/bdist.linux-aarch64/wheel/./mcptoon/skill186copying build/lib/mcptoon/usage.py -> build/bdist.linux-aarch64/wheel/./mcptoon187creating build/bdist.linux-aarch64/wheel/mcptoon/_toon188copying build/lib/mcptoon/_toon/writer.py -> build/bdist.linux-aarch64/wheel/./mcptoon/_toon189copying build/lib/mcptoon/_toon/primitives.py -> build/bdist.linux-aarch64/wheel/./mcptoon/_toon190copying build/lib/mcptoon/_toon/normalize.py -> build/bdist.linux-aarch64/wheel/./mcptoon/_toon191copying build/lib/mcptoon/_toon/constants.py -> build/bdist.linux-aarch64/wheel/./mcptoon/_toon192copying build/lib/mcptoon/_toon/decoder.py -> build/bdist.linux-aarch64/wheel/./mcptoon/_toon193copying build/lib/mcptoon/_toon/encoder.py -> build/bdist.linux-aarch64/wheel/./mcptoon/_toon194copying build/lib/mcptoon/_toon/types.py -> build/bdist.linux-aarch64/wheel/./mcptoon/_toon195copying build/lib/mcptoon/_toon/__init__.py -> build/bdist.linux-aarch64/wheel/./mcptoon/_toon196copying build/lib/mcptoon/_toon/encoders.py -> build/bdist.linux-aarch64/wheel/./mcptoon/_toon197copying build/lib/mcptoon/compressor.py -> build/bdist.linux-aarch64/wheel/./mcptoon198copying build/lib/mcptoon/headers.py -> build/bdist.linux-aarch64/wheel/./mcptoon199copying build/lib/mcptoon/report.py -> build/bdist.linux-aarch64/wheel/./mcptoon200copying build/lib/mcptoon/sync.py -> build/bdist.linux-aarch64/wheel/./mcptoon201copying build/lib/mcptoon/packs.py -> build/bdist.linux-aarch64/wheel/./mcptoon202copying build/lib/mcptoon/update.py -> build/bdist.linux-aarch64/wheel/./mcptoon203copying build/lib/mcptoon/config.py -> build/bdist.linux-aarch64/wheel/./mcptoon204copying build/lib/mcptoon/native_tools.py -> build/bdist.linux-aarch64/wheel/./mcptoon205copying build/lib/mcptoon/cli.py -> build/bdist.linux-aarch64/wheel/./mcptoon206copying build/lib/mcptoon/errors.py -> build/bdist.linux-aarch64/wheel/./mcptoon207copying build/lib/mcptoon/manifest.py -> build/bdist.linux-aarch64/wheel/./mcptoon208copying build/lib/mcptoon/plugin.py -> build/bdist.linux-aarch64/wheel/./mcptoon209copying build/lib/mcptoon/footer.py -> build/bdist.linux-aarch64/wheel/./mcptoon210copying build/lib/mcptoon/packs.json -> build/bdist.linux-aarch64/wheel/./mcptoon211copying build/lib/mcptoon/bench.py -> build/bdist.linux-aarch64/wheel/./mcptoon212copying build/lib/mcptoon/toon_vendored.py -> build/bdist.linux-aarch64/wheel/./mcptoon213copying build/lib/mcptoon/bench_tokens.py -> build/bdist.linux-aarch64/wheel/./mcptoon214copying build/lib/mcptoon/serve.py -> build/bdist.linux-aarch64/wheel/./mcptoon215copying build/lib/mcptoon/watch.py -> build/bdist.linux-aarch64/wheel/./mcptoon216copying build/lib/mcptoon/health.py -> build/bdist.linux-aarch64/wheel/./mcptoon217copying build/lib/mcptoon/__main__.py -> build/bdist.linux-aarch64/wheel/./mcptoon218copying build/lib/mcptoon/discover.py -> build/bdist.linux-aarch64/wheel/./mcptoon219copying build/lib/mcptoon/skills.py -> build/bdist.linux-aarch64/wheel/./mcptoon220copying build/lib/mcptoon/router.py -> build/bdist.linux-aarch64/wheel/./mcptoon221copying build/lib/mcptoon/cache.py -> build/bdist.linux-aarch64/wheel/./mcptoon222copying build/lib/mcptoon/output.py -> build/bdist.linux-aarch64/wheel/./mcptoon223copying build/lib/mcptoon/demo.py -> build/bdist.linux-aarch64/wheel/./mcptoon224copying build/lib/mcptoon/installer.py -> build/bdist.linux-aarch64/wheel/./mcptoon225copying build/lib/mcptoon/__init__.py -> build/bdist.linux-aarch64/wheel/./mcptoon226copying build/lib/mcptoon/client.py -> build/bdist.linux-aarch64/wheel/./mcptoon227copying build/lib/mcptoon/ccr.py -> build/bdist.linux-aarch64/wheel/./mcptoon228copying build/lib/mcptoon/demo_server.py -> build/bdist.linux-aarch64/wheel/./mcptoon229copying build/lib/mcptoon/schema_simplifier.py -> build/bdist.linux-aarch64/wheel/./mcptoon230copying build/lib/mcptoon/welcome.py -> build/bdist.linux-aarch64/wheel/./mcptoon231running install_egg_info232Copying src/mcptoon.egg-info to build/bdist.linux-aarch64/wheel/./mcptoon-0.8.7-py3.14.egg-info233running install_scripts234creating build/bdist.linux-aarch64/wheel/mcptoon-0.8.7.dist-info/WHEEL235creating '/build/source/dist/.tmp-nusgkreh/mcptoon-0.8.7-py3-none-any.whl' and adding 'build/bdist.linux-aarch64/wheel' to it236adding 'mcptoon/__init__.py'237adding 'mcptoon/__main__.py'238adding 'mcptoon/bench.py'239adding 'mcptoon/bench_tokens.py'240adding 'mcptoon/cache.py'241adding 'mcptoon/ccr.py'242adding 'mcptoon/cli.py'243adding 'mcptoon/client.py'244adding 'mcptoon/compressor.py'245adding 'mcptoon/config.py'246adding 'mcptoon/demo.py'247adding 'mcptoon/demo_server.py'248adding 'mcptoon/discover.py'249adding 'mcptoon/errors.py'250adding 'mcptoon/footer.py'251adding 'mcptoon/headers.py'252adding 'mcptoon/health.py'253adding 'mcptoon/installer.py'254adding 'mcptoon/manifest.py'255adding 'mcptoon/native_tools.py'256adding 'mcptoon/output.py'257adding 'mcptoon/packs.json'258adding 'mcptoon/packs.py'259adding 'mcptoon/plugin.py'260adding 'mcptoon/report.py'261adding 'mcptoon/router.py'262adding 'mcptoon/schema_simplifier.py'263adding 'mcptoon/serve.py'264adding 'mcptoon/skills.py'265adding 'mcptoon/sync.py'266adding 'mcptoon/toon_vendored.py'267adding 'mcptoon/update.py'268adding 'mcptoon/usage.py'269adding 'mcptoon/watch.py'270adding 'mcptoon/welcome.py'271adding 'mcptoon/_toon/__init__.py'272adding 'mcptoon/_toon/constants.py'273adding 'mcptoon/_toon/decoder.py'274adding 'mcptoon/_toon/encoder.py'275adding 'mcptoon/_toon/encoders.py'276adding 'mcptoon/_toon/normalize.py'277adding 'mcptoon/_toon/primitives.py'278adding 'mcptoon/_toon/types.py'279adding 'mcptoon/_toon/writer.py'280adding 'mcptoon/skill/SKILL.md'281adding 'mcptoon-0.8.7.dist-info/licenses/LICENSE'282adding 'mcptoon-0.8.7.dist-info/licenses/NOTICE'283adding 'mcptoon-0.8.7.dist-info/METADATA'284adding 'mcptoon-0.8.7.dist-info/WHEEL'285adding 'mcptoon-0.8.7.dist-info/entry_points.txt'286adding 'mcptoon-0.8.7.dist-info/top_level.txt'287adding 'mcptoon-0.8.7.dist-info/RECORD'288removing build/bdist.linux-aarch64/wheel289Successfully built mcptoon-0.8.7-py3-none-any.whl290Finished creating a wheel...291Finished executing pypaBuildPhasepythonRuntimeDepsCheckHook
292Executing pythonRuntimeDepsCheck293Checking runtime dependencies for mcptoon-0.8.7-py3-none-any.whl294Finished executing pythonRuntimeDepsCheckinstallPhase
295Executing pypaInstallPhase296Successfully installed mcptoon-0.8.7-py3-none-any.whl297Finished executing pypaInstallPhasepythonOutputDistPhase
298Executing pythonOutputDistPhase299Finished executing pythonOutputDistPhasefixupPhase
300shrinking RPATHs of ELF executables and libraries in /nix/store/sqgsxnfdsjzi0na5ny3ds9lrf2mwifkb-mcptoon-0.8.7301checking for references to /build/ in /nix/store/sqgsxnfdsjzi0na5ny3ds9lrf2mwifkb-mcptoon-0.8.7...302patching script interpreter paths in /nix/store/sqgsxnfdsjzi0na5ny3ds9lrf2mwifkb-mcptoon-0.8.7303stripping (with command strip and flags -S -p) in /nix/store/sqgsxnfdsjzi0na5ny3ds9lrf2mwifkb-mcptoon-0.8.7/lib /nix/store/sqgsxnfdsjzi0na5ny3ds9lrf2mwifkb-mcptoon-0.8.7/bin304shrinking RPATHs of ELF executables and libraries in /nix/store/zyvhf87y5hgm263rc7kddkkk4iv0xxi4-mcptoon-0.8.7-dist305checking for references to /build/ in /nix/store/zyvhf87y5hgm263rc7kddkkk4iv0xxi4-mcptoon-0.8.7-dist...306patching script interpreter paths in /nix/store/zyvhf87y5hgm263rc7kddkkk4iv0xxi4-mcptoon-0.8.7-dist307Rewriting #!/nix/store/81ag9nxz1flw3xjkv1vvqg8y2ipx2ins-python3-3.14.7/bin/python3.14 to #!/nix/store/81ag9nxz1flw3xjkv1vvqg8y2ipx2ins-python3-3.14.7308wrapping `/nix/store/sqgsxnfdsjzi0na5ny3ds9lrf2mwifkb-mcptoon-0.8.7/bin/mcptoon'...309Executing pythonRemoveTestsDir310Finished executing pythonRemoveTestsDirinstallCheckPhase
311no Makefile or custom installCheckPhase, doing nothingpythonImportsCheckPhase
312Executing pythonImportsCheckPhase313Check whether the following modules can be imported: mcptoonpytestCheckPhase
314Executing pytestCheckPhase315pytest flags: -m pytest -k not\ \(test_search_registry_returns_list\)\ and\ not\ \(test_search_smithery_returns_list\)\ and\ not\ \(test_search_mcp_registry_returns_list\)\ and\ not\ \(test_packaged_path_resolves_to_the_copy_on_disk\)316============================= test session starts ==============================317platform linux -- Python 3.14.7, pytest-9.1.1, pluggy-1.6.0318rootdir: /build/source319configfile: pyproject.toml320testpaths: tests321collected 1755 items / 4 deselected / 1751 selected 322323tests/test_add_url_validation.py .............. [ 0%]324tests/test_bench.py ............. [ 1%]325tests/test_bench_tokens.py ....ss.. [ 1%]326tests/test_benchmark_repro.py sss......... [ 2%]327tests/test_cache.py .... [ 2%]328tests/test_calculator.py .......................... [ 4%]329tests/test_ccr.py ........... [ 5%]330tests/test_claude_plugin_package.py ............. [ 5%]331tests/test_cli_flags.py ........... [ 6%]332tests/test_cli_smoke.py ....... [ 6%]333tests/test_client.py .............................. [ 8%]334tests/test_command_coverage.py ......... [ 9%]335tests/test_completion.py ........... [ 9%]336tests/test_compressor.py ......................... [ 11%]337tests/test_config.py .................... [ 12%]338tests/test_dead_server_diagnostics.py ... [ 12%]339tests/test_demo.py ..................... [ 13%]340tests/test_demo_dead_package.py ..F..... [ 14%]341tests/test_demo_server.py .............................................. [ 16%]342..... [ 16%]343tests/test_discover.py .................................... [ 19%]344tests/test_doctor_star_hint.py ..... [ 19%]345tests/test_envelope.py ........ [ 19%]346tests/test_exit_codes.py .................... [ 20%]347tests/test_fallback_json.py ...... [ 21%]348tests/test_footer_broadcast.py ......................................... [ 23%]349.... [ 23%]350tests/test_footprint_claims.py ............ [ 24%]351tests/test_gemini_manifest.py ...... [ 24%]352tests/test_health.py ............. [ 25%]353tests/test_help_shortcircuit.py ......... [ 26%]354tests/test_http_user_agent.py ......... [ 26%]355tests/test_import.py ..................... [ 27%]356tests/test_installer_registry.py ............................ [ 29%]357tests/test_lang.py .............................. [ 31%]358tests/test_llms_txt.py ...... [ 31%]359tests/test_native_tools.py ............................................. [ 34%]360........................ [ 35%]361tests/test_output.py ................................................... [ 38%]362........................................................................ [ 42%]363................ [ 43%]364tests/test_plugin_install.py .......... [ 43%]365tests/test_plugin_scan.py ............................... [ 45%]366tests/test_policy_overrides.py ................ [ 46%]367tests/test_presence.py ................................................. [ 49%]368........... [ 50%]369tests/test_readme_links.py ... [ 50%]370tests/test_registry_sync.py ............. [ 50%]371tests/test_report.py .............. [ 51%]372tests/test_reversible.py ............................................... [ 54%]373................. [ 55%]374tests/test_router.py .............................................. [ 58%]375tests/test_schema_call_e2e.py .. [ 58%]376tests/test_search.py ................................... [ 60%]377tests/test_serve.py .................................................... [ 63%]378 [ 63%]379tests/test_serve_perf.py .......... [ 63%]380tests/test_serve_prompts.py ........ [ 64%]381tests/test_skill_package.py ........................... [ 65%]382tests/test_skill_packs.py ................ [ 66%]383tests/test_skill_search.py .......... [ 67%]384tests/test_skills.py ................................................... [ 70%]385.....................ss................................................. [ 74%]386................................... [ 76%]387tests/test_smart_compress_e2e.py ................. [ 77%]388tests/test_source_tracked.py sss [ 77%]389tests/test_stats_toggle.py ......... [ 77%]390tests/test_stderr_pipe_deadlock.py .... [ 78%]391tests/test_sync.py ..................................................... [ 81%]392................................ [ 82%]393tests/test_tier_claims_consistent.py .... [ 83%]394tests/test_toml_config.py .......................... [ 84%]395tests/test_toon_cross_validate.py ............................... [ 86%]396tests/test_uninstall_end_to_end.py .......... [ 86%]397tests/test_update.py .................... [ 88%]398tests/test_v02_features.py .................................... [ 90%]399tests/test_v04_features.py ................ [ 91%]400tests/test_v05_features.py ...................... [ 92%]401tests/test_v072_delight.py ..................s.. [ 93%]402tests/test_v073_http_security.py .............................. [ 95%]403tests/test_v074_stdio_timeout.py ............ [ 95%]404tests/test_v076_stateless_serve.py ................... [ 97%]405tests/test_v07_spec2026.py ..................... [ 98%]406tests/test_v081_env_headers.py ............. [ 98%]407tests/test_watch.py .................. [100%]408409=================================== FAILURES ===================================410________ TestDeadServerStderrSurfaces.test_process_died_includes_stderr ________411412self = <tests.test_demo_dead_package.TestDeadServerStderrSurfaces testMethod=test_process_died_includes_stderr>413414 def test_process_died_includes_stderr(self):415 """Real subprocess: stderr tail reaches the MCPError message."""416 client = MCPClient(stdio=_DEAD_SERVER_CMD, timeout=10)417 try:418 with self.assertRaises(MCPError) as cm:419 client.initialize()420 finally:421 try:422 client.close()423 except Exception:424 pass425> self.assertEqual(cm.exception.code, "PROCESS_DIED")426E AssertionError: 'RESPONSE_TIMEOUT' != 'PROCESS_DIED'427E - RESPONSE_TIMEOUT428E + PROCESS_DIED429430tests/test_demo_dead_package.py:86: AssertionError431=========================== short test summary info ============================432FAILED tests/test_demo_dead_package.py::TestDeadServerStderrSurfaces::test_process_died_includes_stderr - AssertionError: 'RESPONSE_TIMEOUT' != 'PROCESS_DIED'433===== 1 failed, 1739 passed, 11 skipped, 4 deselected in 103.41s (0:01:43) =====