setup
checks.aarch64-linux.pkgs-mcptoon
· build #6481
· raw
1these 2 derivations will be built:2 /nix/store/iyvpyjlf7vd0xmw3pi8sxlcg8hp3cmdw-mcptoon-0.8.7.drv3 /nix/store/dh7ns42vz93dakh4b38v5q9vnrrr5170-check-mcptoon.drv4error: build of '/nix/store/iyvpyjlf7vd0xmw3pi8sxlcg8hp3cmdw-mcptoon-0.8.7.drv' on 'grpc://farm.numtide.com:50051?client-cert=/run/secrets/vars/per-machine/bld1/nix-farm-ci/crt&client-key=/run/secrets/vars/per-machine/bld1/nix-farm-ci/key&connect-timeout=23&system=aarch64-linux' failed: Cannot build '/nix/store/iyvpyjlf7vd0xmw3pi8sxlcg8hp3cmdw-mcptoon-0.8.7.drv'.5 Reason: builder failed with exit code 1.6 Output paths:7 /nix/store/sqgsxnfdsjzi0na5ny3ds9lrf2mwifkb-mcptoon-0.8.78 /nix/store/zyvhf87y5hgm263rc7kddkkk4iv0xxi4-mcptoon-0.8.7-dist9 Last 25 log lines:10 > =================================== FAILURES ===================================11 > ________ TestDeadServerStderrSurfaces.test_process_died_includes_stderr ________12 >13 > self = <tests.test_demo_dead_package.TestDeadServerStderrSurfaces testMethod=test_process_died_includes_stderr>14 >15 > def test_process_died_includes_stderr(self):16 > """Real subprocess: stderr tail reaches the MCPError message."""17 > client = MCPClient(stdio=_DEAD_SERVER_CMD, timeout=10)18 > try:19 > with self.assertRaises(MCPError) as cm:20 > client.initialize()21 > finally:22 > try:23 > client.close()24 > except Exception:25 > pass26 > > self.assertEqual(cm.exception.code, "PROCESS_DIED")27 > E AssertionError: 'RESPONSE_TIMEOUT' != 'PROCESS_DIED'28 > E - RESPONSE_TIMEOUT29 > E + PROCESS_DIED30 >31 > tests/test_demo_dead_package.py:86: AssertionError32 > =========================== short test summary info ============================33 > FAILED tests/test_demo_dead_package.py::TestDeadServerStderrSurfaces::test_process_died_includes_stderr - AssertionError: 'RESPONSE_TIMEOUT' != 'PROCESS_DIED'34 > ===== 1 failed, 1739 passed, 11 skipped, 4 deselected in 103.41s (0:01:43) =====35 For full logs, run:36 nix log /nix/store/iyvpyjlf7vd0xmw3pi8sxlcg8hp3cmdw-mcptoon-0.8.7.drv37error: Cannot build '/nix/store/iyvpyjlf7vd0xmw3pi8sxlcg8hp3cmdw-mcptoon-0.8.7.drv'.38 Reason: builder failed with exit code 1.39 Output paths:40 /nix/store/sqgsxnfdsjzi0na5ny3ds9lrf2mwifkb-mcptoon-0.8.741 /nix/store/zyvhf87y5hgm263rc7kddkkk4iv0xxi4-mcptoon-0.8.7-dist42error: Cannot build '/nix/store/dh7ns42vz93dakh4b38v5q9vnrrr5170-check-mcptoon.drv'.43 Reason: 1 dependency failed.44 Output paths:45 /nix/store/vjk3kk82x7g4nkla1w91y8b3qgpa7p5f-check-mcptoon