setup
checks.x86_64-linux.pkgs-mcptoon
· build #6441
· raw
1these 2 derivations will be built:2 /nix/store/2fhnr744gyprwn0qcbkqxx7r26cl5v53-mcptoon-0.8.7.drv3 /nix/store/1cfb04wkwircmay6axk8fl7bd88nr2jf-check-mcptoon.drv4error: Cannot build '/nix/store/2fhnr744gyprwn0qcbkqxx7r26cl5v53-mcptoon-0.8.7.drv'.5 Reason: builder failed with exit code 1.6 Output paths:7 /nix/store/g4ij0nhy42ilxp0zwqrv1ps128pgjk0q-mcptoon-0.8.7-dist8 /nix/store/j52zxnj82q8iid8pi5sq92534jsliffb-mcptoon-0.8.79 Last 25 log lines:10 > tests/test_v076_stateless_serve.py ................... [ 97%]11 > tests/test_v07_spec2026.py ..................... [ 98%]12 > tests/test_v081_env_headers.py ............. [ 98%]13 > tests/test_watch.py .................. [100%]14 >15 > =================================== FAILURES ===================================16 > _____ TestThreeCopiesAgree.test_packaged_path_resolves_to_the_copy_on_disk _____17 >18 > self = <tests.test_skill_package.TestThreeCopiesAgree object at 0x7ffff4e4a780>19 >20 > def test_packaged_path_resolves_to_the_copy_on_disk(self):21 > """`install_self` copies from this path, so it must be the real one."""22 > resolved = skills.packaged_skill_path()23 > assert resolved.is_file(), resolved24 > > assert resolved.resolve() == COPIES["packaged"].resolve()25 > E AssertionError: assert PosixPath('/nix/store/j52zxnj82q8iid8pi5sq92534jsliffb-mcptoon-0.8.7/lib/python3.14/site-packages/mcptoon/skill/SKILL.md') == PosixPath('/build/source/src/mcptoon/skill/SKILL.md')26 > E + where PosixPath('/nix/store/j52zxnj82q8iid8pi5sq92534jsliffb-mcptoon-0.8.7/lib/python3.14/site-packages/mcptoon/skill/SKILL.md') = resolve()27 > E + where resolve = PosixPath('/nix/store/j52zxnj82q8iid8pi5sq92534jsliffb-mcptoon-0.8.7/lib/python3.14/site-packages/mcptoon/skill/SKILL.md').resolve28 > E + and PosixPath('/build/source/src/mcptoon/skill/SKILL.md') = resolve()29 > E + where resolve = PosixPath('/build/source/src/mcptoon/skill/SKILL.md').resolve30 >31 > tests/test_skill_package.py:86: AssertionError32 > =========================== short test summary info ============================33 > FAILED tests/test_skill_package.py::TestThreeCopiesAgree::test_packaged_path_resolves_to_the_copy_on_disk - AssertionError: assert PosixPath('/nix/store/j52zxnj82q8iid8pi5sq92534jslif...34 > ===== 1 failed, 1740 passed, 11 skipped, 3 deselected in 75.92s (0:01:15) ======35 For full logs, run:36 nix log /nix/store/2fhnr744gyprwn0qcbkqxx7r26cl5v53-mcptoon-0.8.7.drv37error: Cannot build '/nix/store/1cfb04wkwircmay6axk8fl7bd88nr2jf-check-mcptoon.drv'.38 Reason: 1 dependency failed.39 Output paths:40 /nix/store/v00bbasy0ffba0n5n0biwwji5vhxr4vl-check-mcptoon