setup
checks.aarch64-darwin.pkgs-mcptoon
· build #6441
· raw
1these 3 derivations will be built:2 /nix/store/1wygzab5b9n4cy18baq8g0l1drbl1l6n-source.drv3 /nix/store/wcrlw81zjjfzqcvl48c4z45sdzdgxzwx-mcptoon-0.8.7.drv4 /nix/store/9h6h2zg6ds2mmp0sncdpdlkxy2g74f66-check-mcptoon.drv5error: build of '/nix/store/wcrlw81zjjfzqcvl48c4z45sdzdgxzwx-mcptoon-0.8.7.drv' on 'ssh-ng://customer@mac02.m.ntd.one' failed: Cannot build '/nix/store/wcrlw81zjjfzqcvl48c4z45sdzdgxzwx-mcptoon-0.8.7.drv'.6 Reason: builder failed with exit code 1.7 Output paths:8 /nix/store/blpnwjl37fs9hgx20n75n97zjfmqrd06-mcptoon-0.8.79 /nix/store/k7xfh1v1x5wphzma6ab23xhy4458wyx2-mcptoon-0.8.7-dist10 Last 25 log lines:11 > tests/test_v076_stateless_serve.py ................... [ 97%]12 > tests/test_v07_spec2026.py ..................... [ 98%]13 > tests/test_v081_env_headers.py ............. [ 98%]14 > tests/test_watch.py .................. [100%]15 >16 > =================================== FAILURES ===================================17 > _____ TestThreeCopiesAgree.test_packaged_path_resolves_to_the_copy_on_disk _____18 >19 > self = <tests.test_skill_package.TestThreeCopiesAgree object at 0x109cd6780>20 >21 > def test_packaged_path_resolves_to_the_copy_on_disk(self):22 > """`install_self` copies from this path, so it must be the real one."""23 > resolved = skills.packaged_skill_path()24 > assert resolved.is_file(), resolved25 > > assert resolved.resolve() == COPIES["packaged"].resolve()26 > E AssertionError: assert PosixPath('/nix/store/blpnwjl37fs9hgx20n75n97zjfmqrd06-mcptoon-0.8.7/lib/python3.14/site-packages/mcptoon/skill/SKILL.md') == PosixPath('/nix/var/nix/builds/nix-54793-2990173905/source/src/mcptoon/skill/SKILL.md')27 > E + where PosixPath('/nix/store/blpnwjl37fs9hgx20n75n97zjfmqrd06-mcptoon-0.8.7/lib/python3.14/site-packages/mcptoon/skill/SKILL.md') = resolve()28 > E + where resolve = PosixPath('/nix/store/blpnwjl37fs9hgx20n75n97zjfmqrd06-mcptoon-0.8.7/lib/python3.14/site-packages/mcptoon/skill/SKILL.md').resolve29 > E + and PosixPath('/nix/var/nix/builds/nix-54793-2990173905/source/src/mcptoon/skill/SKILL.md') = resolve()30 > E + where resolve = PosixPath('/nix/var/nix/builds/nix-54793-2990173905/source/src/mcptoon/skill/SKILL.md').resolve31 >32 > tests/test_skill_package.py:86: AssertionError33 > =========================== short test summary info ============================34 > FAILED tests/test_skill_package.py::TestThreeCopiesAgree::test_packaged_path_resolves_to_the_copy_on_disk - AssertionError: assert PosixPath('/nix/store/blpnwjl37fs9hgx20n75n97zjfmqrd...35 > ===== 1 failed, 1739 passed, 12 skipped, 3 deselected in 86.87s (0:01:26) ======36 For full logs, run:37 nix log /nix/store/wcrlw81zjjfzqcvl48c4z45sdzdgxzwx-mcptoon-0.8.7.drv38error: Cannot build '/nix/store/wcrlw81zjjfzqcvl48c4z45sdzdgxzwx-mcptoon-0.8.7.drv'.39 Reason: builder failed with exit code 1.40 Output paths:41 /nix/store/blpnwjl37fs9hgx20n75n97zjfmqrd06-mcptoon-0.8.742 /nix/store/k7xfh1v1x5wphzma6ab23xhy4458wyx2-mcptoon-0.8.7-dist43error: Cannot build '/nix/store/9h6h2zg6ds2mmp0sncdpdlkxy2g74f66-check-mcptoon.drv'.44 Reason: 1 dependency failed.45 Output paths:46 /nix/store/5bpb9j3mkfsvlssb3xipy07ldb06qnni-check-mcptoon