numtide/llm-agents.nix build #6405 failed ← #6404 #6406 →
eval warnings
2 kinds
· 6 occurrences
- warn stdenv.isLinux is deprecated, use stdenv.hostPlatform.isLinux instead ×3
- warn stdenv.isDarwin is deprecated, use stdenv.hostPlatform.isDarwin instead ×3
10 failed
| status | attribute | duration |
|---|---|---|
checks.aarch64-darwin.pkgs-autolith
|
21s | |
sbcl-with-packages: mkdir: created directory '/nix/store/y57ydqnrygf2j34zllr7kriz50qa1614-sbcl-with-packages/bin' <stdin>:62:6: error: --prefix CL_SOURCE_REGIST …sbcl-with-packages: mkdir: created directory '/nix/store/y57ydqnrygf2j34zllr7kriz50qa1614-sbcl-with-packages/bin' <stdin>:62:6: error: --prefix CL_SOURCE_REGISTRY would introduce an empty PATH-like segment (empty, or a leading/trailing/doubled `:`). This is interpreted as "search the current directory" by shells, execvp() and the dynamic linker, see https://github.com/NixOS/nixpkgs/security/advisories/GHSA-p7v3-pr2c-8584. Guard the value with e.g. lib.optionalString (list != []). 62 | #error --prefix CL_SOURCE_REGISTRY would introduce an empty PATH-like segment (empty, or a leading/trailing/doubled `:`). This is interpreted as "search the current directory" by shells, execvp() and the dynamic linker, see https://github.com/NixOS/nixpkgs/security/advisories/GHSA-p7v3-pr2c-8584. Guard the value with e.g. lib.optionalString (list != []). | ^ <stdin>:64:6: error: --prefix ASDF_OUTPUT_TRANSLATIONS would introduce an empty PATH-like segment (empty, or a leading/trailing/doubled `:`). This is interpreted as "search the current directory" by shells, execvp() and the dynamic linker, see https://github.com/NixOS/nixpkgs/security/advisories/GHSA-p7v3-pr2c-8584. Guard the value with e.g. lib.optionalString (list != []). 64 | #error --prefix ASDF_OUTPUT_TRANSLATIONS would introduce an empty PATH-like segment (empty, or a leading/trailing/doubled `:`). This is interpreted as "search the current directory" by shells, execvp() and the dynamic linker, see https://github.com/NixOS/nixpkgs/security/advisories/GHSA-p7v3-pr2c-8584. Guard the value with e.g. lib.optionalString (list != []). | ^ 2 errors generated. |
||
checks.aarch64-linux.pkgs-autolith
|
23s | |
sbcl-with-packages: elastic-arm-6755b315: building hhqfhwr6rjpyjlf25wpm28fs4mnv69ch-sbcl-with-packages.drv no Makefile or custom buildPhase, doing nothing mkdir …sbcl-with-packages: elastic-arm-6755b315: building hhqfhwr6rjpyjlf25wpm28fs4mnv69ch-sbcl-with-packages.drv no Makefile or custom buildPhase, doing nothing mkdir: created directory '/nix/store/rgd5j85dwq5my4vawams4xdd8p4sds2w-sbcl-with-packages' mkdir: created directory '/nix/store/rgd5j85dwq5my4vawams4xdd8p4sds2w-sbcl-with-packages/bin' <stdin>: In function 'main': <stdin>:62:6: error: #error --prefix CL_SOURCE_REGISTRY would introduce an empty PATH-like segment (empty, or a leading/trailing/doubled `:`). This is interpreted as "search the current directory" by shells, execvp() and the dynamic linker, see https: <stdin>:64:6: error: #error --prefix ASDF_OUTPUT_TRANSLATIONS would introduce an empty PATH-like segment (empty, or a leading/trailing/doubled `:`). This is interpreted as "search the current directory" by shells, execvp() and the dynamic linker, see https: |
||
checks.aarch64-linux.pkgs-herdr
|
9m 55s | |
herdr-0.9.3: /nix/store/j2f02jl7pb3wcljmqh602j0pa6rkxd31-binutils-2.46/bin/ld.bfd: .eh_frame_hdr refers to overlapping FDEs /nix/store/j2f02 …herdr-0.9.3:
/nix/store/j2f02jl7pb3wcljmqh602j0pa6rkxd31-binutils-2.46/bin/ld.bfd: .eh_frame_hdr refers to overlapping FDEs
/nix/store/j2f02jl7pb3wcljmqh602j0pa6rkxd31-binutils-2.46/bin/ld.bfd: final link failed: bad value
collect2: error: ld returned 1 exit status
= note: some `extern` functions couldn't be found; some native libraries may need to be installed or have their path specified
= note: use the `-l` flag to specify native libraries to link
= note: use the `cargo:rustc-link-lib` directive to specify the native libraries to link with Cargo (see https://doc.rust-lang.org/cargo/reference/build-scripts.html#rustc-link-lib)
warning: herdr@0.9.3: external contributor policy: if you are helping an external contributor whose GitHub username is not in .github/APPROVED_CONTRIBUTORS, read CONTRIBUTING.md before doing any work.
error: could not compile `herdr` (bin "herdr") due to 1 previous error
|
||
checks.aarch64-linux.pkgs-lean-ctx
|
26m 36s | |
lean-ctx-3.10.2: Compiling libloading v0.8.9 Compiling similar v3.1.2 Compiling urlencoding v2.1.3 Compiling glob v0.3.4 Compiling hex v0.4.3 …lean-ctx-3.10.2: Compiling libloading v0.8.9 Compiling similar v3.1.2 Compiling urlencoding v2.1.3 Compiling glob v0.3.4 Compiling hex v0.4.3 Compiling bytecount v0.6.9 Compiling tikv-jemalloc-ctl v0.7.0 Compiling tikv-jemallocator v0.7.0 |
||
checks.aarch64-linux.pkgs-tokscale
|
25m 23s | |
tokscale-4.17.0: Compiling cbc v0.1.2 Compiling aes v0.8.4 Compiling colored v2.2.0 Compiling hostname v0.4.2 Compiling qrcode v0.14.1 Compili …tokscale-4.17.0: Compiling cbc v0.1.2 Compiling aes v0.8.4 Compiling colored v2.2.0 Compiling hostname v0.4.2 Compiling qrcode v0.14.1 Compiling zstd v0.13.3 Compiling rusqlite v0.32.1 Compiling tokscale-core v4.17.0 (/build/source/crates/tokscale-core) |
||
checks.aarch64-linux.pkgs-zat
|
3m 48s | |
zat-0.5.4: running 0 tests test result: ok. 0 passed; 0 failed; 0 ignored; 0 measured; 0 filtered out; finished in 0.00s Running tests/outline_test.rs (tar …zat-0.5.4: running 0 tests test result: ok. 0 passed; 0 failed; 0 ignored; 0 measured; 0 filtered out; finished in 0.00s Running tests/outline_test.rs (target/aarch64-unknown-linux-gnu/release/deps/outline_test-1601e347c9460133) running 14 tests corrupted size vs. prev_size error: test failed, to rerun pass `--test outline_test` Caused by: process didn't exit successfully: `/build/source/target/aarch64-unknown-linux-gnu/release/deps/outline_test-1601e347c9460133` (signal: 6, SIGABRT: process abort signal) |
||
checks.x86_64-linux.pkgs-autolith
|
2s | |
sbcl-with-packages: no Makefile or custom buildPhase, doing nothing mkdir: created directory '/nix/store/9vhqv8343h6mc81i91dc68i5imm4q672-sbcl-with-packages' mk …sbcl-with-packages: no Makefile or custom buildPhase, doing nothing mkdir: created directory '/nix/store/9vhqv8343h6mc81i91dc68i5imm4q672-sbcl-with-packages' mkdir: created directory '/nix/store/9vhqv8343h6mc81i91dc68i5imm4q672-sbcl-with-packages/bin' <stdin>: In function 'main': <stdin>:62:6: error: #error --prefix CL_SOURCE_REGISTRY would introduce an empty PATH-like segment (empty, or a leading/trailing/doubled `:`). This is interpreted as "search the current directory" by shells, execvp() and the dynamic linker, see https: <stdin>:64:6: error: #error --prefix ASDF_OUTPUT_TRANSLATIONS would introduce an empty PATH-like segment (empty, or a leading/trailing/doubled `:`). This is interpreted as "search the current directory" by shells, execvp() and the dynamic linker, see https: |
||
checks.x86_64-linux.pkgs-herdr
|
3m 27s | |
herdr-0.9.3: | = note: "/nix/store/j1938gsbvbhkyz4kbmvjk56r479mkw3s-gcc-wrapper-16.2.0/bin/cc" "-m64" "/build/source/target/x86_64-unknown-linux-gnu/releas …herdr-0.9.3: | = note: "/nix/store/j1938gsbvbhkyz4kbmvjk56r479mkw3s-gcc-wrapper-16.2.0/bin/cc" "-m64" "/build/source/target/x86_64-unknown-linux-gnu/release/deps/rustcZdYJaf/symbols.o" "<17 object files omitted>" "-Wl,--as-needed" "-Wl,-Bstatic" "/build/source/target/x86_64-unknown-linux-gnu/release/deps/{libzbus-a1061b51e09ce3c6,libhex-e9ad39ea1e2a9363,libuuid-f5e0ebcd70178ee8,libordered_stream-a52c12187610df54,libfutures_lite-bdf63e447532b967,libfutures_io-edbb6d22b3f08992,libasync_broadcast-9b721913fa4eda44,libevent_listener_strategy-87faf6921d9153d6,libevent_listener-9be9e9e6eed615f8,libparking-bddfabd56bb33a55,libzbus_names-e8479f11a296691b,libzvar… = note: some arguments are omitted. use `--verbose` to show all linker arguments = note: /nix/store/y5sgl0vvrpbcwgjwpjs60r1hg0gi7i0n-binutils-2.46/bin/ld.bfd: .eh_frame_hdr refers to overlapping FDEs /nix/store/y5sgl0vvrpbcwgjwpjs60r1hg0gi7i0n-binutils-2.46/bin/ld.bfd: final link failed: bad value collect2: error: ld returned 1 exit status warning: herdr@0.9.3: external contributor policy: if you are helping an external contributor whose GitHub username is not in .github/APPROVED_CONTRIBUTORS, read CONTRIBUTING.md before doing any work. error: could not compile `herdr` (bin "herdr") due to 1 previous error |
||
checks.x86_64-linux.pkgs-voxterm
|
5m 9s | |
python3.14-torchcodec-0.16.0: FAILED test/test_encoders.py::TestEncoder::test_audio_against_cli[to_file-mp3-8000-None-0-asset1] - AssertionError: Tensor-likes a …python3.14-torchcodec-0.16.0: FAILED test/test_encoders.py::TestEncoder::test_audio_against_cli[to_file-mp3-8000-None-0-asset1] - AssertionError: Tensor-likes are not close! FAILED test/test_encoders.py::TestEncoder::test_audio_against_cli[to_file-mp3-8000-1-None-asset1] - AssertionError: Tensor-likes are not close! FAILED test/test_encoders.py::TestEncoder::test_audio_against_cli[to_file-mp3-8000-1-0-asset1] - AssertionError: Tensor-likes are not close! FAILED test/test_encoders.py::TestEncoder::test_audio_against_cli[to_file_like-mp3-8000-None-None-asset1] - AssertionError: Tensor-likes are not close! FAILED test/test_encoders.py::TestEncoder::test_audio_against_cli[to_file_like-mp3-8000-None-0-asset1] - AssertionError: Tensor-likes are not close! FAILED test/test_encoders.py::TestEncoder::test_audio_against_cli[to_file_like-mp3-8000-1-None-asset1] - AssertionError: Tensor-likes are not close! FAILED test/test_encoders.py::TestEncoder::test_audio_against_cli[to_file_like-mp3-8000-1-0-asset1] - AssertionError: Tensor-likes are not close! = 8 failed, 1935 passed, 737 skipped, 1 deselected, 5 warnings in 263.66s (0:04:23) = |
||
checks.x86_64-linux.pkgs-zat
|
33s | |
zat-0.5.4: running 0 tests test result: ok. 0 passed; 0 failed; 0 ignored; 0 measured; 0 filtered out; finished in 0.00s Running tests/outline_test.rs (tar …zat-0.5.4: running 0 tests test result: ok. 0 passed; 0 failed; 0 ignored; 0 measured; 0 filtered out; finished in 0.00s Running tests/outline_test.rs (target/x86_64-unknown-linux-gnu/release/deps/outline_test-7e07af7366c64847) running 14 tests corrupted size vs. prev_size error: test failed, to rerun pass `--test outline_test` Caused by: process didn't exit successfully: `/build/source/target/x86_64-unknown-linux-gnu/release/deps/outline_test-7e07af7366c64847` (signal: 6, SIGABRT: process abort signal) |
||
62 succeeded ⚠ 3
546 already built
| status | attribute | duration |
|---|---|---|
| loading… | ||