nixbot

builds
1Using versionCheckHook
unpackPhase
2unpacking source archive /nix/store/jw52n2nhhw87lnbmdnck0v7ddzbzg34f-source3source root is source4Executing cargoSetupPostUnpackHook5Finished cargoSetupPostUnpackHook
patchPhase
6Executing cargoSetupPostPatchHook7Validating consistency between /nix/var/nix/builds/nix-28177-3218472384/source/Cargo.lock and /nix/var/nix/builds/nix-28177-3218472384/luvus-0.14.3-vendor/Cargo.lock8Finished cargoSetupPostPatchHook
buildPhase
9Executing cargoBuildHook10cargoBuildHook flags: -j 10 --target aarch64-apple-darwin --offline --profile release11 Compiling proc-macro2 v1.0.10612 Compiling unicode-ident v1.0.2413 Compiling quote v1.0.4514 Compiling libc v0.2.18615 Compiling serde_core v1.0.22816 Compiling cfg-if v1.0.417 Compiling itoa v1.0.1818 Compiling log v0.4.3319 Compiling serde v1.0.22820 Compiling allocator-api2 v0.2.2121 Compiling foldhash v0.2.022 Compiling equivalent v1.0.223 Compiling version_check v0.9.524 Compiling bytes v1.12.125 Compiling thiserror v2.0.1826 Compiling smallvec v1.15.227 Compiling generic-array v0.14.728 Compiling rustversion v1.0.2229 Compiling typenum v1.20.130 Compiling futures-core v0.3.3231 Compiling hashbrown v0.17.132 Compiling pin-project-lite v0.2.1733 Compiling getrandom v0.3.434 Compiling ident_case v1.0.135 Compiling rustix v1.1.436 Compiling zerocopy v0.8.5737 Compiling strsim v0.11.138 Compiling http v1.5.039 Compiling syn v2.0.11840 Compiling syn v3.0.641 Compiling either v1.16.042 Compiling httparse v1.10.143 Compiling heck v0.5.044 Compiling parking_lot_core v0.9.1245 Compiling unicode-width v0.2.246 Compiling memchr v2.8.247 Compiling itertools v0.14.048 Compiling castaway v0.2.449 Compiling hashbrown v0.16.150 Compiling block-buffer v0.10.451 Compiling crypto-common v0.1.752 Compiling unicode-segmentation v1.13.353 Compiling errno v0.3.1454 Compiling signal-hook-registry v1.4.855 Compiling mio v1.2.156 Compiling socket2 v0.6.557 Compiling static_assertions v1.1.058 Compiling signal-hook v0.3.1859 Compiling scopeguard v1.2.060 Compiling instability v0.3.1261 Compiling ryu v1.0.2362 Compiling lock_api v0.4.1463 Compiling compact_str v0.9.164 Compiling rand_core v0.9.565 Compiling convert_case v0.10.066 Compiling http-body v1.1.067 Compiling cpufeatures v0.2.1768 Compiling digest v0.10.769 Compiling lru v0.18.070 Compiling indoc v2.0.771 Compiling critical-section v1.2.072 Compiling parking_lot v0.12.573 Compiling num_threads v0.1.774 Compiling num-conv v0.2.275 Compiling tower-service v0.3.376 Compiling futures-sink v0.3.3477 Compiling powerfmt v0.2.078 Compiling deranged v0.5.879 Compiling time-core v0.1.980 Compiling cfg_aliases v0.1.181 Compiling slab v0.4.1282 Compiling thiserror v1.0.6983 Compiling litrs v1.0.084 Compiling futures-task v0.3.3285 Compiling nix v0.28.086 Compiling signal-hook-mio v0.2.587 Compiling sha1 v0.10.788 Compiling futures-channel v0.3.3289 Compiling anyhow v1.0.10490 Compiling data-encoding v2.11.191 Compiling atomic-waker v1.1.292 Compiling httpdate v1.0.393 Compiling zmij v1.0.2194 Compiling document-features v0.2.1295 Compiling tower-layer v0.3.396 Compiling sync_wrapper v1.0.297 Compiling bitflags v2.13.098 Compiling signal-hook v0.4.499 Compiling unicode-truncate v2.0.1100 Compiling line-clipping v0.3.7101 Compiling http-body-util v0.1.5102 Compiling aho-corasick v1.1.4103 Compiling indexmap v2.14.0104 Compiling virtue v0.0.18105 Compiling cursor-icon v1.2.0106 Compiling pulldown-cmark v0.13.4107 Compiling winnow v0.7.15108 Compiling time v0.3.49109 Compiling toml_write v0.1.2110 Compiling base64 v0.22.1111 Compiling tokio-macros v2.7.2112 Compiling regex-syntax v0.8.11113 Compiling tokio v1.53.1114 Compiling darling_core v0.23.0115 Compiling casefold v0.1.0116 Compiling mime v0.3.17117 Compiling serde_json v1.0.150118 Compiling serde_derive v1.0.228119 Compiling thiserror-impl v2.0.18120 Compiling strum_macros v0.28.0121 Compiling futures-macro v0.3.32122 Compiling kasuari v0.4.12123 Compiling derive_more-impl v2.1.1124 Compiling ppv-lite86 v0.2.21125 Compiling futures-util v0.3.32126 Compiling rand_chacha v0.9.0127 Compiling derive_more v2.1.1128 Compiling rand v0.9.5129 Compiling thiserror-impl v1.0.69130 Compiling strum v0.28.0131 Compiling rustix-openpty v0.2.0132 Compiling polling v3.11.0133 Compiling darling_macro v0.23.0134 Compiling ratatui-core v0.1.2135 Compiling darling v0.23.0136 Compiling regex-automata v0.4.14137 Compiling tungstenite v0.29.0138 Compiling filedescriptor v0.8.3139 Compiling axum-core v0.5.6140 Compiling bincode_derive v2.0.1141 Compiling crossterm v0.29.0142 Compiling ratatui-widgets v0.3.2143 Compiling serde_spanned v0.6.9144 Compiling toml_datetime v0.6.11145 Compiling arrayvec v0.7.7146 Compiling toml_edit v0.22.27147 Compiling luvus-vte v0.15.0 (/nix/var/nix/builds/nix-28177-3218472384/source/vendor/vte)148 Compiling serial2 v0.2.37149 Compiling downcast-rs v1.2.1150 Compiling unicase v2.9.0151 Compiling unty v0.0.4152 Compiling shell-words v1.1.1153 Compiling doctest-file v1.1.1154 Compiling matchit v0.8.4155 Compiling home v0.5.12156 Compiling percent-encoding v2.3.2157 Compiling jiff-core v0.1.0158 Compiling ratatui-crossterm v0.1.2159 Compiling luvus v0.14.3 (/nix/var/nix/builds/nix-28177-3218472384/source)160 Compiling interprocess v2.4.2161 Compiling hyper v1.11.1162 Compiling tower v0.5.3163 Compiling tokio-tungstenite v0.29.0164 Compiling ratatui-macros v0.7.2165 Compiling ratatui v0.30.2166 Compiling portable-pty v0.9.0167 Compiling bincode v2.0.1168 Compiling jiff v0.2.35169 Compiling sha2 v0.10.9170 Compiling hyper-util v0.1.20171 Compiling axum v0.8.9172 Compiling fs2 v0.4.3173 Compiling semver v1.0.28174 Compiling luvus-alacritty-terminal v0.26.1 (/nix/var/nix/builds/nix-28177-3218472384/source/vendor/alacritty_terminal)175 Compiling toml v0.8.23176 Finished `release` profile [optimized] target(s) in 4m 27s177Executing cargoInstallPostBuildHook178Finished cargoInstallPostBuildHook179Finished cargoBuildHook180buildPhase completed in 4 minutes 27 seconds
checkPhase
181Executing cargoCheckHook182cargoCheckHook flags: -j 10 --profile release --target aarch64-apple-darwin --offline -- --test-threads=1 --skip=app::tests::clicking_a_pane_title_shows_the_real_command --skip=app::tests::keyboard_copy_mode_yanks_history_and_cancel_restores_its_viewport --skip=app::tests::keyboard_copy_word_navigation_uses_visual_columns --skip=app::files::tests::previewing_from_a_dashboard_tab_opens_a_tab_and_still_reuses_it --skip=app::tests::resize_yields_to_pane_title_and_zoom_but_still_grabs_the_seam --skip=app::tests::resume_session_opens_pane --skip=platform::tests::process_tree_finds_this_process_and_its_children --skip=app::settings::tests::enter_routes_an_installed_theme_through_removal --skip=app::diff::tests::dashboard_diff_click_opens_a_tab_then_reuses_it --skip=platform::tests::unix_stoppable_pid_accepts_a_luvus_executable_with_arguments --skip=app::files::tests::files_show_hidden_defaults_on_and_the_setting_persists --skip=platform::tests::pane_runtime_scan_projects_cwd_and_commands_from_one_snapshot183 Compiling luvus v0.14.3 (/nix/var/nix/builds/nix-28177-3218472384/source)184 Finished `release` profile [optimized] target(s) in 7m 57s185 Running unittests src/main.rs (target/aarch64-apple-darwin/release/deps/luvus-3c849a5bf5ebebf2)186187running 2356 tests188test agent::antigravity::integration::tests::hook_accepts_only_bounded_resumable_conversations ... ok189test agent::antigravity::integration::tests::install_is_idempotent_and_uninstall_preserves_other_hooks ... ok190test agent::antigravity::integration::tests::malformed_or_colliding_config_is_never_replaced ... ok191test agent::antigravity::integration::tests::managed_block_requires_the_exact_generated_shape ... ok192test agent::antigravity::integration::tests::oversized_hook_input_stops_at_the_bound ... ok193test agent::antigravity::integration::tests::uninstall_preserves_unmanaged_block_and_referenced_script ... ok194test agent::antigravity::sessions::tests::reads_the_documented_workspace_conversation_cache ... ok195test agent::antigravity::sessions::tests::rejects_malformed_oversized_and_unsafe_cache_data ... ok196test agent::codex::integration::tests::a_refused_or_unreachable_pane_claim_falls_back_to_evidence ... ok197test agent::codex::integration::tests::codex_shared_server_is_recognized_among_ancestors ... ok198test agent::codex::integration::tests::evidence_commits_only_to_one_server_with_one_match ... ok199test agent::codex::integration::tests::hook_reports_session_start_and_prompts_with_their_evidence ... ok200test agent::codex::integration::tests::installed_script_calls_the_installing_binary_and_quotes_it ... ok201test agent::codex::sessions::tests::a_pane_title_names_the_one_thread_in_its_directory_with_that_name ... ok202test agent::devin::integration::tests::edited_managed_hook_blocks_reinstall_and_uninstall ... ok203test agent::devin::integration::tests::encoded_script_references_are_recognized_without_matching_other_tools ... ok204test agent::devin::integration::tests::hook_accepts_only_bounded_session_start_ids ... ok205test agent::devin::integration::tests::hook_runs_only_inside_a_luvus_pane_started_by_devin ... ok206test agent::devin::integration::tests::install_and_uninstall_keep_a_private_config_private ... ok207test agent::devin::integration::tests::install_is_idempotent_and_uninstall_preserves_user_settings ... ok208test agent::devin::integration::tests::install_writes_only_events_devin_accepts ... ok209test agent::devin::integration::tests::malformed_jsonc_and_colliding_settings_are_preserved ... ok210test agent::devin::integration::tests::modified_owned_script_is_never_replaced_or_deleted ... ok211test agent::devin::integration::tests::oversized_hook_input_stops_at_the_bound ... ok212test agent::devin::integration::tests::symlinked_config_is_refused_before_any_change ... ok213test agent::devin::integration::tests::uninstall_removes_owned_command_after_mutable_hook_edits ... ok214test agent::devin::integration::tests::windows_hook_command_keeps_the_script_path_literal ... ok215test agent::hermes::integration::tests::config_edit_handles_missing_empty_and_flat_plugin_sections ... ok216test agent::hermes::integration::tests::config_edit_preserves_four_space_nested_indentation ... ok217test agent::hermes::integration::tests::config_edit_preserves_other_plugins_and_removes_a_disabled_entry ... ok218test agent::hermes::integration::tests::config_edit_refuses_ambiguous_inline_lists ... ok219test agent::hermes::integration::tests::install_and_uninstall_touch_only_the_managed_hermes_plugin ... ok220test agent::hermes::integration::tests::plugin_reports_each_session_once_and_hides_windows_processes ... ok221test agent::letta::integration::tests::hook_accepts_only_bounded_session_start_conversations ... ok222test agent::letta::integration::tests::install_is_idempotent_and_uninstall_preserves_user_settings ... ok223test agent::letta::integration::tests::malformed_and_colliding_settings_are_preserved ... ok224test agent::letta::integration::tests::modified_owned_script_is_never_replaced_or_deleted ... ok225test agent::letta::integration::tests::oversized_hook_input_stops_at_the_bound ... ok226test agent::letta::integration::tests::uninstall_removes_owned_command_after_mutable_hook_edits ... ok227test agent::muse::tests::discovers_native_sessions_by_metadata_not_directory_name ... ok228test agent::muse::tests::metadata_workspace_outranks_earlier_route_facts ... ok229test agent::muse::tests::recent_uses_platform_path_identity ... ok230test agent::muse::tests::rejects_malformed_session_metadata ... ok231test agent::muse::tests::versioned_binary_requires_a_numeric_release ... ok232test agent::omp::tests::profile_and_override_paths_follow_omp_precedence ... ok233test agent::opencode::config::tests::adds_a_missing_plugin_property_to_empty_and_populated_objects ... ok234test agent::opencode::config::tests::edits_plugin_entry_without_losing_jsonc_comments_or_neighbors ... ok235test agent::opencode::config::tests::migrates_owned_legacy_and_duplicate_entries_only ... ok236test agent::opencode::config::tests::refuses_ambiguous_or_unbounded_configuration ... ok237test agent::opencode::config::tests::rejects_invalid_scalars_and_nested_jsonc_before_editing ... ok238test agent::opencode::integration::tests::executable_generation_outranks_stale_legacy_config ... ok239test agent::opencode::integration::tests::existing_plugin_read_errors_stop_before_config_mutation ... ok240test agent::opencode::integration::tests::explicit_config_does_not_create_the_default_opencode_directory ... ok241test agent::opencode::integration::tests::install_is_idempotent_and_uninstall_preserves_unrelated_config ... ok242test agent::opencode::integration::tests::install_uses_the_effective_jsonc_or_explicit_tui_config ... ok243test agent::opencode::integration::tests::invalid_config_fails_before_writing_the_plugin ... ok244test agent::opencode::integration::tests::managed_asset_fingerprint_tracks_embedded_plugin ... ok245test agent::opencode::integration::tests::parses_released_and_preview_version_output ... ok246test agent::opencode::integration::tests::uninstall_preserves_modified_legacy_assets ... ok247test agent::opencode::v2_integration::tests::report_for_accepts_both_session_directory_shapes ... ok248test agent::opencode::v2_integration::tests::reporter_retries_releases_and_prefers_the_newest_session ... ok249test agent::opencode::v2_integration::tests::v2_cli_install_is_surgical_idempotent_and_rejects_invalid_config ... ok250test agent::registry::tests::aliases_resolve_to_the_canonical_descriptor ... ok251test agent::registry::tests::automation_capabilities_are_explicit_per_agent_and_access_level ... ok252test agent::registry::tests::builtin_identity_projection_preserves_the_native_table ... ok253test agent::registry::tests::builtins_have_unique_ids_and_aliases ... ok254test agent::registry::tests::interpreter_package_identities_are_unique ... ok255test agent::registry::tests::native_capability_projection_preserves_current_support ... ok256test agent::registry::tests::omp_precedes_pi_with_stronger_overlap_priority ... ok257test agent::registry::tests::remote_sandbox_agent_is_not_a_local_task_worker ... ok258test agent::shared::chat_store::tests::recent_skips_a_newer_invalid_session_file ... ok259test agent::tests::claude_encodes_cwd_and_picks_newest ... ok260test agent::tests::claude_project_dir_encodes_every_non_alphanumeric ... ok261test agent::tests::claude_recent_reads_cwd_from_transcript ... ok262test agent::tests::codex_discovers_rollout_session_by_cwd ... ok263test agent::tests::codex_fork_requires_the_selected_session_identity ... ok264test agent::tests::copilot_matches_cwd_from_workspace_yaml ... ok265test agent::tests::copilot_recent_dedups_by_project ... ok266test agent::tests::fork_commands ... ok267test agent::tests::fx_sessions_use_native_workspace_metadata ... ok268test agent::tests::gemini_style_sessions_are_scoped_by_project_root ... ok269test agent::tests::grok_discovers_session_by_cwd_dir ... ok270test agent::tests::kimi_discovers_session_by_workdir_from_index ... ok271test agent::tests::launch_flag_filter_drops_session_selection ... ok272test agent::tests::omp_discovers_pi_layout_sessions_and_resumes_with_omp_flag ... ok273test agent::tests::omp_reads_sessions_with_a_title_slot_before_the_header ... ok274test agent::tests::opencode_discovers_session_by_directory ... ok275test agent::tests::percent_decode_handles_paths_and_bad_escapes ... ok276test agent::tests::pi_discovers_session_by_cwd_from_header ... ok277test agent::tests::resume_command_with_flags_appends_kept_flags ... ok278test agent::tests::resume_commands ... ok279test agent::tests::resume_for_honours_the_setting_and_missing_flags ... ok280test agent::usage::tests::bounded_jsonl_skips_oversized_records_and_keeps_following_usage ... ok281test agent::usage::tests::claude_deduplicates_replayed_message_ids ... ok282test agent::usage::tests::codex_usage_is_recovered_from_bounded_head_and_tail_windows ... ok283test agent::usage::tests::codex_uses_latest_cumulative_counter_and_real_window ... ok284test agent::usage::tests::copilot_sums_each_shutdown_ledger_once ... ok285test agent::usage::tests::gemini_and_fx_use_native_aggregate_shapes ... ok286test agent::usage::tests::grok_sums_unique_turn_ledgers_and_exact_ticks ... ok287test agent::usage::tests::kimi_and_pi_map_disjoint_token_buckets ... ok288test agent::usage::tests::omp_usage_uses_its_native_session_root ... ok289test agent::usage::tests::unsupported_agents_never_receive_guessed_usage ... ok290test api::capabilities::tests::registry_has_no_duplicates_and_contains_required_surface ... ok291test api::host::tests::host_profile_lists_and_deletes_only_confirmed_named_sessions ... ok292test api::host::tests::host_profile_rejects_session_tokens_and_preserves_session_forwarding ... ok293test api::host::tests::host_profile_reports_info_and_requires_confirmation_for_mutations ... ok294test api::schema::tests::agent_session_title_contract_is_shared_by_every_projection ... ok295test api::schema::tests::general_event_catalog_tracks_task_worker_payloads ... ok296test api::schema::tests::pane_list_request_contract_exposes_boolean_all_tabs_scope ... ok297test api::schema::tests::published_fixture_manifest_tracks_version_and_line_counts ... ok298test api::schema::tests::schema_bundle_publishes_one_uhp_contract_with_terminal_components ... ok299test api::schema::tests::schema_bundle_publishes_the_general_event_catalog ... ok300test api::schema::tests::schema_method_enum_tracks_registry ... ok301test api::schema::tests::task_prompt_request_contract_is_bounded_and_editable ... ok302test api::schema::tests::task_start_request_contract_can_preserve_focus ... ok303test app::automation::tests::active_agent_run_delivers_without_creating_an_orch_worker ... ok304test app::automation::tests::active_agent_skip_does_not_wait_for_a_busy_agent ... ok305test app::automation::tests::active_agent_wait_is_woken_only_by_that_panes_state_change ... ok306test app::automation::tests::active_checkpoint_revalidates_cancel_busy_identity_and_storage_failure ... ok307test app::automation::tests::automation_task_mirrors_agent_attention_without_approving_it ... ok308test app::automation::tests::closing_an_automation_worker_pane_fails_its_task_and_run ... ok309test app::automation::tests::deferred_worktree_failure_updates_linked_task_and_notifies ... ok310test app::automation::tests::durable_pending_run_waits_instead_of_disabling_on_stale_route ... ok311test app::automation::tests::durable_target_rebinds_exact_native_session_and_refreshes_pending_route ... ok312test app::automation::tests::failed_readiness_scan_keeps_durable_target_needing_rebind ... ok313test app::automation::tests::manual_rebind_rejects_a_different_native_conversation ... ok314test app::automation::tests::reconciliation_fails_a_worker_from_the_previous_server_lifetime ... ok315test app::automation::tests::reconciliation_recovers_orch_provenance_without_duplicate_task ... ok316test app::automation::tests::reconciliation_retries_the_same_task_after_a_prelaunch_crash ... ok317test app::automation::tests::scheduled_run_without_workspace_does_not_create_orch_task ... ok318test app::automation::tests::skipped_overlap_and_advanced_deadline_are_persisted ... ok319test app::automation::tests::stale_active_agent_target_fails_and_disables_definition ... ok320test app::automation::tests::startup_reconciliation_expires_process_bound_targets ... ok321test app::automation::tests::worker_link_checkpoint_resumes_once_or_fails_closed ... ok322test app::automation::tests::worktree_provider_contention_keeps_automation_pending ... ok323test app::automation_persistence::tests::checkpoint_is_nonblocking_coalesces_and_fences_acknowledgements ... ok324test app::automation_persistence::tests::failed_checkpoint_rejects_effect_and_api_success_then_retries ... ok325test app::backend::tests::agent_osc_title_change_publishes_one_structural_event ... ok326test app::backend::tests::an_animated_title_icon_is_not_announced_as_a_title_change ... ok327test app::backend::tests::backend_create_defaults_to_restorable_without_changing_the_response_shape ... ok328test app::backend::tests::backend_create_restore_policy_requires_a_boolean ... ok329test app::backend::tests::inventory_is_global_and_stable_across_a_pane_move ... ok330test app::backend::tests::lifecycle_registration_handles_deferred_and_synchronous_panes_once ... ok331test app::backend::tests::logical_keys_are_strict_and_mode_aware ... ok332test app::backend::tests::missing_existing_and_closed_registration_paths_leave_consistent_state ... ok333test app::backend::tests::mutation_parameter_rejection_includes_not_started_evidence ... ok334test app::backend::tests::observe_target_is_identity_safe_bounded_and_focus_preserving ... ok335test app::backend::tests::process_inspection_returns_cached_identity_and_refreshes_when_dirty ... ok336test app::backend::tests::rearm_publishes_only_a_new_trailing_terminal_revision ... ok337test app::backend::tests::stale_generation_and_route_fail_closed ... ok338test app::backend::tests::synchronous_tab_terminal_supports_validate_capture_and_observe ... ok339test app::backend::tests::terminal_exit_reports_signal_unknown_and_explicit_close ... ok340test app::backend::tests::terminal_exit_reports_status_once_for_either_event_order ... ok341test app::backend::tests::workspace_open_and_resume_spawn_register_backend_terminals ... ok342test app::board::tests::a_gate_result_after_merge_leaves_the_task_merged ... ok343test app::board::tests::a_second_done_while_a_gate_runs_is_refused ... ok344test app::board::tests::agent_task_commands_follow_each_cli_prompt_contract ... ok345test app::board::tests::automation_agent_picker_keeps_all_launch_capable_agents_visible ... ok346test app::board::tests::automation_commands_use_reviewed_headless_access_profiles ... ok347test app::board::tests::automation_form_rejects_an_incompatible_visible_agent ... ok348test app::board::tests::automation_form_selects_a_live_agent_and_preserves_both_drafts ... ok349test app::board::tests::automation_form_shows_detected_timezone_beside_start ... ok350test app::board::tests::automation_view_is_keyboard_and_mouse_addressable ... ok351test app::board::tests::board_cursor_navigates_and_acts_on_the_selected_task ... ok352test app::board::tests::board_delete_removes_selected_queued_task ... ok353test app::board::tests::board_durable_target_waits_for_fresh_readiness_evidence ... ok354test app::board::tests::board_opens_focuses_and_closes ... ok355test app::board::tests::board_render_exposes_only_visible_stable_controls ... ok356test app::board::tests::closing_a_worker_pane_detaches_its_task ... ok357test app::board::tests::creation_form_preserves_independent_task_and_automation_drafts ... ok358test app::board::tests::creation_form_separates_task_and_automation_fields ... ok359test app::board::tests::creation_form_uses_tab_for_type_and_arrows_for_fields ... ok360test app::board::tests::deleting_a_blocked_task_cancels_its_running_gate ... ok361test app::board::tests::detail_overlay_opens_scrolls_and_closes ... ok362test app::board::tests::empty_wide_board_uses_the_detail_column_for_the_flow ... ok363test app::board::tests::failed_agent_submit_does_not_close_a_reused_worker ... ok364test app::board::tests::failed_agent_submit_rolls_back_new_worktree_and_selection ... ok365test app::board::tests::form_schedule_choices_parse_local_wall_clock_inputs ... ok366test app::board::tests::gate_command_cancellation_terminates_the_process_tree ... ok367test app::board::tests::gate_command_runner_reports_exit_and_output ... ok368test app::board::tests::gate_command_runner_terminates_a_detached_session ... ok369test app::board::tests::gate_detached_child_helper ... ok370test app::board::tests::gate_pass_marks_done_and_gate_fail_holds_at_review ... ok371test app::board::tests::immediate_task_form_honors_its_selected_run_mode ... ok372test app::board::tests::integration_conflict_blocks_and_reports_files_to_api ... ok373test app::board::tests::integration_result_persists_a_terminal_state_and_exact_commit ... ok374test app::board::tests::long_prompted_task_start_queues_only_a_short_deferred_shell_command ... ok375test app::board::tests::manual_agent_launch_keeps_the_briefing_out_of_the_shell_line ... ok376test app::board::tests::matching_gate_result_settles_a_temporarily_blocked_task ... ok377test app::board::tests::new_task_form_can_arm_a_timezone_safe_automation ... ok378test app::board::tests::new_task_form_creates_a_task_from_the_ui ... ok379test app::board::tests::new_task_form_requires_a_title ... ok380test app::board::tests::no_gate_completes_immediately ... ok381test app::board::tests::picker_start_stays_on_the_board ... ok382test app::board::tests::post_submit_failure_releases_claim_and_prepared_resources ... ok383test app::board::tests::reconcile_blocks_an_unprotected_legacy_overlap ... ok384test app::board::tests::reconcile_rebinds_workspace_workers_by_stable_tab_identity ... ok385test app::board::tests::reconcile_rebinds_worktree_tasks_and_requeues_dead_claims ... ok386test app::board::tests::reconcile_restores_a_missing_worker_lease ... ok387test app::board::tests::releasing_a_task_invalidates_its_running_gate ... ok388test app::board::tests::retry_attempts_receive_a_fresh_default_branch ... ok389test app::board::tests::retry_detaches_but_does_not_close_the_previous_worker_pane ... ok390test app::board::tests::saturated_context_blocks_completion ... ok391test app::board::tests::short_start_picker_scrolls_to_every_supported_agent ... ok392test app::board::tests::stale_gate_result_cannot_finish_a_retried_attempt ... ok393test app::board::tests::start_picker_agents_follow_the_builtin_registry ... ok394test app::board::tests::start_picker_opens_moves_and_cancels ... ok395test app::board::tests::task_agent_launch_queues_text_and_enter_as_one_submit ... ok396test app::board::tests::task_and_automation_prompt_shift_enter_insert_a_newline_without_submitting ... ok397test app::board::tests::task_menu_is_state_aware_and_keeps_its_original_task ... ok398test app::board::tests::task_start_adopts_a_leftover_worktree_for_its_branch ... ok399test app::board::tests::task_start_rejects_a_lease_conflict_before_spawning ... ok400test app::board::tests::task_start_rejects_persisted_worktree_from_another_requested_workspace ... ok401test app::board::tests::task_start_rejects_restored_terminal_controls_before_spawning ... ok402test app::board::tests::task_start_spawns_a_worktree_worker ... ok403test app::board::tests::task_start_without_focus_preserves_the_view_while_opening_a_worktree ... ok404test app::board::tests::task_start_workspace_creates_a_task_tab_without_a_worktree ... ok405test app::board::tests::wheel_scroll_moves_the_cursor_clamped ... ok406test app::board::tests::workspace_restart_rejects_an_explicit_different_project ... ok407test app::commander_tests::adjacent_mentions_share_only_their_following_segment ... ok408test app::commander_tests::adjacent_mentions_submit_one_command_to_four_shell_panes ... ok409test app::commander_tests::agent_prompt_and_shell_command_do_not_leak_across_segments ... ok410test app::commander_tests::an_earlier_running_action_still_reports_after_another_starts ... ok411test app::commander_tests::clicking_another_tab_works_while_the_strip_stays_open ... ok412test app::commander_tests::clicking_the_strip_in_prefix_mode_resumes_editing ... ok413test app::commander_tests::clicking_the_strip_restores_editing_without_blocking_pane_paste ... ok414test app::commander_tests::clipboard_image_is_discarded_when_draft_is_abandoned_or_edited_away ... ok415test app::commander_tests::clipboard_image_marker_moves_and_deletes_as_one_token ... ok416test app::commander_tests::commander_automation_agent_target_is_exact_and_cancel_returns_focus ... ok417test app::commander_tests::commander_module_action_writes_versioned_json_once_and_receives_completion ... ok418test app::commander_tests::commander_module_context_uses_the_target_workspace_not_active_workspace ... ok419test app::commander_tests::commander_module_failure_receipt_uses_the_matching_log ... ok420test app::commander_tests::commander_task_form_binds_workspace_and_reports_created_id ... ok421test app::commander_tests::custom_schedule_waits_for_space_before_next_field ... ok422test app::commander_tests::deleting_without_a_selection_clears_the_anchor ... ok423test app::commander_tests::delivered_image_path_survives_composer_close ... ok424test app::commander_tests::editing_chords_selection_and_clipboard_paste_stay_private ... ok425test app::commander_tests::escape_dismisses_the_prompt_and_shows_the_held_result ... ok426test app::commander_tests::escape_removes_a_cancelled_confirmation_prompt ... ok427test app::commander_tests::exact_shell_target_queues_one_atomic_command ... ok428test app::commander_tests::explicit_field_boundaries_win_over_field_words_in_title ... ok429test app::commander_tests::explicit_invalid_start_remains_a_validation_error ... ok430test app::commander_tests::full_draft_tab_does_not_move_cursor_after_rejected_insert ... ok431test app::commander_tests::guided_automation_validates_before_creating ... ok432test app::commander_tests::guided_task_keeps_its_workspace_after_switching_workspaces ... ok433test app::commander_tests::guided_task_stays_in_commander_then_creates_in_exact_workspace ... ok434test app::commander_tests::held_module_result_is_reported_when_the_confirmed_action_starts ... ok435test app::commander_tests::held_module_result_is_shown_once_an_edit_dismisses_the_prompt ... ok436test app::commander_tests::help_overlay_owns_keys_mouse_and_paste_above_the_composer ... ok437test app::commander_tests::inline_agent_automation_stays_in_commander_while_bare_target_opens_modal ... ok438test app::commander_tests::inline_automation_tab_cycles_start_and_timezone_then_creates ... ok439test app::commander_tests::inline_mentions_select_multiple_exact_panes_without_entering_the_message ... ok440test app::commander_tests::inline_task_fields_create_without_opening_the_modal ... ok441test app::commander_tests::inline_task_title_keeps_field_like_prose ... ok442test app::commander_tests::linked_module_catalog_refreshes_on_enable_and_unlink ... ok443test app::commander_tests::literal_arguments_and_escaped_mentions_remain_in_the_prompt ... ok444test app::commander_tests::module_commands_resolve_collisions_and_keep_body_mentions_literal ... ok445test app::commander_tests::module_completion_never_shares_the_footer_with_an_armed_prompt ... ok446test app::commander_tests::module_picker_cycles_and_accepts_one_separator_without_running ... ok447test app::commander_tests::module_tab_confirmation_does_not_retarget_after_rename ... ok448test app::commander_tests::module_targets_are_exact_and_confirmation_fails_closed_on_disable ... ok449test app::commander_tests::multiple_mentions_send_directly_without_changing_layout_or_focus ... ok450test app::commander_tests::named_scope_paths_resolve_one_pane_and_tab_completes_them ... ok451test app::commander_tests::parser_requires_explicit_targets_and_prompt ... ok452test app::commander_tests::partial_delivery_keeps_receipts_but_clears_mixed_draft ... ok453test app::commander_tests::paste_and_navigation_stay_in_composer ... ok454test app::commander_tests::prefix_enter_toggles_the_composer_without_discarding_it_on_send ... ok455test app::commander_tests::prefix_navigation_keeps_the_strip_visible_and_preserves_targets ... ok456test app::commander_tests::shell_target_rejects_multiline_and_agent_identity_drift ... ok457test app::commander_tests::shift_enter_opens_a_real_line_and_arrows_edit_that_line ... ok458test app::commander_tests::slash_actions_are_typed_and_unknown_names_never_reach_a_pane ... ok459test app::commander_tests::slash_after_target_reaches_a_ready_agent_pane ... ok460test app::commander_tests::slash_after_target_stays_literal_and_reaches_the_pane ... ok461test app::commander_tests::slash_enter_accepts_a_suggestion_before_dispatching ... ok462test app::commander_tests::slash_focus_uses_an_exact_pane_or_named_tab_without_sending_input ... ok463test app::commander_tests::slash_fork_rejects_a_shell_without_creating_a_pane ... ok464test app::commander_tests::slash_fork_reuses_the_native_agent_fork_handler ... ok465test app::commander_tests::slash_forms_and_docks_reuse_existing_controls ... ok466test app::commander_tests::slash_key_and_tab_complete_the_action_before_a_target ... ok467test app::commander_tests::slash_picker_arrows_pages_and_enter_select_without_editing_the_draft ... ok468test app::commander_tests::slash_picker_mouse_wheel_and_row_click_stay_out_of_underlying_panes ... ok469test app::commander_tests::slash_read_shows_bounded_output_and_task_opens_existing_form ... ok470test app::commander_tests::slash_split_requires_one_exact_live_pane_and_direction ... ok471test app::commander_tests::split_action_rejects_extra_text_before_mutating_layout ... ok472test app::commander_tests::split_actions_target_exact_panes_and_cannot_repeat_on_enter ... ok473test app::commander_tests::suggested_once_schedule_keeps_its_instant_after_timezone_changes ... ok474test app::commander_tests::tab_builds_active_agent_automation_fields_in_order ... ok475test app::commander_tests::tab_completes_slash_then_builds_task_fields_with_selected_agent ... ok476test app::commander_tests::tab_completes_the_typed_at_in_place_with_a_pane_name ... ok477test app::commander_tests::task_target_tab_stays_in_pane_choices_until_enter_accepts_it ... ok478test app::commander_tests::unicode_editing_and_word_delete_keep_valid_boundaries ... ok479test app::commander_tests::working_agent_requires_second_enter_unless_auto_send_and_blocked_never_sends ... ok480test app::config_persistence::tests::failed_explicit_patch_is_retained_and_newer_patch_wins ... ok481test app::config_persistence::tests::failed_explicit_patch_yields_to_newer_ui_edits_before_and_after_ack ... ok482test app::config_persistence::tests::later_delta_preserves_other_sessions_changes_after_old_write ... ok483test app::config_persistence::tests::refreshing_explicit_intent_preserves_unchanged_nulls_and_nested_siblings ... ok484test app::config_persistence::tests::reload_waits_for_accepted_settings_write ... ok485test app::config_persistence::tests::settings_coalesce_behind_slow_work_without_losing_newer_changes ... ok486test app::config_persistence::tests::shutdown_failed_receipt_yields_to_newer_ui_edits ... ok487test app::config_persistence::tests::shutdown_receipt_does_not_replay_a_saved_field_over_another_session ... ok488test app::config_persistence::tests::unadmitted_explicit_patch_yields_to_newer_ui_edits ... ok489test app::cwd::tests::cwd_changes_across_open_workspaces_keep_explicit_membership ... ok490test app::cwd::tests::is_subpath_treats_nested_folders_as_inside ... ok491test app::cwd::tests::pane_cwd_follows_cd_without_moving_its_workspace ... ok492test app::cwd::tests::scoped_cwd_scan_tracks_only_dirty_panes_and_their_workspaces ... ok493test app::cwd::tests::split_tab_stays_in_its_workspace_when_every_pane_changes_cwd ... ok494test app::cwd::tests::stable_descendant_cwd_updates_the_pane_without_rehoming ... ok495test app::cwd::tests::unmatched_git_cwd_does_not_create_a_workspace ... ok496test app::diff::tests::a_file_preview_takes_over_the_diff_preview_pane ... ok497test app::diff::tests::activating_a_stale_diff_row_refreshes_without_leaving_the_workspace ... ok498test app::diff::tests::changing_workspace_replaces_an_inflight_status_scan_and_clears_stale_rows ... ok499test app::diff::tests::clicking_saved_note_card_opens_that_note_in_the_inline_editor ... ok500test app::diff::tests::diff_api_status_scan_is_off_loop_and_cached_lists_answer_immediately ... ok501test app::diff::tests::diff_command_mounts_and_focuses_the_shared_dock ... ok502test app::diff::tests::diff_list_enter_opens_the_native_review_and_returns_pane_input ... ok503test app::diff::tests::diff_list_keyboard_skips_groups_and_controls_its_action_menu ... ok504test app::diff::tests::diff_preview_is_reused_only_inside_its_workspace ... ok505test app::diff::tests::diff_search_consumes_non_search_shortcuts_before_and_after_commit ... ok506test app::diff::tests::diff_view_left_and_right_repeat_source_side_selection ... ok507test app::diff::tests::diff_view_space_repeat_does_not_toggle_note_selection ... ok508test app::diff::tests::matching_diff_views_are_reused_only_inside_the_active_workspace ... ok509test app::diff::tests::normal_tab_diff_click_opens_a_pane_in_the_current_tab ... ok510test app::diff::tests::note_mode_supports_single_line_click_and_multi_line_drag ... ok511test app::diff::tests::opening_diff_from_context_menu_creates_a_native_leaf_without_a_pty ... ok512test app::diff::tests::preview_click_replaces_the_focused_diff_tab_in_place ... ok513test app::diff::tests::repeated_horizontal_navigation_stays_inside_the_selected_line ... ok514test app::diff::tests::split_wheel_scroll_maps_visible_rows_back_to_stack_selection ... ok515test app::dispatch::core::machine_catalog_notification_tests::catalog_revision_wakeup_coalesces_to_the_newest_commit ... ok516test app::dispatch::core::machine_catalog_notification_tests::catalog_revision_wakeup_rejects_invalid_payloads ... ok517test app::dispatch::orchestration::tests::worktree_remove_path_limit_counts_unicode_characters ... ok518test app::dispatch::tests::agents::a_session_report_from_outside_the_pane_is_refused ... ok519test app::dispatch::tests::agents::a_target_resolves_by_kind_when_unique_and_is_ambiguous_when_not ... ok520test app::dispatch::tests::agents::agent_fork_api_reports_validation_and_capability_errors ... ok521test app::dispatch::tests::agents::agent_fork_api_targets_an_inactive_tab_and_can_preserve_focus ... ok522test app::dispatch::tests::agents::agent_get_returns_one_agents_info ... ok523test app::dispatch::tests::agents::agent_keys_queues_valid_bytes_once_in_request_order ... ok524test app::dispatch::tests::agents::agent_keys_reports_a_closed_writer ... ok525test app::dispatch::tests::agents::agent_keys_requires_a_recognized_agent_before_sending ... ok526test app::dispatch::tests::agents::agent_keys_validates_the_entire_array_before_sending ... ok527test app::dispatch::tests::agents::agent_list_get_and_snapshot_report_the_same_session_title ... ok528test app::dispatch::tests::agents::agent_list_labels_a_pane_with_its_node_name ... ok529test app::dispatch::tests::agents::agent_list_rows_carry_a_stable_workspace_id ... ok530test app::dispatch::tests::agents::agent_name_aliases_a_pane_and_resolves_a_target ... ok531test app::dispatch::tests::agents::agent_name_grammar_is_cli_safe ... ok532test app::dispatch::tests::agents::agent_read_accepts_a_source ... ok533test app::dispatch::tests::agents::agent_read_visible_reports_the_live_screen_not_the_scrollback_viewport ... ok534test app::dispatch::tests::agents::agent_send_admits_one_ordered_submission_and_reports_closed_queue ... ok535test app::dispatch::tests::agents::agent_send_requires_a_live_agent ... ok536test app::dispatch::tests::agents::agent_session_title_falls_back_clears_and_bounds_like_the_snapshot ... ok537test app::dispatch::tests::agents::agent_wait_matches_each_state_and_reports_the_actual_transition ... ok538test app::dispatch::tests::agents::agent_wait_status_set_matches_current_state_and_times_out_bounded ... ok539test app::dispatch::tests::agents::atomic_agent_prompt_ignores_output_without_a_relevant_transition ... ok540test app::dispatch::tests::agents::atomic_agent_prompt_rejects_an_overlapping_wait_before_queueing ... ok541test app::dispatch::tests::agents::atomic_agent_prompt_reports_queued_timeout_without_resubmitting ... ok542test app::dispatch::tests::agents::closing_a_workspace_cancels_parked_waiters ... ok543test app::dispatch::tests::agents::content_fence_closed_writer_is_send_failed ... ok544test app::dispatch::tests::agents::content_fence_invalid_keys_validate_before_comparison ... ok545test app::dispatch::tests::agents::content_fence_legacy_keys_still_queue_after_output_changes ... ok546test app::dispatch::tests::agents::content_fence_matching_pair_queues_one_ordered_batch ... ok547test app::dispatch::tests::agents::content_fence_missing_runtime_is_conflict_and_read_identity_is_null ... ok548test app::dispatch::tests::agents::content_fence_quiet_child ... ignored, PTY child for content fence tests549test app::dispatch::tests::agents::content_fence_read_returns_text_and_runtime_coordinates ... ok550test app::dispatch::tests::agents::content_fence_rejects_malformed_coordinates ... ok551test app::dispatch::tests::agents::content_fence_requires_both_fields ... ok552test app::dispatch::tests::agents::content_fence_stale_revision_queues_nothing ... ok553test app::dispatch::tests::agents::content_fence_unavailable_engine_queues_nothing ... ok554test app::dispatch::tests::agents::content_fence_wrong_terminal_identity_queues_nothing ... ok555test app::dispatch::tests::agents::disconnected_clients_reclaim_parked_waiters_without_replies ... ok556test app::dispatch::tests::agents::explicit_agent_report_targets_never_fall_back_to_focus ... ok557test app::dispatch::tests::agents::full_report_cache_allows_only_updates_and_same_pane_replacements ... ok558test app::dispatch::tests::agents::integration_report_is_explainable_exclusive_and_resolves_waits ... ok559test app::dispatch::tests::agents::key_names_map_to_terminal_bytes ... ok560test app::dispatch::tests::agents::native_codex_requires_live_composer_geometry ... ok561test app::dispatch::tests::agents::observed_prompt_admission_failures_preserve_input_and_ownership ... ok562test app::dispatch::tests::agents::observed_prompt_cancellation_and_missing_terminal_release_ownership ... ok563test app::dispatch::tests::agents::observed_prompt_completion_timeout_preserves_transition_evidence ... ok564test app::dispatch::tests::agents::observed_prompt_exited_terminal_releases_ownership_before_pane_removal ... ok565test app::dispatch::tests::agents::observed_prompt_no_wait_keeps_the_queued_response_and_no_ownership ... ok566test app::dispatch::tests::agents::observed_prompt_pane_exit_is_a_structured_failure ... ok567test app::dispatch::tests::agents::observed_prompt_rejected_requests_never_queue_input ... ok568test app::dispatch::tests::agents::observed_prompt_requires_a_new_active_state_and_preserves_until ... ok569test app::dispatch::tests::agents::observed_prompt_unknown_state_times_out_without_changing_status ... ok570test app::dispatch::tests::agents::output_wait_without_timeout_is_bounded ... ok571test app::dispatch::tests::agents::prompt_apis_reject_a_fresh_interaction_screen_without_queueing_input ... ok572test app::dispatch::tests::agents::prompt_readiness_tracks_reports_before_detection_or_output ... ok573test app::dispatch::tests::agents::prompt_readiness_uses_current_agent_over_stale_session ... ok574test app::dispatch::tests::agents::prompt_terminal_id_fence_rejects_stale_routes_before_input ... ok575test app::dispatch::tests::agents::reading_agent_titles_does_not_consume_or_publish_title_events ... ok576test app::dispatch::tests::agents::reported_codex_without_a_composer_rejects_prompt_input ... ok577test app::dispatch::tests::agents::reported_usage_rejects_malformed_and_out_of_range_values ... ok578test app::dispatch::tests::agents::runtime_snapshot_is_global_fenced_and_processes_hide_arguments ... ok579test app::dispatch::tests::agents::runtime_snapshot_projects_agent_session_title_without_using_the_alias ... ok580test app::dispatch::tests::agents::runtime_string_limits_count_unicode_codepoints ... ok581test app::dispatch::tests::agents::server_owned_agent_start_keeps_null_targets_terminal ... ok582test app::dispatch::tests::agents::server_owned_agent_start_reserves_name_and_waits_for_detection ... ok583test app::dispatch::tests::agents::session_evidence_binds_only_one_matching_pane ... ok584test app::dispatch::tests::agents::snapshot_alias_events_follow_the_naming_mutator ... ok585test app::dispatch::tests::agents::snapshot_alias_excludes_native_views_and_handles_no_workspace ... ok586test app::dispatch::tests::agents::snapshot_preserves_agent_alias_across_inactive_tabs ... ok587test app::dispatch::tests::agents::strict_prompt_rejects_unverified_agents_without_changing_legacy_send ... ok588test app::dispatch::tests::agents::strip_title_icon_drops_a_leading_glyph_only ... ok589test app::dispatch::tests::agents::wait_output_resolves_immediately_or_on_output_or_deadline ... ok590test app::dispatch::tests::content::diff_api_validates_anchors_and_preserves_atomic_note_lifecycle ... ok591test app::dispatch::tests::content::exact_search_rejects_oversized_queries_before_scanning ... ok592test app::dispatch::tests::core::config_patch_rejects_unknown_fields_without_mutation ... ok593test app::dispatch::tests::core::config_patch_updates_child_appearance_and_notifies_mode_2031 ... ok594test app::dispatch::tests::core::config_reload_applies_the_agents_filter_live ... ok595test app::dispatch::tests::core::ping_exposes_the_binary_transport_protocol_for_upgrade_preflight ... ok596test app::dispatch::tests::core::socket_mutations_support_optimistic_revision_guards ... ok597test app::dispatch::tests::extensions::agent_row_session_titles_work_without_a_workspace ... ok598test app::dispatch::tests::extensions::agent_row_title_push_is_atomic_and_globally_bounded ... ok599test app::dispatch::tests::extensions::agent_row_titles_are_module_provided_and_never_use_alias ... ok600test app::dispatch::tests::extensions::bar_api_validates_ownership_and_preserves_the_last_valid_widget ... ok601test app::dispatch::tests::extensions::dock_menu_item_value_overrides_the_rows_value ... ok602test app::dispatch::tests::extensions::dock_push_drops_empty_spans_and_backfills_text_from_spans ... ok603test app::dispatch::tests::extensions::dock_push_parses_a_rows_right_click_menu ... ok604test app::dispatch::tests::extensions::dock_push_preserves_row_tone_and_spans ... ok605test app::dispatch::tests::extensions::mission_burn_accepts_native_copilot_model_switch_without_overrides ... ok606test app::dispatch::tests::extensions::mission_burn_ignores_cost_only_corrections_with_other_usage ... ok607test app::dispatch::tests::extensions::mission_open_targets_a_workspace_and_rejects_missing_ones ... ok608test app::dispatch::tests::extensions::mission_refresh_preserves_distinct_pending_scopes ... ok609test app::dispatch::tests::extensions::mission_refresh_workers_complete_queued_scopes ... ok610test app::dispatch::tests::extensions::mission_snapshot_and_refresh_are_read_only_ui_independent_controls ... ok611test app::dispatch::tests::extensions::mission_snapshot_explains_missing_usage_and_refresh_completion ... ok612test app::dispatch::tests::extensions::module_title_push_and_clear_publish_only_real_changes ... ok613test app::dispatch::tests::extensions::ownerless_clear_does_not_remove_module_owned_agent_titles ... ok614test app::dispatch::tests::extensions::re_enabling_a_module_keeps_live_publisher_credentials_valid ... ok615test app::dispatch::tests::extensions::theme_api_lists_validates_and_applies_registry_entries ... ok616test app::dispatch::tests::extensions::unowned_notifications_share_the_same_rate_limit ... ok617test app::dispatch::tests::orchestration::automation_api_binds_active_agents_to_an_exact_terminal_lifetime ... ok618test app::dispatch::tests::orchestration::automation_api_rebinds_only_the_same_private_native_session ... ok619test app::dispatch::tests::orchestration::automation_api_validates_targets_and_is_idempotent ... ok620test app::dispatch::tests::orchestration::task_api_projection_does_not_expose_automation_briefings ... ok621test app::dispatch::tests::orchestration::task_attempt_timestamps_are_omitted_until_the_attempt_starts ... ok622test app::dispatch::tests::orchestration::task_delete_api_cancels_a_blocked_tasks_running_gate ... ok623test app::dispatch::tests::orchestration::task_heartbeat_rejects_invalid_context_without_mutation ... ok624test app::dispatch::tests::orchestration::task_release_api_invalidates_a_running_gate_result ... ok625test app::dispatch::tests::orchestration::task_retry_api_queues_a_new_attempt_and_projects_history ... ok626test app::dispatch::tests::orchestration::task_start_api_can_preserve_the_operator_selection ... ok627test app::dispatch::tests::orchestration::task_start_api_rejects_a_non_boolean_focus ... ok628test app::dispatch::tests::orchestration::task_start_api_supports_explicit_workspace_mode ... ok629test app::dispatch::tests::orchestration::task_update_and_retry_fence_the_previous_gate_attempt ... ok630test app::dispatch::tests::orchestration::task_update_rejects_an_unknown_task_without_emitting_null_success ... ok631test app::dispatch::tests::runtime::automation_deadline_wakes_quiet_runtime ... ok632test app::dispatch::tests::runtime::detached_agent_start_demands_throttled_process_scans_only_while_active ... ok633test app::dispatch::tests::runtime::detached_runtime_skips_heartbeat_scans ... ok634test app::dispatch::tests::runtime::detect_tick_repairs_a_stale_restored_workspace_index ... ok635test app::dispatch::tests::runtime::detection_considers_changed_panes_between_bounded_audits ... ok636test app::dispatch::tests::runtime::dirty_cached_process_api_requests_refresh_without_waiting ... ok637test app::dispatch::tests::runtime::failed_demanded_process_scan_rearms_without_an_idle_heartbeat ... ok638test app::dispatch::tests::runtime::hidden_pty_title_change_is_a_presentation_invalidation ... ok639test app::dispatch::tests::runtime::overdue_blocked_audit_still_wakes_the_loop ... ok640test app::dispatch::tests::runtime::overdue_dirty_runtime_scans_still_wake_with_a_client ... ok641test app::dispatch::tests::runtime::process_api_demand_retries_when_inflight_snapshot_omits_requested_pane ... ok642test app::dispatch::tests::runtime::process_api_demand_survives_a_failed_inflight_dirty_scan ... ok643test app::dispatch::tests::runtime::process_api_scans_without_a_tui ... ok644test app::dispatch::tests::runtime::quiet_runtime_can_leave_the_fast_detection_cadence ... ok645test app::dispatch::tests::runtime::quiet_runtime_has_no_loop_deadline ... ok646test app::dispatch::tests::runtime::settled_working_pane_waits_for_output_instead_of_polling_forever ... ok647test app::dispatch::tests::topology::closing_last_inactive_workspace_pane_emits_one_workspace_closed_event ... ok648test app::dispatch::tests::topology::explicit_missing_pane_neighbor_is_not_found_and_atomic ... ok649test app::dispatch::tests::topology::explicit_missing_pane_resize_is_not_found_and_atomic ... ok650test app::dispatch::tests::topology::explicit_missing_pane_zoom_is_not_found_and_atomic ... ok651test app::dispatch::tests::topology::invalid_zoom_enabled_does_not_change_focus_or_layout ... ok652test app::dispatch::tests::topology::null_pane_targets_focus_for_terminal_focus_defaults ... ok653test app::dispatch::tests::topology::omitted_and_null_pane_still_target_focus_where_supported ... ok654test app::dispatch::tests::topology::pane_ids_are_checked_before_resolution_or_mutation ... ok655test app::dispatch::tests::topology::pane_input_methods_report_rejection_and_run_is_one_action ... ok656test app::dispatch::tests::topology::pane_inspection_reports_read_only_history_metrics ... ok657test app::dispatch::tests::topology::pane_list_all_tabs_discovers_inactive_panes_without_changing_focus ... ok658test app::dispatch::tests::topology::pane_list_excludes_dashboard_placeholder_leaves ... ok659test app::dispatch::tests::topology::pane_move_api_moves_to_new_and_existing_tabs_without_restarting ... ok660test app::dispatch::tests::topology::pane_move_api_validates_destination_shape_and_range ... ok661test app::dispatch::tests::topology::pane_rename_caret_edits_keep_the_name_addressable ... ok662test app::dispatch::tests::topology::pane_rename_does_not_turn_backend_label_into_alias ... ok663test app::dispatch::tests::topology::pane_rename_modal_sets_and_clears_the_name ... ok664test app::dispatch::tests::topology::pane_split_failed_spawn_cleans_inactive_workspace_without_changing_caller ... ok665test app::dispatch::tests::topology::pane_split_no_focus_keeps_the_caller_focused ... ok666test app::dispatch::tests::topology::pane_split_null_pane_targets_the_focused_layout_pane ... ok667test app::dispatch::tests::topology::pane_split_targets_foreign_workspace_without_detaching ... ok668test app::dispatch::tests::topology::remaining_focus_default_methods_reject_missing_panes_atomically ... ok669test app::dispatch::tests::topology::rename_pane_is_offered_in_both_menus ... ok670test app::dispatch::tests::topology::stable_topology_ids_survive_reordering_and_address_mutations ... ok671test app::dispatch::tests::topology::tab_focus_api_requires_an_existing_one_based_position ... ok672test app::dispatch::tests::topology::tab_list_and_get_report_the_same_mission_control_kind ... ok673test app::dispatch::tests::topology::tab_move_api_reorders_and_preserves_active_tab ... ok674test app::dispatch::tests::topology::tab_move_api_supports_directional_active_and_explicit_targets ... ok675test app::dispatch::tests::topology::tab_rename_api_validates_target_name_and_dashboard_kind ... ok676test app::dispatch::tests::topology::tab_swap_api_exchanges_positions_and_preserves_active_identity ... ok677test app::dispatch::tests::topology::topology_queries_and_mutations_share_the_live_layout ... ok678test app::dispatch::tests::topology::workspace_block_move_is_atomic_and_keeps_active_workspace ... ok679test app::dispatch::tests::topology::workspace_metadata_partial_updates_preserve_the_other_counter ... ok680test app::dispatch::tests::topology::workspace_organization_api_renames_pins_lists_and_validates ... ok681test app::dispatch::topology::tests::pane_split_auto_cuts_a_wide_pane_side_by_side ... ok682test app::dispatch::topology::tests::pane_split_auto_keeps_headless_left_right_default ... ok683test app::dispatch::topology::tests::pane_split_auto_stacks_a_portrait_cell_pane ... ok684test app::dispatch::topology::tests::pane_split_auto_stacks_a_tall_pane ... ok685test app::dispatch::topology::tests::pane_split_auto_uses_reported_square_cells ... ok686test app::dispatch::topology::tests::pane_split_rejects_unknown_direction ... ok687test app::dispatch::topology::tests::pane_split_right_overrides_a_tall_pane ... ok688test app::dock_fn_check::layout_tab_scrolls_to_cursor ... ok689test app::dock_fn_check::off_unmounts_and_stays_in_registry ... ok690test app::file_jobs::tests::create_never_truncates_existing_content ... ok691test app::file_jobs::tests::delete_directory_link_preserves_target ... ok692test app::file_jobs::tests::metadata_completion_rejects_replaced_read_and_closed_view ... ok693test app::file_jobs::tests::mutation_completion_skips_closed_or_replaced_workspace ... ok694test app::files::tests::a_closed_editor_tab_reopens_on_the_next_click ... ok695test app::files::tests::a_held_modified_copy_or_wrap_key_acts_once ... ok696test app::files::tests::a_late_read_for_the_previous_file_never_lands_in_the_preview ... ok697test app::files::tests::a_plain_click_follows_the_file_click_behavior_setting ... ok698test app::files::tests::a_preview_click_focuses_the_permanent_tab_a_file_already_has ... ok699test app::files::tests::an_older_read_of_the_same_file_never_overwrites_a_newer_one ... ok700test app::files::tests::clicking_a_file_reopens_after_its_tab_is_closed ... ok701test app::files::tests::clicking_a_file_twice_reuses_its_editor_tab ... ok702test app::files::tests::clicking_a_file_twice_reuses_its_readonly_tab ... ok703test app::files::tests::closing_a_file_tab_lets_it_reopen ... ok704test app::files::tests::default_open_resolves_and_degrades ... ok705test app::files::tests::delete_needs_confirmation ... ok706test app::files::tests::different_files_get_their_own_editor_tabs ... ok707test app::files::tests::expanding_a_folder_loads_it_immediately ... ok708test app::files::tests::external_new_file_is_picked_up_by_rescan ... ok709test app::files::tests::file_menu_crud_creates_renames_deletes ... ok710test app::files::tests::file_menu_offers_only_the_matching_explicit_document_preview ... ok711test app::files::tests::file_menu_offers_open_actions_for_files_only ... ok712test app::files::tests::file_search_consumes_non_search_shortcuts_before_and_after_commit ... ok713test app::files::tests::file_tab_survives_restore ... ok714test app::files::tests::file_view_frees_content_on_close ... ok715test app::files::tests::file_view_pane_renders_scrolls_and_closes ... ok716test app::files::tests::files_dock_renders_and_a_click_expands ... ok717test app::files::tests::files_dock_says_loading_until_the_root_listing_arrives ... ok718test app::files::tests::files_filter_finds_collapsed_paths_and_restores_tree_after_actions ... ok719test app::files::tests::files_filter_rejects_stale_results_and_clears_on_workspace_change ... ok720test app::files::tests::files_filter_remains_visible_while_the_root_listing_loads ... ok721test app::files::tests::files_focus_mounts_the_dock_and_reveals_its_remembered_side ... ok722test app::files::tests::files_focus_restores_last_side_across_restart ... ok723test app::files::tests::files_get_a_dot_marker_aligned_with_folder_chevrons ... ok724test app::files::tests::files_keyboard_actions_skip_dividers_and_execute_the_selected_row ... ok725test app::files::tests::files_keyboard_navigation_expands_walks_and_keeps_the_cursor_visible ... ok726test app::files::tests::general_tab_has_show_hidden_above_the_notify_divider ... ok727test app::files::tests::hidden_files_api_re_roots_and_reloads_after_restore ... ok728test app::files::tests::insert_path_is_offered_for_files_and_folders ... ok729test app::files::tests::insert_path_refuses_a_path_that_is_not_utf8 ... ok730test app::files::tests::insert_path_refuses_terminal_control_characters ... ok731test app::files::tests::insert_path_reports_a_focused_leaf_that_is_not_a_pane ... ok732test app::files::tests::insert_path_types_the_path_into_the_focused_pane_without_submitting_it ... ok733test app::files::tests::long_line_wraps_and_shows_its_tail ... ok734test app::files::tests::missing_or_unknown_file_click_reads_as_preview ... ok735test app::files::tests::mouse_drag_selects_and_copies_file_text ... ok736test app::files::tests::open_as_new_workspace_creates_a_workspace_at_the_folder ... ok737test app::files::tests::open_as_new_workspace_focuses_an_already_open_workspace ... ok738test app::files::tests::open_as_new_workspace_focuses_through_a_symlink ... ok739test app::files::tests::open_as_new_workspace_is_offered_for_folders_only ... ok740test app::files::tests::open_in_tab_focuses_the_tab_a_file_already_has ... ok741test app::files::tests::open_view_live_refreshes_on_disk_change ... ok742test app::files::tests::open_with_a_different_editor_still_launches_it ... ok743test app::files::tests::opening_the_files_menu_does_not_change_the_insert_target ... ok744test app::files::tests::opening_with_editor_spawns_a_pty_pane_in_a_new_tab ... ok745test app::files::tests::preview_never_launches_the_configured_editor ... ok746test app::files::tests::preview_reuses_one_pane_across_files_and_back_again ... ok747test app::files::tests::preview_then_a_tab_mode_click_opens_a_tab_for_the_same_file ... ok748test app::files::tests::preview_then_another_preview_click_stays_one_pane ... ok749test app::files::tests::preview_then_shift_click_promotes_that_pane_instead_of_adding_one ... ok750test app::files::tests::recent_files_are_deduplicated_newest_first_and_bounded ... ok751test app::files::tests::reopening_focuses_existing_and_copy_yanks_content ... ok752test app::files::tests::repeated_preview_clicks_on_one_file_add_nothing ... ok753test app::files::tests::set_line_dock_no_stale_tail_when_row_shortens ... ok754test app::files::tests::the_files_menu_opens_read_only_in_a_tab ... ok755test app::files::tests::the_insert_path_row_runs_the_action ... ok756test app::files::tests::workspace_switch_reroots_files_without_pane_activity ... ok757test app::git::tests::a_held_key_stays_with_its_git_tab_across_workspace_switches ... ok758test app::git::tests::ci_failure_notifies_only_on_transition ... ok759test app::git::tests::clicking_a_commit_row_opens_detail ... ok760test app::git::tests::commit_enter_opens_in_tab_detail_and_esc_returns ... ok761test app::git::tests::contributor_list_hides_emails_and_expands_on_click ... ok762test app::git::tests::default_section_is_commits_and_click_switches ... ok763test app::git::tests::git_run_in_pane_skips_the_orch_board ... ok764test app::git::tests::git_tab_falls_back_to_focused_pane_cwd ... ok765test app::git::tests::git_tab_opens_fetches_and_persists_safely ... ok766test app::git::tests::hostile_branch_names_never_reach_the_shell ... ok767test app::git::tests::issue_enter_opens_in_tab_detail ... ok768test app::git::tests::mobile_git_tab_hides_the_footer_and_reclaims_its_rows ... ok769test app::git::tests::pr_checkout_remains_and_removed_shortcuts_do_not_launch_commands ... ok770test app::git::tests::scroll_routes_to_block_or_cursor_and_clamps ... ok771test app::git::tests::state_filter_cycles_per_section ... ok772test app::git::tests::status_selection_tracks_the_exact_file_for_diff_activation ... ok773test app::input::link_click_tests::a_click_without_ctrl_never_opens_anything ... ok774test app::input::link_click_tests::a_double_click_copies_a_token_after_wide_characters ... ok775test app::input::link_click_tests::a_double_click_copies_a_wide_character_word ... ok776test app::input::link_click_tests::a_double_click_copies_a_word_from_a_document_preview ... ok777test app::input::link_click_tests::a_double_click_copies_a_word_from_a_native_file_view ... ok778test app::input::link_click_tests::a_double_click_copies_the_word_under_the_cursor ... ok779test app::input::link_click_tests::a_double_click_preserves_complete_graphemes ... ok780test app::input::link_click_tests::a_forwarded_press_records_the_cell_the_child_saw ... ok781test app::input::link_click_tests::a_line_suffix_scrolls_the_viewer_to_that_line ... ok782test app::input::link_click_tests::a_localhost_port_opens_over_plain_http ... ok783test app::input::link_click_tests::a_new_left_press_clears_a_copied_highlight_before_overlay_handling ... ok784test app::input::link_click_tests::a_press_after_a_dropped_release_starts_a_new_gesture ... ok785test app::input::link_click_tests::a_release_reaches_a_pane_that_left_the_screen ... ok786test app::input::link_click_tests::a_title_click_then_a_body_click_focuses_the_pane_not_a_double_click ... ok787test app::input::link_click_tests::an_existing_file_beats_a_domain_of_the_same_name ... ok788test app::input::link_click_tests::any_motion_forwarding_does_not_mark_luvus_dirty ... ok789test app::input::link_click_tests::automation_detail_enter_follows_a_live_orch_worker ... ok790test app::input::link_click_tests::automation_row_opens_details_and_uses_the_live_agent_context ... ok791test app::input::link_click_tests::closing_the_grabbed_pane_does_not_capture_later_clicks ... ok792test app::input::link_click_tests::compact_pane_controls_wait_for_a_forwarded_release ... ok793test app::input::link_click_tests::context_menu_hover_dirties_only_when_the_highlight_changes ... ok794test app::input::link_click_tests::copy_link_at_grid_keeps_unicode_paths_complete ... ok795test app::input::link_click_tests::ctrl_click_beside_a_link_opens_nothing ... ok796test app::input::link_click_tests::ctrl_click_on_a_bare_domain_opens_it_over_https ... ok797test app::input::link_click_tests::ctrl_click_on_a_file_path_opens_a_tab_when_that_is_the_click_behavior ... ok798test app::input::link_click_tests::ctrl_click_on_a_file_path_previews_it_beside_the_pane ... ok799test app::input::link_click_tests::ctrl_click_on_a_link_queues_it_for_the_client ... ok800test app::input::link_click_tests::ctrl_drag_from_a_link_resizes_instead_of_opening ... ok801test app::input::link_click_tests::ctrl_hover_after_wide_characters_underlines_the_real_cells ... ok802test app::input::link_click_tests::ctrl_hover_projects_a_plain_file_path_to_the_host_terminal ... ok803test app::input::link_click_tests::ctrl_hover_underlines_the_link_and_plain_hover_clears_it ... ok804test app::input::link_click_tests::ctrl_shift_click_on_a_file_path_opens_a_permanent_pane_beside ... ok805test app::input::link_click_tests::help_cannot_swallow_a_forwarded_release ... ok806test app::input::link_click_tests::http_osc8_target_opens_even_when_its_label_looks_like_a_file ... ok807test app::input::link_click_tests::mouse_auto_copy_preserves_reverse_wide_character_selection ... ok808test app::input::link_click_tests::mouse_copy_is_independent_of_detected_agent ... ok809test app::input::link_click_tests::mouse_drag_copy_preserves_selected_terminal_cells ... ok810test app::input::link_click_tests::mouse_selection_anchor_survives_scrollback_while_dragging ... ok811test app::input::link_click_tests::narrow_orchestration_double_click_also_jumps_to_the_worker ... ok812test app::input::link_click_tests::new_task_form_stays_open_inside_and_closes_on_its_backdrop ... ok813test app::input::link_click_tests::only_paths_that_exist_as_files_resolve ... ok814test app::input::link_click_tests::osc8_file_label_preserves_a_visible_line_number ... ok815test app::input::link_click_tests::osc8_file_target_overrides_a_domain_shaped_label ... ok816test app::input::link_click_tests::osc8_file_target_overrides_server_prefixed_mjs_label ... ok817test app::input::link_click_tests::pane_search_cannot_swallow_a_forwarded_release ... ok818test app::input::link_click_tests::pty_output_invalidates_a_hovered_file_target ... ok819test app::input::link_click_tests::right_clicking_a_tab_opens_its_menu_instead_of_rename ... ok820test app::input::link_click_tests::scheduled_sidebar_opens_automation_menu_without_a_live_pane ... ok821test app::input::link_click_tests::scheduled_sidebar_uses_detail_on_left_and_agent_menu_on_right ... ok822test app::input::link_click_tests::secondary_release_cannot_escape_a_finished_forwarded_gesture ... ok823test app::input::link_click_tests::stationary_click_stays_empty_when_output_advances_history ... ok824test app::input::link_click_tests::super_click_on_a_file_path_uses_the_same_native_preview ... ok825test app::input::link_click_tests::tab_menu_renders_swap_with_submenu_for_other_tabs ... ok826test app::input::link_click_tests::the_context_menu_offers_open_link_only_over_a_link ... ok827test app::input::link_click_tests::unowned_right_drag_does_not_change_or_copy_a_left_selection ... ok828test app::input::link_click_tests::unsupported_osc8_target_is_inert_without_label_fallback ... ok829test app::input::link_click_tests::visible_selection_fallback_preserves_wide_characters ... ok830test app::input::link_click_tests::wheel_alone_can_extend_an_active_selection ... ok831test app::input::link_click_tests::wheel_returning_to_the_anchor_does_not_copy_one_cell ... ok832test app::input::link_click_tests::wide_orchestration_double_click_jumps_to_the_worker ... ok833test app::input::link_click_tests::word_at_grid_keeps_wide_glyph_cells_in_one_word ... ok834test app::input::link_click_tests::word_at_grid_takes_the_whitespace_word_under_the_cell ... ok835test app::input::tests::a_key_that_dismisses_the_bar_overflow_never_repeats_into_the_view ... FAILED836test app::input::tests::alt_backspace_sends_meta_delete_for_word_deletion ... ok837test app::input::tests::alt_punctuation_uses_csi_u_only_after_negotiation ... ok838test app::input::tests::altgr_types_its_character_instead_of_a_control_byte ... ok839test app::input::tests::any_motion_hover_keeps_its_exact_forwarded_bytes ... ok840test app::input::tests::api_focus_change_invalidates_scroll_and_copy_repeat_receivers ... ok841test app::input::tests::api_requests_are_answered_after_the_last_project_closes ... ok842test app::input::tests::app_never_leaks_text_or_luvus_shortcut_releases_to_the_pane ... ok843test app::input::tests::app_routes_function_key_phases_only_after_a_forwarded_press ... ok844test app::input::tests::app_swallows_repeats_while_an_overlay_owns_input_but_pairs_release ... ok845test app::input::tests::application_cursor_mode_uses_ss3_cursor_keys ... ok846test app::input::tests::button_seq_encodes_press_drag_and_release ... ok847test app::input::tests::character_keys_preserve_alt_with_control ... ok848test app::input::tests::closing_last_workspace_fails_parked_files_and_diff_requests ... ok849test app::input::tests::closing_one_workspace_fails_only_its_parked_files_and_diff_requests ... ok850test app::input::tests::command_inspect_fills_only_a_missing_process_root ... ok851test app::input::tests::committed_copy_search_enter_copies_and_returns_live ... ok852test app::input::tests::committed_pane_search_is_invalidated_by_new_output ... ok853test app::input::tests::concurrent_clients_keep_independent_key_release_ownership ... ok854test app::input::tests::control_characters_use_full_csi_u_only_after_negotiation ... ok855test app::input::tests::control_shift_letters_reach_nested_tuis_distinctly ... ok856test app::input::tests::control_slash_reaches_nested_tuis_across_terminal_encodings ... ok857test app::input::tests::copy_mode_search_moves_cursor_and_preserves_copy_state ... ok858test app::input::tests::copy_search_is_cancelled_when_focus_changes ... ok859test app::input::tests::ctrl_enter_phases_follow_the_negotiated_keyboard_protocol ... ok860test app::input::tests::ctrl_enter_repeat_and_release_stay_with_the_original_pane ... ok861test app::input::tests::direct_shortcuts_run_once_while_held ... ok862test app::input::tests::disambiguate_and_report_all_encode_esc_and_modified_chars ... ok863test app::input::tests::discarded_cwd_scan_releases_the_inflight_guard ... ok864test app::input::tests::double_prefix_forwards_without_snapping_scrollback_to_bottom ... ok865test app::input::tests::files_filter_typing_repeats ... ok866test app::input::tests::flags_without_crossterm_payloads_do_not_change_encoding ... ok867test app::input::tests::function_keys_encode_to_tilde_codes ... ok868test app::input::tests::gate_completion_settles_without_a_workspace ... ok869test app::input::tests::global_search_modal_owns_paste_over_native_search ... ok870test app::input::tests::image_path_paste_reaches_only_a_normal_focused_pane ... ok871test app::input::tests::keys_leaving_scroll_mode_or_prefix_stay_pane_owned ... ok872test app::input::tests::kitty_modes_preserve_modified_enter_identity ... ok873test app::input::tests::legacy_modified_enter_sends_a_newline_not_a_submit ... ok874test app::input::tests::legacy_pane_repeats_stay_owned_and_release_only_clears_the_route ... ok875test app::input::tests::legacy_wheel_encodes_offset_bytes_and_caps ... ok876test app::input::tests::merge_completion_settles_without_a_workspace ... ok877test app::input::tests::modified_enter_repeats_only_where_it_inserts_a_newline ... ok878test app::input::tests::modifier_bits_follow_the_xterm_convention ... ok879test app::input::tests::modifier_changes_before_release_keep_the_semantic_key_owned ... ok880test app::input::tests::native_view_search_owns_paste_while_editing_and_after_commit ... ok881test app::input::tests::navigation_keys_preserve_modifiers_for_nested_prompt_editors ... ok882test app::input::tests::orphaned_pane_search_never_consumes_future_paste ... ok883test app::input::tests::pane_search_case_mode_toggles_and_rescans_without_pty_leaks ... ok884test app::input::tests::pane_search_is_scoped_and_cancelled_when_focus_changes ... ok885test app::input::tests::pane_search_navigation_wraps_in_both_directions ... ok886test app::input::tests::pane_search_no_match_and_escape_restore_scroll_mode_viewport ... ok887test app::input::tests::pane_search_owns_keys_and_paste_without_pty_leaks ... ok888test app::input::tests::pane_search_word_highlight_does_not_use_global_flash ... ok889test app::input::tests::paste_cancels_copy_search_after_focus_changes ... ok890test app::input::tests::prefix_digits_jump_to_tabs_and_shifted_digits_jump_to_workspaces ... ok891test app::input::tests::replacing_stale_ownership_releases_the_old_pane_before_the_new_press ... ok892test app::input::tests::replayed_ui_repeats_never_become_pane_input ... ok893test app::input::tests::report_all_and_event_types_encode_csi_u_phases ... ok894test app::input::tests::report_event_types_alone_keeps_text_and_legacy_editing_keys_compatible ... ok895test app::input::tests::report_event_types_preserves_press_and_encodes_function_key_phases ... ok896test app::input::tests::resize_forces_a_full_repaint ... ok897test app::input::tests::sgr_wheel_encodes_button_and_coords ... ok898test app::input::tests::shift_enter_sequence_is_configurable ... ok899test app::input::tests::tab_and_backspace_require_report_all_for_csi_u ... ok900test app::input::tests::task_merge_api_parks_until_background_git_finishes ... ok901test app::input::tests::task_prompt_paste_preserves_normalized_newlines ... ok902test app::input::tests::text_modal_suppresses_hover_from_covered_bar_geometry ... ok903test app::input::tests::tilde_navigation_keys_preserve_modifiers ... ok904test app::input::tests::ui_repeat_leases_restore_text_and_file_navigation_without_repeating_actions ... ok905test app::input::tests::unowned_repeats_continue_scroll_copy_and_resize_navigation_only ... ok906test app::input::tests::unregistered_receivers_repeat_text_but_enter_and_esc_never_replay ... ok907test app::input::tests::windows_shifted_punctuation_is_excluded_from_csi_u_without_key_identity ... ok908test app::input::tests::workspace_and_switcher_lists_repeat_navigation_but_not_activation ... ok909test app::io_jobs::tests::blocked_job_does_not_block_admission_or_bounded_shutdown ... ok910test app::io_jobs::tests::capacity_includes_unapplied_completions_and_drain_is_fifo ... ok911test app::io_jobs::tests::parallel_jobs_are_cancelled_and_joined_on_shutdown ... ok912test app::keys::tests::a_custom_prefix_drives_command_mode ... ok913test app::keys::tests::agents_command_focuses_the_dock_and_filter_key_persists ... ok914test app::keys::tests::apply_tmux_preset_sets_prefix_and_split_keys ... ok915test app::keys::tests::command_works_as_both_two_step_and_held_chord ... ok916test app::keys::tests::configured_prefix_takes_precedence_over_a_direct_collision ... ok917test app::keys::tests::copy_mode_binding_is_editable_like_every_other_prefix_command ... ok918test app::keys::tests::default_prefix_keys_navigate_focus_history ... ok919test app::keys::tests::defaults_and_aliases_resolve ... ok920test app::keys::tests::direct_alt_arrows_switch_tabs_without_changing_prefix_bindings ... ok921test app::keys::tests::direct_bindings_are_opt_in_and_resolve_command_collisions ... ok922test app::keys::tests::direct_bindings_parse_semantic_modified_keys_only ... ok923test app::keys::tests::direct_shortcuts_remain_global_over_focused_surfaces ... ok924test app::keys::tests::focus_history_moves_back_and_forward_across_tabs ... ok925test app::keys::tests::focus_history_returns_across_tabs ... ok926test app::keys::tests::focus_history_skips_closed_panes ... ok927test app::keys::tests::focus_navigation_commands_support_direct_bindings ... ok928test app::keys::tests::function_key_prefix_drives_command_mode ... ok929test app::keys::tests::legacy_m_and_uppercase_m_collisions_keep_both_entrypoints_usable ... ok930test app::keys::tests::legacy_switcher_override_does_not_mask_mission ... ok931test app::keys::tests::mission_command_opens_the_dashboard_in_the_active_workspace ... ok932test app::keys::tests::next_attention_cycles_blocked_agents ... ok933test app::keys::tests::next_attention_no_blocked_keeps_focus ... ok934test app::keys::tests::next_done_agent_cycles_and_records_focus_history ... ok935test app::keys::tests::next_done_agent_ignores_non_agents_and_other_states ... ok936test app::keys::tests::next_pane_cycles_and_rename_tab_opens_the_modal ... ok937test app::keys::tests::open_sessions_command_opens_the_named_session_menu ... ok938test app::keys::tests::ordinary_focus_after_history_back_clears_forward_branch ... ok939test app::keys::tests::prefix_matches_the_exact_configured_chord ... ok940test app::keys::tests::prefix_parse_accepts_safe_function_keys_and_modified_characters ... ok941test app::keys::tests::prefix_question_opens_scrollable_help_and_other_keys_close ... ok942test app::keys::tests::rebind_moves_the_key ... ok943test app::keys::tests::rebinding_a_command_replaces_only_its_own_keys ... ok944test app::keys::tests::set_prefix_accepts_function_keys_but_rejects_plain_text ... ok945test app::keys::tests::shifted_period_prefix_key_runs_next_done_agent ... ok946test app::keys::tests::sidebar_action_key_opens_keyboard_selected_context_menus ... ok947test app::keys::tests::status_bar_shows_search_and_the_live_prefix ... ok948test app::keys::tests::toggle_agent_scope_command_persists_both_choices ... ok949test app::keys::tests::workspace_focus_navigates_without_switching_until_enter ... ok950test app::keys::tests::workspace_jump_defaults_use_chord_labels_only_for_display ... ok951test app::keys::tests::workspace_jump_ids_are_stable_and_rebindable ... ok952test app::keys::tests::workspace_jump_uses_sidebar_order_and_preserves_target_focus ... ok953test app::line_edit::tests::arrows_move_the_caret_and_edits_land_at_it ... ok954test app::line_edit::tests::multibyte_chars_edit_as_one_character_and_caps_hold ... ok955test app::line_edit::tests::rejected_edits_and_stale_carets_are_safe ... ok956test app::modules::tests::a_linked_module_has_no_source_to_resolve_by ... ok957test app::modules::tests::closing_active_workspace_repairs_context_before_event_hook_runs ... ok958test app::modules::tests::declared_settings_reach_a_command_as_env ... ok959test app::modules::tests::dock_menu_click_spawns_the_action_with_the_clicked_rows_env ... ok960test app::modules::tests::event_hook_runs_with_event_env ... ok961test app::modules::tests::git_install_builds_and_uninstall_removes_checkout ... Cloning into '/nix/var/nix/builds/nix-28177-3218472384/luvus-gittest-72306/modules/git/.staging-72306-0'...962remote: Enumerating objects: 3, done.963remote: Counting objects: 100% (3/3), done.964remote: Compressing objects: 100% (2/2), done.965remote: Total 3 (delta 0), reused 0 (delta 0), pack-reused 0 (from 0)966Receiving objects: 100% (3/3), done.967ok968test app::modules::tests::item_platforms_gate_panes_and_events ... ok969test app::modules::tests::link_then_run_action_captures_output ... ok970test app::modules::tests::listing_settings_masks_secrets_but_get_returns_them ... ok971test app::modules::tests::module_actions_appear_in_the_right_click_menus ... ok972test app::modules::tests::module_pane_restores_from_a_snapshot_that_names_the_install_shorthand ... ok973test app::modules::tests::module_pane_survives_snapshot_restore ... ok974test app::modules::tests::modules_resolve_by_owner_repo_as_well_as_id ... ok975test app::modules::tests::open_module_pane_tracks_and_cleans_up ... ok976test app::modules::tests::settings_modules_tab_lists_and_toggles ... ok977test app::modules::tests::settings_tab_renders_and_edits_module_settings ... ok978test app::modules::tests::startup_hooks_run_once_and_again_after_re_enable ... ok979test app::modules::tests::turned_off_module_dock_is_not_resurrected_by_a_repush ... ok980test app::persistence::tests::empty_session_capture_preserves_explicit_closed_workspaces ... ok981test app::persistence::tests::failed_session_write_keeps_retry_intent_without_immediate_retry_loop ... ok982test app::persistence::tests::session_ack_preserves_newer_dirty_state_and_final_write_is_last ... ok983test app::picker::tests::a_deferred_backtab_keeps_reverse_direction ... ok984test app::picker::tests::a_late_scan_does_not_release_a_newer_scans_slot ... ok985test app::picker::tests::an_obsolete_scan_does_not_gate_the_next_tab ... ok986test app::picker::tests::complete_go_to_extends_shared_prefix_then_cycles ... ok987test app::picker::tests::complete_go_to_hidden_dirs_follow_prefix_and_show_hidden ... ok988test app::picker::tests::complete_go_to_is_case_insensitive ... ok989test app::picker::tests::complete_go_to_keeps_tilde_stem_and_separator ... ok990test app::picker::tests::complete_go_to_steps_past_an_exact_match ... ok991test app::picker::tests::complete_go_to_unique_match_appends_separator_and_skips_files ... ok992test app::picker::tests::delete_last_path_word_drops_one_component ... ok993test app::picker::tests::go_to_alt_backspace_deletes_a_path_word ... ok994test app::picker::tests::go_to_browses_a_path_without_opening_it ... ok995test app::picker::tests::go_to_candidates_stay_bounded_without_overclaiming ... ok996test app::picker::tests::go_to_completes_symlinked_directories_like_enter_does ... ok997test app::picker::tests::go_to_completion_runs_off_the_app_loop ... ok998test app::picker::tests::go_to_footer_complete_hint_is_clickable ... ok999test app::picker::tests::go_to_keeps_invalid_paths_editable ... ok1000test app::picker::tests::go_to_tab_completes_folders_without_opening ... ok1001test app::picker::tests::go_to_treats_backslash_as_the_os_does ... ok1002test app::picker::tests::home_row_and_go_to_footer_are_interactive ... ok1003test app::picker::tests::navigating_drops_stale_go_to_completions ... ok1004test app::picker::tests::obsolete_go_to_scans_do_not_fill_the_io_queue ... ok1005test app::picker::tests::paste_respects_picker_text_modes ... ok1006test app::picker::tests::pasting_a_path_jumps_the_picker_there ... ok1007test app::picker::tests::picker_browses_and_opens_a_folder ... ok1008test app::picker::tests::picker_home_navigates_once_per_press ... ok1009test app::picker::tests::picker_word_delete_repeats_in_both_text_modes ... ok1010test app::picker::tests::remote_picker_tab_requests_owner_local_machine_form ... ok1011test app::picker::tests::reopening_defers_tab_until_the_abandoned_scan_lands ... ok1012test app::picker::tests::repo_adds_an_open_with_worktree_row_that_shifts_the_indices ... ok1013test app::picker::tests::selecting_the_worktree_row_opens_the_branch_prompt ... ok1014test app::picker::tests::stale_go_to_scans_are_discarded ... ok1015test app::preview::tests::async_preview_layout_reveals_a_committed_offscreen_match ... ok1016test app::preview::tests::document_preview_identity_survives_session_restore ... ok1017test app::preview::tests::explicit_preview_reuses_the_same_tab_without_changing_file_opening ... ok1018test app::preview::tests::mobile_selection_uses_the_footer_free_body_height ... ok1019test app::preview::tests::preview_events_reject_stale_path_kind_and_generation ... ok1020test app::preview::tests::preview_links_use_shared_url_validation_and_stay_in_workspace ... ok1021test app::preview::tests::preview_search_consumes_non_search_shortcuts_before_and_after_commit ... ok1022test app::preview::tests::preview_selection_preserves_non_ascii_whitespace_at_a_wrap_boundary ... ok1023test app::preview::tests::preview_selection_preserves_real_document_line_breaks ... ok1024test app::preview::tests::rendered_links_require_an_explicit_modified_click ... ok1025test app::preview::tests::tracked_markdown_pane_offers_and_opens_a_sibling_preview ... ok1026test app::preview::tests::wrapped_preview_selection_joins_visual_rows_without_a_newline ... ok1027test app::search::tests::altgr_character_is_text_on_windows_and_a_ctrl_chord_elsewhere ... ok1028test app::search::tests::case_toggle_is_available_only_when_output_is_in_scope ... ok1029test app::search::tests::empty_file_scope_recommends_recently_opened_files ... ok1030test app::search::tests::escape_clears_then_closes ... ok1031test app::search::tests::file_catalog_keeps_its_explicit_workspace_root ... ok1032test app::search::tests::finder_file_action_follows_workspace_across_index_shift ... ok1033test app::search::tests::finder_file_actions_preserve_query_letters_and_validate_workspace ... ok1034test app::search::tests::fuzzy_api_is_async_and_returns_typed_navigation_results ... ok1035test app::search::tests::legacy_exact_search_uses_shared_folding_and_original_byte_columns ... ok1036test app::search::tests::match_display_spans_respects_case_mode_and_uses_display_cells ... ok1037test app::search::tests::metadata_uses_cached_pane_title_without_terminal_inspection ... ok1038test app::search::tests::output_ranking_drops_noisy_sparse_subsequences ... ok1039test app::search::tests::overlay_opens_with_navigation_recommendations_and_fuzzy_types ... ok1040test app::search::tests::pasted_text_updates_the_fuzzy_query_once ... ok1041test app::search::tests::search_tab_navigation_starts_a_new_focus_history_branch ... ok1042test app::search::tests::selecting_a_file_uses_the_configured_plain_click_default ... ok1043test app::search::tests::selecting_a_known_session_requests_one_client_handoff ... ok1044test app::search::tests::structured_activation_revalidates_targets ... ok1045test app::search::tests::tab_cycles_finder_scopes_in_both_directions ... ok1046test app::search::tests::unnamed_tab_target_follows_the_tab_across_reordering ... ok1047test app::session_menu::tests::action_key_opens_a_keyboard_session_menu ... ok1048test app::session_menu::tests::cached_rows_are_available_before_discovery_finishes ... ok1049test app::session_menu::tests::failed_delete_clears_pending_and_keeps_the_row ... ok1050test app::session_menu::tests::failed_stop_remains_visible_in_the_matching_menu ... ok1051test app::session_menu::tests::keyboard_navigation_supports_vim_edges_and_q ... ok1052test app::session_menu::tests::loaded_menu_selects_the_current_session_not_new ... ok1053test app::session_menu::tests::open_session_menu_creating_flag_blocks_stop_until_ready ... ok1054test app::session_menu::tests::q_remains_text_inside_the_new_session_prompt ... ok1055test app::session_menu::tests::rows_put_current_then_running_then_stopped ... ok1056test app::session_menu::tests::rows_restore_a_missing_current_session ... ok1057test app::session_menu::tests::stale_preparation_cannot_handoff_after_the_prompt_is_cancelled ... ok1058test app::session_menu::tests::stale_reopened_discovery_cannot_restore_a_deleted_session ... ok1059test app::session_menu::tests::stale_reopened_discovery_cannot_restore_a_running_session_after_stop ... ok1060test app::session_menu::tests::stopped_session_becomes_a_stopped_row_without_an_extra_scan ... ok1061test app::session_menu::tests::stopped_session_delete_action_opens_confirmation ... ok1062test app::settings::tests::a_held_arrow_flips_a_layout_gap_once ... ok1063test app::settings::tests::a_held_prefix_candidate_never_confirms_itself ... ok1064test app::settings::tests::bar_settings_rows_stay_stable_when_placement_changes ... ok1065test app::settings::tests::clicking_a_file_chooser_row_body_selects_it_without_changing_it ... ok1066test app::settings::tests::clicking_a_visible_placement_button_keeps_the_layout_viewport ... ok1067test app::settings::tests::diff_color_setting_cycles_live_and_persists ... ok1068test app::settings::tests::diff_marker_setting_cycles_live_and_persists ... ok1069test app::settings::tests::dock_settings_rows_stay_stable_when_placement_changes ... ok1070test app::settings::tests::every_language_renders_every_settings_tab ... ok1071test app::settings::tests::failed_theme_removal_preserves_a_newer_selection ... ok1072test app::settings::tests::failed_theme_removal_restores_the_previous_selection ... ok1073test app::settings::tests::general_file_click_cycles_between_preview_and_tab ... ok1074test app::settings::tests::general_file_open_cycles_through_editors ... ok1075test app::settings::tests::general_replaces_the_notifications_tab ... ok1076test app::settings::tests::general_shift_enter_cycles_and_drives_the_bytes ... ok1077test app::settings::tests::general_tab_renders_the_file_choosers_then_a_notify_section ... ok1078test app::settings::tests::general_tab_toggles_sounds_and_tests_the_chime ... ok1079test app::settings::tests::installed_theme_is_selectable_and_applies_live ... ok1080test app::settings::tests::installed_theme_remove_action_is_scoped_guarded_and_off_loop ... ok1081test app::settings::tests::missing_configured_theme_falls_back_without_erasing_the_id ... ok1082test app::settings::tests::mobile_width_setting_can_disable_and_restore_automatic_layout ... ok1083test app::settings::tests::new_pane_to_workspace_root_toggle_persists ... ok1084test app::settings::tests::off_loop_registry_reload_swaps_the_dynamic_theme_list ... ok1085test app::settings::tests::prefix_capture_accepts_safe_non_ctrl_keys_and_exact_modifiers ... ok1086test app::settings::tests::prefix_capture_requires_the_same_chord_twice_before_persisting ... ok1087test app::settings::tests::resume_flags_toggle_persists ... ok1088test app::settings::tests::settings_chrome_and_values_follow_the_active_catalog ... ok1089test app::settings::tests::sidebar_widths_are_grouped_in_the_docks_section ... ok1090test app::settings::tests::theme_removal_cancels_when_reselected_before_save_completes ... ok1091test app::settings::tests::theme_removal_save_failure_keeps_the_file_and_restores_selection ... ok1092test app::switcher::tests::altgr_character_is_text_on_windows_and_a_ctrl_chord_elsewhere ... ok1093test app::switcher::tests::compact_mode_and_switcher_jump ... ok1094test app::switcher::tests::compact_reclaims_the_status_row ... ok1095test app::switcher::tests::compact_summary_drops_least_urgent_first ... ok1096test app::switcher::tests::desktop_machine_selector_remains_available_with_sidebar_rows ... ok1097test app::switcher::tests::desktop_switcher_offers_mission_control ... ok1098test app::switcher::tests::filter_narrows_and_scope_isolates_sections ... ok1099test app::switcher::tests::mobile_agents_and_tabs_follow_the_active_workspace ... ok1100test app::switcher::tests::mobile_exit_action_detaches_like_prefix_q ... ok1101test app::switcher::tests::mobile_machine_shell_is_reached_from_the_actions_menu ... ok1102test app::switcher::tests::mobile_navigator_only_closes_from_close_or_activation ... ok1103test app::switcher::tests::mobile_width_is_configurable_and_inclusive ... ok1104test app::switcher::tests::switcher_lists_tabs_and_jumps_to_one ... ok1105test app::switcher::tests::switcher_navigation_starts_a_new_focus_history_branch ... ok1106test app::switcher::tests::switcher_palette_renders_chips_query_and_tabs ... ok1107test app::tests::a_fork_resumes_even_when_the_parent_transcript_is_newer ... ok1108test app::tests::a_hook_reported_session_outranks_another_panes_guess ... ok1109test app::tests::a_pair_too_small_for_two_floors_refuses_the_drag ... ok1110test app::tests::a_pane_click_does_not_start_a_sidebar_resize ... ok1111test app::tests::agent_finish_plays_sound ... ok1112test app::tests::agent_launch_flags_are_captured_in_the_snapshot ... ok1113test app::tests::agent_menu_pins_and_unpins_a_live_agent ... ok1114test app::tests::agent_menu_resumes_and_dismisses_a_session ... ok1115test app::tests::agent_session_persists_and_resumes ... ok1116test app::tests::agents_filter_config_controls_fresh_and_restored_apps ... ok1117test app::tests::agents_list_is_global ... ok1118test app::tests::all_workspace_mission_scope_ignores_a_stale_anchor ... ok1119test app::tests::ambiguous_sessions_across_tabs_are_not_reassigned ... ok1120test app::tests::ambiguous_unbound_sessions_do_not_guess_by_pane_age ... ok1121test app::tests::an_empty_session_still_renders ... ok1122test app::tests::api_worktree_create_uses_configured_module_provider ... FAILED1123test app::tests::api_worktree_remove_protects_live_agent_task_and_lease ... ok1124test app::tests::arrow_keys_focus_panes_and_rebinding_works ... ok1125test app::tests::attach_open_does_not_restore_an_explicitly_closed_workspace ... ok1126test app::tests::attach_open_does_not_steal_focus_from_the_active_workspace ... ok1127test app::tests::backend_create_discarded_after_spawn_reports_started ... ok1128test app::tests::backend_restore_policy_omits_external_panes_and_preserves_live_labels ... ok1129test app::tests::blocked_transition_plays_sound_when_enabled ... ok1130test app::tests::border_only_when_split ... ok1131test app::tests::claude_prompt_methods_reject_theme_picker_but_accept_live_composer ... ok1132test app::tests::click_focuses_pane ... ok1133test app::tests::clicking_another_pane_keeps_the_scrolled_pane_at_its_position ... ok1134test app::tests::clicking_workspace_branch_text_focuses_workspace_without_opening_git ... ok1135test app::tests::close_tab_removes_it_and_its_panes ... ok1136test app::tests::closing_an_auto_opened_workspace_keeps_restored_focus_renderable ... ok1137test app::tests::closing_last_pane_opens_a_home_terminal_and_accepts_new_tab ... ok1138test app::tests::closing_the_last_workspace_opens_a_home_terminal_without_resurrecting_one ... ok1139test app::tests::codex_pane_menu_hides_fork_without_an_exact_session ... ok1140test app::tests::codex_pane_menu_offers_and_runs_native_fork ... ok1141test app::tests::copy_mode_counts_rows_and_moves_by_half_pages ... ok1142test app::tests::copy_mode_word_end_stops_on_the_last_cell_of_each_word ... ok1143test app::tests::dashboards_render_at_extreme_sizes ... ok1144test app::tests::deferred_workspace_actions_abort_after_target_closes ... ok1145test app::tests::delete_worktree_absent_for_a_plain_workspace ... ok1146test app::tests::detect_tick_dirties_when_an_idle_non_resumable_agent_appears ... ok1147test app::tests::detect_tick_keeps_session_brand_when_screen_lacks_name ... ok1148test app::tests::devin_restores_its_exact_binding_without_replaying_the_briefing ... ok1149test app::tests::dock_cycle_skips_a_full_side ... ok1150test app::tests::dock_row_menu_is_declared_per_row_and_survives_a_repaint ... ok1151test app::tests::docks_move_and_module_dock_lifecycle ... ok1152test app::tests::done_chime_debounced_and_rings_per_finish ... ok1153test app::tests::dragging_a_dock_divider_trades_rows_between_its_pair_only ... ok1154test app::tests::dragging_a_rendered_dock_divider_by_one_row_moves_it_exactly_one_row ... ok1155test app::tests::dragging_one_of_three_dock_dividers_leaves_the_untouched_dock_still ... ok1156test app::tests::dragging_the_left_sidebar_edge_resizes_and_persists ... ok1157test app::tests::every_copy_mode_motion_family_has_a_reference_row_and_a_live_handler ... ok1158test app::tests::exited_agent_becomes_shell_and_is_not_resumed ... ok1159test app::tests::failed_process_scan_keeps_cache_but_releases_stale_detection_evidence ... ok1160test app::tests::failing_to_open_a_node_is_reported_not_swallowed ... ok1161test app::tests::forced_worktree_remove_closes_cross_workspace_pane_in_deleted_cwd ... ok1162test app::tests::forced_worktree_remove_closes_nested_symlink_owners ... ok1163test app::tests::forced_worktree_remove_preserves_pane_through_outbound_symlink ... ok1164test app::tests::fork_from_mission_control_uses_the_agents_real_tab ... ok1165test app::tests::fork_pane_splits_a_fork_capable_agent ... ok1166test app::tests::fork_pane_splits_a_grok_session ... ok1167test app::tests::forking_then_restoring_keeps_parent_and_fork_on_their_own_sessions ... ok1168test app::tests::from_config_discards_a_weight_list_of_the_wrong_length ... ok1169test app::tests::hidden_sidebar_zeroes_all_dock_geometry_including_module_docks ... ok1170test app::tests::keyboard_copy_mode_navigates_and_yanks_wide_cells ... ok1171test app::tests::keyboard_copy_preserves_selected_transcript_indentation ... ok1172test app::tests::keyboard_resize_mode_enters_resizes_and_exits ... ok1173test app::tests::late_native_scan_cannot_reclassify_removed_reported_usage ... ok1174test app::tests::launch_options_are_captured_per_pane_not_shared ... ok1175test app::tests::launch_options_never_cross_between_agents ... ok1176test app::tests::mission_control_blocked_hint_and_answer_input ... ok1177test app::tests::mission_control_lists_agents_and_jumps ... ok1178test app::tests::mission_control_scope_tabs_include_every_workspace_without_row_clicks ... ok1179test app::tests::mission_control_shows_usage_and_resumables ... ok1180test app::tests::mission_usage_refresh_is_demand_driven ... ok1181test app::tests::mission_usage_refreshes_when_switching_between_workspace_dashboards ... ok1182test app::tests::modals_render_in_the_selected_language ... ok1183test app::tests::module_agent_title_owners_cannot_overwrite_or_clear_each_other ... ok1184test app::tests::module_agent_titles_apply_to_live_and_resumable_without_using_alias ... ok1185test app::tests::mounting_a_dock_appends_the_rounded_average_weight ... ok1186test app::tests::mouse_drag_resizes_pane_and_content_press_still_selects ... ok1187test app::tests::mouse_tracking_owns_drags_but_right_click_opens_the_pane_menu ... ok1188test app::tests::move_dock_keeps_remaining_weights_aligned_on_both_sides ... ok1189test app::tests::move_dock_onto_its_own_side_keeps_order_and_weights ... ok1190test app::tests::move_pane_to_tab_reparents_and_keeps_the_process ... ok1191test app::tests::move_to_tab_submenu_opens_on_hover_and_moves_on_click ... ok1192test app::tests::multiple_worktrees_and_an_orphan ... ok1193test app::tests::new_worktree_prompt_backdrop_click_cancels_but_body_click_is_inert ... ok1194test app::tests::node_scoped_api_reports_no_session_instead_of_panicking ... ok1195test app::tests::only_the_rendered_sidebar_rules_resize_and_highlight ... ok1196test app::tests::open_workspace_menu_reuses_snapshotted_repo_capability ... ok1197test app::tests::open_worktree_enter_focuses_an_already_open_checkout ... ok1198test app::tests::open_worktree_list_reports_a_full_filesystem_queue ... ok1199test app::tests::open_worktree_list_scans_off_loop_on_the_bounded_executor ... ok1200test app::tests::open_worktree_lists_every_checkout_and_opens_one ... ok1201test app::tests::open_worktree_modal_click_opens_the_row_under_the_pointer ... ok1202test app::tests::open_worktree_modal_hovering_a_row_repaints_it ... ok1203test app::tests::open_worktree_modal_keeps_path_and_badge_under_a_long_branch_name ... ok1204test app::tests::open_worktree_modal_renders_branches_and_badges ... ok1205test app::tests::open_worktree_modal_truncates_wide_glyph_paths_by_columns ... ok1206test app::tests::opencode_prompt_methods_wait_for_live_composer ... ok1207test app::tests::opening_an_already_open_node_focuses_it_instead_of_duplicating ... ok1208test app::tests::orchestration_flow_over_the_api ... ok1209test app::tests::orchestration_routes_tasks_and_leases_by_project ... ok1210test app::tests::orchestration_uses_the_focused_repository_beside_a_non_repo_workspace ... ok1211test app::tests::pane_content_edge_starts_selection_instead_of_sidebar_resize ... ok1212test app::tests::pane_menu_shows_the_real_running_command ... ok1213test app::tests::pane_menu_splits_closes_and_skips_dashboards ... ok1214test app::tests::pane_move_validates_before_detaching_and_excludes_dashboards ... ok1215test app::tests::pane_name_survives_a_restart ... ok1216test app::tests::pane_navigation_includes_commander_and_restores_origin_on_escape ... ok1217test app::tests::pane_navigation_passes_the_first_mouse_event_to_its_target ... ok1218test app::tests::pane_navigation_stays_in_current_tab_and_hjkl_remains_one_step ... ok1219test app::tests::pane_osc52_store_queues_pending_clipboard ... ok1220test app::tests::pane_screen_opt_out_ignores_and_schedules_scrubbing_of_existing_content ... ok1221test app::tests::paste_fills_an_open_text_input_modal_not_the_pane ... ok1222test app::tests::picker_w_creates_a_worktree_only_on_a_repo ... ok1223test app::tests::plain_keystroke_does_not_mark_the_ui_dirty ... ok1224test app::tests::prefix_arrow_previews_panes_until_enter_or_escape ... ok1225test app::tests::prefix_chord_variants ... ok1226test app::tests::prefix_y_starts_copy_mode ... ok1227test app::tests::removing_a_dock_keeps_sibling_weights_and_round_trips ... ok1228test app::tests::repaint_without_the_agent_name_stays_idle ... ok1229test app::tests::reported_session_has_one_owner_and_closing_that_pane_prunes_its_usage ... ok1230test app::tests::reported_session_rejects_unknown_fields_agents_and_unsafe_ids_without_mutation ... ok1231test app::tests::reported_session_release_is_idempotent_identity_fenced_and_persistent ... ok1232test app::tests::reported_session_usage_is_validated_ordered_and_scan_safe ... ok1233test app::tests::reported_usage_uses_the_same_pricing_override_as_native_usage ... ok1234test app::tests::resize_grab_zone_does_not_reach_into_pane_content ... ok1235test app::tests::resize_grace_expiry_wakes_and_reclassifies_once ... ok1236test app::tests::resize_yields_to_pane_close_button ... ok1237test app::tests::restore_survives_a_deleted_pane_cwd ... ok1238test app::tests::resume_session_from_empty_creates_its_workspace ... ok1239test app::tests::resume_uses_resolved_destination_when_alias_changes_before_completion ... ok1240test app::tests::right_click_on_a_module_dock_row_opens_its_menu ... ok1241test app::tests::right_sidebar_draws_and_guards_panes ... ok1242test app::tests::scoped_mission_usage_refresh_preserves_other_workspace_cache_entries ... ok1243test app::tests::scroll_mode_navigates_and_exits ... ok1244test app::tests::scrolling_back_does_not_read_as_working ... ok1245test app::tests::selection_uses_linear_reading_order_between_lines ... ok1246test app::tests::session_roundtrip ... ok1247test app::tests::settings_language_tab_swaps_catalog_and_persists ... ok1248test app::tests::settings_modal_interactions ... ok1249test app::tests::settings_modal_widens_to_fit_wide_language_tabs ... ok1250test app::tests::settings_slider_arrows_step_both_ways ... ok1251test app::tests::shift_v_never_enters_copy_mode ... ok1252test app::tests::sidebar_dock_cap_is_enforced ... ok1253test app::tests::sidebar_drag_clamps_and_never_crushes_the_content ... ok1254test app::tests::sidebar_lists_scroll ... ok1255test app::tests::sidebar_path_toggles_persist_independently ... ok1256test app::tests::sidebars_migrate_from_legacy_width ... ok1257test app::tests::snapshot_keeps_the_active_tab_when_an_earlier_external_tab_is_omitted ... ok1258test app::tests::spawn_cwds_skips_missing_dirs_and_anchors_on_home ... ok1259test app::tests::splits_both_directions ... ok1260test app::tests::stacked_bottom_pane_title_zoom_and_body_are_all_clickable ... ok1261test app::tests::stale_files_rects_do_not_swallow_workspace_clicks ... ok1262test app::tests::stale_named_app_change_does_not_restore_an_old_theme ... ok1263test app::tests::stale_or_degenerate_dock_weights_fall_back_to_an_even_split ... ok1264test app::tests::stale_worktree_list_result_is_dropped ... ok1265test app::tests::tab_context_menu_reorders_swaps_and_renames_its_exact_target ... ok1266test app::tests::tab_move_is_correct_for_every_source_destination_and_active_position ... ok1267test app::tests::tab_move_preserves_the_active_tab_identity ... ok1268test app::tests::tab_rename_sets_name_persists_and_excludes_dashboards ... ok1269test app::tests::tabbar_scrolls_when_full ... ok1270test app::tests::tapping_the_zoom_button_toggles_fullscreen ... ok1271test app::tests::task_update_rejects_all_fields_after_merge_starts ... ok1272test app::tests::text_modal_swallowing_a_click_does_not_close_bar_overflow ... ok1273test app::tests::toast_shows_then_expires ... ok1274test app::tests::two_panes_in_one_folder_do_not_resume_the_same_session ... ok1275test app::tests::typing_is_not_mistaken_for_agent_working ... ok1276test app::tests::ui_renders_in_the_selected_language ... ok1277test app::tests::unchanged_panes_reuse_cached_detection_text ... ok1278test app::tests::unresolved_worktree_delete_allows_unrelated_workspace_resume_and_backend ... ok1279test app::tests::working_agent_shows_filled_status ... ok1280test app::tests::workspace_menu_dismisses_when_its_target_was_closed ... ok1281test app::tests::workspace_menu_follows_target_identity_after_an_index_shift ... ok1282test app::tests::workspace_open_focuses_existing_or_creates_new ... ok1283test app::tests::workspace_open_uses_checked_symlink_target_during_delete ... ok1284test app::tests::workspace_rename_arrows_move_the_caret_instead_of_typing_at_the_end ... ok1285test app::tests::workspace_rename_keeps_target_identity_while_modal_is_open ... ok1286test app::tests::workspace_terminal_cwd_follows_the_focused_pane ... ok1287test app::tests::worktree_create_pending_is_carried_in_the_error_message ... ok1288test app::tests::worktree_delete_confirm_cancels_and_guards ... ok1289test app::tests::worktree_delete_full_queue_leaves_workspace_and_checkout_intact ... ok1290test app::tests::worktree_delete_pending_blocks_agent_resume_before_pane_spawn ... ok1291test app::tests::worktree_delete_pending_path_cannot_be_reopened ... ok1292test app::tests::worktree_delete_pending_rejects_backend_create_in_nested_path ... ok1293test app::tests::worktree_delete_pending_rejects_backend_sibling_in_checkout ... ok1294test app::tests::worktree_delete_progress_keys_do_not_collide_for_similar_names ... ok1295test app::tests::worktree_delete_rechecks_new_nested_workspace_after_resolution ... ok1296test app::tests::worktree_delete_rechecks_stale_symlink_workspace_identity ... ok1297test app::tests::worktree_delete_rejects_a_main_checkout_even_with_stale_sidebar_metadata ... ok1298test app::tests::worktree_delete_rejects_an_existing_nested_workspace ... ok1299test app::tests::worktree_delete_rejects_an_existing_symlinked_nested_workspace ... ok1300test app::tests::worktree_delete_rejects_another_open_workspace_at_the_target ... ok1301test app::tests::worktree_delete_rejects_replacement_at_the_confirmed_path ... ok1302test app::tests::worktree_delete_runs_off_loop_and_keeps_the_branch ... ok1303test app::tests::worktree_delete_second_admission_rejection_keeps_checkout_open ... ok1304test app::tests::worktree_list_renders_control_characters_in_paths_visibly ... ok1305test app::tests::worktree_list_renders_its_loading_row ... ok1306test app::tests::worktree_list_resolves_the_open_badge_on_the_worker ... ok1307test app::tests::worktree_list_shows_the_git_error_in_the_modal ... ok1308test app::tests::worktree_prompt_surfaces_errors_instead_of_silently_failing ... ok1309test app::tests::worktree_remove_completion_reconciles_changed_ownership ... ok1310test app::tests::worktrees_group_under_their_parent ... ok1311test app::tests::ws_menu_pins_and_unpins_and_floats_to_top ... ok1312test app::tests::ws_menu_quick_actions_holds_the_copy_rows_and_queues_their_values ... ok1313test app::tests::ws_quick_actions_drop_copy_branch_without_a_branch ... ok1314test app::tests::ws_quick_actions_submenu_hover_click_and_keyboard ... ok1315test automation::persist::tests::corrupt_ledger_is_quarantined_before_default_load ... ok1316test automation::persist::tests::oversized_definition_set_is_quarantined_instead_of_truncated ... ok1317test automation::persist::tests::syntactically_valid_unsafe_ledger_is_quarantined ... ok1318test automation::schedule::tests::daily_preserves_wall_clock_across_dst ... ok1319test automation::schedule::tests::daily_rolls_forward_in_utc ... ok1320test automation::schedule::tests::dst_gap_moves_forward_and_fold_runs_only_the_earlier_instant ... ok1321test automation::schedule::tests::interval_skips_directly_to_nearest_occurrence ... ok1322test automation::schedule::tests::rejects_unknown_timezone ... ok1323test automation::schedule::tests::validation_rejects_fast_or_invalid_schedules ... ok1324test automation::schedule::tests::weekly_uses_iso_weekdays ... ok1325test automation::schedule::tests::zero_interval_never_schedules ... ok1326test automation::tests::absolute_times_are_explicitly_utc ... ok1327test automation::tests::active_agent_target_requires_a_lowercase_terminal_lifetime_id ... ok1328test automation::tests::create_accepts_newlines_but_rejects_other_terminal_controls_in_prompt ... ok1329test automation::tests::create_is_idempotent_and_collision_safe ... ok1330test automation::tests::disabling_cancels_queued_work_and_expired_once_cannot_be_reenabled ... ok1331test automation::tests::due_occurrence_is_created_once_and_schedule_advances ... ok1332test automation::tests::durable_identity_persists_privately_while_runtime_binding_state_does_not ... ok1333test automation::tests::legacy_definitions_and_runs_default_to_new_workers ... ok1334test automation::tests::legacy_task_templates_default_to_workspace_access ... ok1335test automation::tests::one_shot_disables_after_its_occurrence ... ok1336test automation::tests::overlap_is_recorded_without_a_second_pending_run ... ok1337test automation::tests::persisted_run_error_truncation_includes_the_ellipsis_in_its_limit ... ok1338test automation::tests::persistence_restores_ids_and_deadline_cache ... ok1339test automation::tests::pre_rename_active_agent_target_alias_loads_but_serializes_canonically ... ok1340test automation::tests::public_active_target_never_exposes_private_rebind_identity ... ok1341test automation::tests::queue_one_never_accumulates_more_than_one_pending_occurrence ... ok1342test automation::tests::retry_at_the_due_second_does_not_hide_the_scheduled_occurrence ... ok1343test automation::tests::retry_creates_a_new_run_from_the_original_snapshot ... ok1344test automation::tests::review_retry_supersedes_the_source_run_without_reusing_its_task ... ok1345test automation::tests::run_latest_materializes_only_the_newest_missed_occurrence ... ok1346test automation::tests::run_retry_returns_the_original_occurrence ... ok1347test automation::tests::run_snapshots_trigger_policy_and_task_before_definition_edits ... ok1348test automation::tests::shared_definition_events_exclude_task_content ... ok1349test automation::worker::tests::extracts_task_status_only_from_a_successful_task_response ... ok1350test automation::worker::tests::rejects_malformed_private_worker_invocations_before_connecting ... ok1351test automation::worker::tests::runner_briefing_preserves_the_snapshotted_contract ... ok1352test bar::render::tests::spacer_and_separator_click_values_reach_the_hit_target ... ok1353test bar::render::tests::top_overflow_reserves_its_anchor_row_without_losing_a_fitting_item ... ok1354test bar::render::tests::working_state_uses_static_filled_marker ... ok1355test bar::tests::click_capable_segments_keep_their_string_value ... ok1356test bar::tests::composer_uses_full_then_compact_then_deterministic_overflow ... ok1357test bar::tests::configured_core_agent_summary_still_obeys_compact_visibility ... ok1358test bar::tests::controls_and_oversized_values_are_rejected_before_mutation ... ok1359test bar::tests::documented_progress_segment_keeps_its_numeric_value ... ok1360test bar::tests::every_segment_primitive_composes_in_order_and_measures_cells ... ok1361test bar::tests::notifications_are_bounded_deduped_and_expire ... ok1362test bar::tests::one_top_widget_can_show_100_ascii_characters_when_space_allows ... ok1363test bar::tests::progress_width_defaults_to_eight_and_stays_bounded ... ok1364test bar::tests::segments_round_trip_through_json_without_a_duplicate_value_key ... ok1365test bar::tests::the_documented_content_example_parses_and_validates ... ok1366test bar::tests::tone_from_name_accepts_the_json_spellings_and_rejects_the_rest ... ok1367test bar::tests::tone_from_name_matches_the_serde_spelling_of_every_variant ... ok1368test bar::tests::top_budget_contract_preserves_navigation_and_caps_at_100_columns ... ok1369test bar::tests::update_and_notification_limits_are_bounded ... ok1370test changelog::tests::changelog_is_embedded_and_ordered ... ok1371test changelog::tests::classifies_lines ... ok1372test changelog::tests::embedded_notes_keep_contributors_and_drop_the_footer ... ok1373test changelog::tests::keeps_bold_area_and_trailing_release_links ... ok1374test changelog::tests::keeps_link_urls_as_segments ... ok1375test changelog::tests::strips_bold_code_and_links ... ok1376test cli::tests::agent_authority_and_process_commands_map_to_structured_api ... ok1377test cli::tests::agent_docs_are_published_and_linked_from_help ... ok1378test cli::tests::agent_list_requires_an_exact_subcommand_shape ... ok1379test cli::tests::agent_wait_status_sets_fall_back_for_older_servers ... ok1380test cli::tests::api_proxy_exit_code_distinguishes_protocol_errors ... ok1381test cli::tests::api_proxy_rejects_mismatched_response_ids ... ok1382test cli::tests::cli_error_localization_translates_catalogued_diagnostics_only ... ok1383test cli::tests::complete_help_translates_every_human_line ... ok1384test cli::tests::docs_cli_reference_matches_help ... ok1385test cli::tests::every_command_family_localizes_in_every_supported_language ... ok1386test cli::tests::family_help_lists_only_commands_owned_by_that_family ... ok1387test cli::tests::integration_help_and_docs_name_omp_not_pi ... ok1388test cli::tests::integration_help_tracks_the_native_adapter_registry ... ok1389test cli::tests::leaf_help_still_selects_only_the_requested_command ... ok1390test cli::tests::maps_agent_automation_commands ... ok1391test cli::tests::maps_agent_fork_and_rejects_ambiguous_syntax ... ok1392test cli::tests::maps_commands ... ok1393test cli::tests::maps_diff_review_commands ... ok1394test cli::tests::maps_git_commands ... ok1395test cli::tests::maps_luvus_bar_and_notification_commands ... ok1396test cli::tests::maps_mission_control_command ... ok1397test cli::tests::maps_module_commands ... ok1398test cli::tests::maps_orchestration_commands ... ok1399test cli::tests::maps_pane_and_tab_moves_and_rejects_bad_syntax ... ok1400test cli::tests::maps_sidebar_dock_commands ... ok1401test cli::tests::maps_workspace_organization_and_rejects_bad_syntax ... ok1402test cli::tests::maps_worktree_commands ... ok1403test cli::tests::normal_and_group_help_detection_remains_intact ... ok1404test cli::tests::observed_prompt_cli_preserves_invocations_and_exit_codes ... ok1405test cli::tests::pane_report_event_forwards_notification_type ... ok1406test cli::tests::pane_send_requests_atomic_paste_semantics ... ok1407test cli::tests::parses_agent_start_target ... ok1408test cli::tests::parses_wait ... ok1409test cli::tests::pass_through_commands_preserve_trailing_help_payloads ... ok1410test cli::tests::search_keeps_exact_contract_and_fuzzy_is_explicit ... ok1411test cli::tests::session_help_and_skill_states_use_the_cli_catalog ... ok1412test cli::tests::skill_management_exposes_one_bundled_skill ... ok1413test cli::tests::socket_permission_errors_are_not_reported_as_an_offline_server ... ok1414test cli::tests::status_card_keeps_the_bug_and_rows_aligned ... ok1415test cli::tests::tab_rename_validates_optional_target_and_name_length ... ok1416test cli::tests::task_prompt_file_is_bounded_and_maps_to_the_prompt_field ... ok1417test cli::tests::theme_cli_is_recognized_and_validates_command_shapes ... ok1418test cli::tests::theme_use_reports_a_config_write_failure ... ok1419test cli::tests::uhp_help_includes_transport_neutral_access ... ok1420test cli::tests::uhp_is_the_single_public_protocol_cli_route ... ok1421test cli::tests::unknown_method_detection_is_method_specific ... ok1422test cli::tests::unreleased_api_aliases_are_rejected ... ok1423test cli::tests::unsupported_keys_explain_wsl_repairs_without_calling_luvus_broken ... ok1424test cli::tests::update_is_a_top_level_local_cli_command ... ok1425test cli::tests::wait_agent_status_set_uses_old_server_event_stream_for_transient_match ... ok1426test cli::tests::wait_agent_status_singular_keeps_old_server_event_stream_fallback ... ok1427test cli::tests::wait_status_poll_is_bounded_and_propagates_server_errors ... ok1428test cli::tests::wait_status_stream_keeps_an_absolute_deadline_during_unrelated_events ... ok1429test cli::tests::wait_status_stream_returns_timeout_code_when_stream_closes_mid_wait ... ok1430test clipboard::native::tests::clipboard_confirmation_requires_native_success ... ok1431test clipboard::native::tests::clipboard_failure_falls_through_to_next_helper ... ok1432test clipboard::native::tests::clipboard_inherits_client_wayland_socket ... ok1433test clipboard::native::tests::clipboard_nonreading_helper_is_bounded ... ok1434test clipboard::native::tests::clipboard_preserves_unicode_and_newlines ... ok1435test clipboard::native::tests::clipboard_waiting_helper_is_bounded ... ok1436test clipboard::native::tests::clipboard_wayland_round_trip ... ignored, requires an isolated Wayland compositor and wl-clipboard1437test clipboard::native::tests::clipboard_worker_retries_failed_start_and_reuses_success ... ok1438test clipboard::tests::clipboard_completion_is_coalesced_and_consumed_once ... ok1439test clipboard::tests::clipboard_retired_completion_rejects_late_results ... ok1440test clipboard_image::tests::bottom_up_24_bit_dib_preserves_rows_and_colors ... ok1441test clipboard_image::tests::browser_png_staging_decodes_strict_bounded_base64 ... ok1442test clipboard_image::tests::discarded_staged_images_are_removed_without_touching_other_files ... ok1443test clipboard_image::tests::exact_image_paste_chords_exclude_alt_and_repeats ... ok1444test clipboard_image::tests::malformed_or_compressed_dib_fails_closed ... ok1445test clipboard_image::tests::registered_png_trims_allocator_padding_at_the_valid_end_marker ... ok1446test clipboard_image::tests::rgba_encoder_produces_a_bounded_structural_png ... ok1447test clipboard_image::tests::staging_cleanup_is_bounded_and_preserves_unowned_files ... ok1448test clipboard_image::tests::staging_uses_selected_private_session_storage ... ok1449test clipboard_image::tests::top_down_v5_bitfields_preserve_alpha ... ok1450test clipboard_image::tests::validator_rejects_dimensions_that_imply_excessive_decode_memory ... ok1451test commander::targets::tests::escaped_pane_mentions_are_literal_without_escape_slash ... ok1452test config::tests::agents_filter_preference_persists_both_choices ... ok1453test config::tests::agents_scope_preference_persists_both_choices ... ok1454test config::tests::defaults_and_roundtrip ... ok1455test config::tests::explicit_bar_placement_is_distinct_from_a_default_fallback ... ok1456test config::tests::stale_named_server_changes_preserve_newer_shared_fields ... ok1457test config::tests::v2_migrates_the_old_switcher_default_without_overriding_new_choices ... ok1458test detect::tests::a_blocked_title_still_blocks_claude_with_a_live_prompt ... ok1459test detect::tests::a_glyph_led_conversation_line_is_not_claude_status ... ok1460test detect::tests::a_relayed_prompt_footer_does_not_block_a_thinking_claude ... ok1461test detect::tests::agent_output_without_a_marker_is_idle ... ok1462test detect::tests::arc_studio_banner_above_blank_footer_identifies_first_frame ... ok1463test detect::tests::arc_studio_identity_matches_its_cli_and_scoped_node_package ... ok1464test detect::tests::arc_studio_login_above_a_tall_blank_footer_stays_blocked ... ok1465test detect::tests::arc_studio_tui_state_follows_work_and_question_evidence ... ok1466test detect::tests::braille_blank_padding_is_not_a_spinner ... ok1467test detect::tests::claude_approval_prose_without_controls_is_idle ... ok1468test detect::tests::claude_command_approval_screen_is_blocked ... ok1469test detect::tests::claude_menus_are_never_a_live_composer ... ok1470test detect::tests::claude_plan_approval_screen_is_blocked ... ok1471test detect::tests::claude_still_reads_working_from_its_status_line_above_the_prompt ... ok1472test detect::tests::claude_theme_picker_is_unknown_without_a_live_composer ... ok1473test detect::tests::codex_folder_trust_screen_is_blocked ... ok1474test detect::tests::codex_prompt_marker_text_alone_is_not_positive_prompt_evidence ... ok1475test detect::tests::codex_sign_in_above_blank_footer_blocks_prompt_submission ... ok1476test detect::tests::devin_identity_needs_deliberate_evidence ... ok1477test detect::tests::devin_state_reads_its_trust_and_interrupt_screens ... ok1478test detect::tests::devin_trust_screen_sits_above_the_bottom_rows ... ok1479test detect::tests::fx_identity_uses_process_or_title_not_incidental_output ... ok1480test detect::tests::fx_idle_prompt_ignores_terminal_probe_activity ... ok1481test detect::tests::fx_native_activity_rows_report_working ... ok1482test detect::tests::fx_native_interactions_report_blocked ... ok1483test detect::tests::grok_busy_footer_is_working ... ok1484test detect::tests::grok_permission_card_is_blocked ... ok1485test detect::tests::grok_running_a_subagent_is_working ... ok1486test detect::tests::half_circle_busy_spinner_reads_working ... ok1487test detect::tests::hermes_identity_accepts_native_and_python_launchers_without_trusting_prose ... ok1488test detect::tests::hermes_state_requires_visible_interaction_evidence ... ok1489test detect::tests::interpreter_script_slot_ignores_agent_looking_loader ... ok1490test detect::tests::interpreter_script_slot_skips_loader_value ... ok1491test detect::tests::interpreter_script_slot_skips_require_value ... ok1492test detect::tests::interpreter_script_slot_unwraps_env_key_value ... ok1493test detect::tests::interrupt_hint_is_working ... ok1494test detect::tests::kilo_uses_process_identity_and_generic_state_rules ... ok1495test detect::tests::kimi_approval_panel_is_blocked ... ok1496test detect::tests::kimi_moon_spinner_is_working ... ok1497test detect::tests::known_agent_stays_idle_when_its_name_is_off_screen ... ok1498test detect::tests::later_equal_priority_rule_overrides_managed_rule ... ok1499test detect::tests::launch_args_extracted_after_the_agent_token ... ok1500test detect::tests::letta_identity_uses_the_binary_or_exact_scoped_package ... ok1501test detect::tests::letta_state_uses_its_documented_terminal_title_contract ... ok1502test detect::tests::managed_ota_manifests_load_from_the_managed_subdir ... ok1503test detect::tests::manifest_parses_accepts_valid_and_rejects_garbage ... ok1504test detect::tests::menu_words_in_claude_transcript_do_not_block_its_live_prompt ... ok1505test detect::tests::muse_identity_accepts_native_binaries_without_trusting_prose ... ok1506test detect::tests::muse_identity_replace_disables_the_versioned_binary_matcher ... ok1507test detect::tests::muse_native_interactions_override_the_working_hint ... ok1508test detect::tests::newer_claude_token_counter_reads_working ... ok1509test detect::tests::omp_title_states_work_without_the_optional_integration ... ok1510test detect::tests::only_claude_skips_transcript_menu_words ... ok1511test detect::tests::opencode_requires_live_composer_evidence ... ok1512test detect::tests::opencode_v2_preview_name_normalizes_to_the_canonical_agent ... ok1513test detect::tests::ordinary_words_do_not_name_an_agent ... ok1514test detect::tests::overlap_priority_keeps_omp_ahead_of_pi_independent_of_registry_order ... ok1515test detect::tests::permission_prompt_is_blocked ... ok1516test detect::tests::quiet_is_idle ... ok1517test detect::tests::running_process_outranks_screen_text ... ok1518test detect::tests::scoped_pi_packages_distinguish_omp_from_pi ... ok1519test detect::tests::selection_menu_is_blocked_not_working ... ok1520test detect::tests::shell_output_is_working_fallback ... ok1521test detect::tests::spinner_is_working_even_while_typing ... ok1522test detect::tests::successful_process_scan_replaces_a_stale_identity ... ok1523test detect::tests::successful_process_scan_without_agent_is_command_fallback ... ok1524test detect::tests::tall_interaction_panels_use_non_empty_screen_rows ... ok1525test detect::tests::typing_at_prompt_is_idle ... ok1526test detect::tests::user_manifest_can_refine_and_add_agent_identity ... ok1527test detect::tests::user_manifest_rule_overrides_by_priority ... ok1528test diff::git::tests::final_untracked_nul_just_past_cap_keeps_the_complete_path ... ok1529test diff::git::tests::oversized_untracked_listing_preserves_tracked_changes ... ok1530test diff::git::tests::parses_numstat_paths_renames_and_binary_files ... ok1531test diff::git::tests::parses_patch_line_numbers ... ok1532test diff::git::tests::parses_rename_paths_without_arrow_syntax ... ok1533test diff::git::tests::parses_staged_and_worktree_as_distinct_diffs ... ok1534test diff::git::tests::real_repo_expands_untracked_directories_into_previewable_files ... ok1535test diff::git::tests::real_repo_keeps_index_and_worktree_layers_and_never_mutates_git ... ok1536test diff::git::tests::real_repo_matches_worktree_counts_after_staged_rename ... ok1537test diff::git::tests::real_repo_reads_untracked_text_without_running_a_diff_driver ... ok1538test diff::git::tests::strips_terminal_controls_from_patch_rows ... ok1539test diff::git::tests::tree_tint_preserves_a_symlinked_visible_root ... ok1540test diff::git::tests::tree_tint_uses_nested_visible_spelling_and_new_rename_path ... ok1541test diff::message::tests::handoff_quotes_prompt_like_paths_notes_and_context ... ok1542test diff::model::tests::horizontal_visibility_clamps_without_hiding_the_selected_line ... ok1543test diff::model::tests::parsed_cache_never_reuses_a_stale_file_fingerprint ... ok1544test diff::model::tests::prepared_diff_shares_text_and_builds_navigation_indices ... ok1545test diff::model::tests::repo_path_preserves_non_utf8_bytes ... ok1546test diff::model::tests::repo_path_round_trips_and_rejects_escape ... ok1547test diff::model::tests::responsive_layouts_keep_wrapping_when_the_viewport_falls_back_to_stack ... ok1548test diff::model::tests::row_rebuild_preserves_detached_scroll_until_selection_moves ... ok1549test diff::model::tests::search_refresh_rebuilds_committed_rows_without_committing_editor_input ... ok1550test diff::model::tests::split_rows_map_to_stack_rows_on_the_selected_side ... ok1551test diff::model::tests::wrapping_does_not_force_a_wide_split_view_into_stack ... ok1552test diff::notes::tests::api_anchor_context_bounds_requested_ranges ... ok1553test diff::notes::tests::api_anchor_context_requires_real_lines_on_the_selected_side ... ok1554test diff::notes::tests::invalid_batch_creates_no_notes ... ok1555test diff::notes::tests::legacy_review_notes_move_to_the_diff_notes_directory ... ok1556test diff::notes::tests::note_storage_round_trips_and_rejects_stale_revision ... ok1557test diff::notes::tests::reconciliation_marks_missing_context_outdated ... ok1558test diff::notes::tests::reconciliation_moves_only_to_one_matching_context ... ok1559test diff::notes::tests::single_note_storage_enforces_capacity_under_the_review_lock ... ok1560test diff::rows::tests::split_projection_aligns_replacement_blocks_without_dropping_lines ... ok1561test event::tests::resource_limit_signals_use_stable_names ... ok1562test files::preview::layout::tests::headings_hide_markdown_markers_and_keep_visual_hierarchy ... ok1563test files::preview::layout::tests::table_emission_stops_at_the_layout_row_limit ... ok1564test files::preview::layout::tests::wrapping_is_width_bounded_and_preserves_roles ... ok1565test files::preview::markdown::parser::tests::inline_code_remains_inside_its_table_cell ... ok1566test files::preview::markdown::parser::tests::parses_gfm_blocks_and_embedded_mermaid ... ok1567test files::preview::markdown::parser::tests::raw_html_remains_text ... ok1568test files::preview::mermaid::canvas::tests::wide_glyph_continuations_do_not_add_output_columns ... ok1569test files::preview::mermaid::graph::layout::tests::ascii_mode_keeps_the_spatial_layout_without_unicode_glyphs ... ok1570test files::preview::mermaid::graph::layout::tests::branching_flowchart_keeps_spatial_nodes_and_routes ... ok1571test files::preview::mermaid::graph::layout::tests::dense_rank_falls_back_instead_of_exceeding_the_pane ... ok1572test files::preview::mermaid::graph::layout::tests::horizontal_branching_flowchart_uses_columns_when_it_fits ... ok1573test files::preview::mermaid::graph::layout::tests::narrow_diagrams_decline_to_the_existing_outline_fallback ... ok1574test files::preview::mermaid::graph::layout::tests::oversized_spatial_canvas_uses_the_bounded_chain_fallback ... ok1575test files::preview::mermaid::graph::layout::tests::rank_assignment_breaks_cycles_without_losing_edges ... ok1576test files::preview::mermaid::graph::layout::tests::reverse_directions_put_arrows_toward_the_requested_flow ... ok1577test files::preview::mermaid::graph::tests::cycles_are_bounded_and_deterministic ... ok1578test files::preview::mermaid::graph::tests::parses_and_renders_a_chain ... ok1579test files::preview::mermaid::graph::tests::parses_edge_label_forms_and_preserves_node_shapes ... ok1580test files::preview::mermaid::graph::tests::wide_node_labels_do_not_overwrite_box_borders ... ok1581test files::preview::mermaid::sequence::tests::sequence_uses_a_compact_outline_when_narrow ... ok1582test files::preview::mermaid::sequence::tests::wide_panes_keep_long_message_labels_visible ... ok1583test files::preview::tests::bounded_reader_never_consumes_more_than_cap_plus_one ... ok1584test files::preview::tests::checked_in_preview_examples_remain_parseable_and_width_bounded ... ok1585test files::preview::tests::committed_search_reveals_an_offscreen_match_when_layout_arrives ... ok1586test files::preview::tests::document_view_keeps_only_three_width_layouts ... ok1587test files::preview::tests::path_detection_is_explicit_and_case_insensitive ... ok1588test files::preview::tests::preview_layout_refresh_preserves_editing_and_rebuilds_committed_search ... ok1589test files::tests::collapsing_forgets_open_descendants ... ok1590test files::tests::each_folder_keeps_its_own_expanded_state ... ok1591test files::tests::hidden_filter_and_git_are_display_only ... ok1592test files::tests::only_expanded_dirs_are_flattened ... ok1593test files::tests::returning_to_a_folder_restores_what_was_expanded ... ok1594test files::tests::set_root_shows_the_new_folder_not_the_old_one ... ok1595test files::tests::tree_projection_is_independent_of_the_transient_fuzzy_filter ... ok1596test files::view::tests::change_at_maps_lines_to_their_span ... ok1597test files::view::tests::file_search_caps_highly_repetitive_valid_input ... ok1598test files::view::tests::mobile_token_rows_reserve_the_active_search_footer ... ok1599test files::view::tests::narrow_token_rows_project_the_visible_overflow_marker ... ok1600test files::view::tests::narrow_wrapped_selection_copies_the_full_oversized_grapheme ... ok1601test files::view::tests::no_changes_means_no_markers ... ok1602test files::view::tests::reads_text_binary_and_oversize ... ok1603test files::view::tests::scroll_clamps_to_content ... ok1604test files::view::tests::search_finds_navigates_and_reveals ... ok1605test files::view::tests::selection_preserves_real_file_line_breaks ... ok1606test files::view::tests::unwrapped_clamp_is_line_based ... ok1607test files::view::tests::wrap_is_the_default ... ok1608test files::view::tests::wrap_ranges_word_wraps_and_hard_splits ... ok1609test files::view::tests::wrap_rows_matches_wrap_ranges ... ok1610test files::view::tests::wrapped_long_lines_scroll_to_the_end ... ok1611test files::view::tests::wrapped_selection_joins_visual_rows_without_inventing_a_newline ... ok1612test files::view::tests::wrapping_never_splits_combining_or_zwj_clusters ... ok1613test git::contributor_tests::collapsed_caps_rows_and_reports_the_remainder ... ok1614test git::contributor_tests::collapsed_hides_small_contributors_and_expanding_reveals_all ... ok1615test git::contributor_tests::collapsed_never_empties_a_young_repo ... ok1616test git::github::tests::parses_a_pr ... ok1617test git::github::tests::parses_issue_discussion_for_the_in_tab_reader ... ok1618test git::github::tests::parses_pr_detail_with_per_check_and_deduped_reviews ... ok1619test git::github::tests::retained_discussion_is_recent_and_bounded ... ok1620test git::github::tests::rollup_failure_wins ... ok1621test git::local::change_tests::a_count_less_header_means_one_line ... ok1622test git::local::change_tests::deletion_at_the_top_of_the_file_clamps_to_line_one ... ok1623test git::local::change_tests::file_changes_degrades_outside_a_repo ... ok1624test git::local::change_tests::file_changes_reads_a_real_working_tree_edit ... ok1625test git::local::change_tests::malformed_input_yields_no_spans ... ok1626test git::local::change_tests::parses_added_modified_and_removed_hunks ... ok1627test git::local::tests::colored_git_graph_is_sanitized_before_rendering ... ok1628test git::local::tests::commit_log_always_requests_plain_output ... ok1629test git::local::tests::github_slug_parses_ssh_and_https ... ok1630test git::local::tests::integrate_branch_merges_clean_then_flags_a_conflict ... ok1631test git::local::tests::parses_bare_worktree_entry ... ok1632test git::local::tests::parses_nul_terminated_porcelain_with_newline_in_path ... ok1633test git::local::tests::parses_remote_forms ... ok1634test git::local::tests::parses_shortlog ... ok1635test git::local::tests::parses_worktree_porcelain ... ok1636test git::local::tests::repo_check_matches_is_repo_for_repo_and_non_repo ... ok1637test git::local::tests::repo_check_surfaces_malformed_git_config_as_error ... ok1638test git::local::tests::tree_status_maps_changes_and_dirties_parents ... ok1639test git::local::tests::worktree_and_repo_share_common_dir ... ok1640test git::local::tests::worktrees_lists_a_checkout_whose_path_contains_a_newline ... ok1641test i18n::cli::tests::canonical_syntax_is_never_rewritten ... ok1642test i18n::cli::tests::codes_match_the_ui_registry ... ok1643test i18n::cli::tests::complete_messages_keep_locale_owned_grammar_and_punctuation ... ok1644test i18n::cli::tests::configured_context_is_read_only_and_falls_back_safely ... ok1645test i18n::cli::tests::english_catalog_keys_are_unique ... ok1646test i18n::cli::tests::exact_search_limit_diagnostic_is_localized ... ok1647test i18n::cli::tests::padding_uses_terminal_cell_width_for_cjk ... ok1648test i18n::tests::agents_scope_text_is_complete_for_every_language ... ok1649test i18n::tests::commander_slash_picker_is_complete_for_every_language ... ok1650test i18n::tests::every_language_covers_the_complete_settings_reference ... ok1651test i18n::tests::non_english_catalog_actually_differs ... ok1652test i18n::tests::registry_is_consistent ... ok1653test ids::tests::fallback_public_ids_include_process_lifetime_and_sequence ... ok1654test integration::tests::atomic_json_write_replaces_complete_files_and_cleans_failed_temps ... ok1655test integration::tests::atomic_write_keeps_the_replaced_file_mode ... ok1656test integration::tests::codex_hook_installs_start_and_prompt_session_reporting ... ok1657test integration::tests::copilot_hook_registers_under_session_start_camelcase ... ok1658test integration::tests::grok_hook_is_a_standalone_json_file ... ok1659test integration::tests::hook_script_reports_claude_but_never_a_devin_host ... ok1660test integration::tests::install_preserves_malformed_user_configs ... ok1661test integration::tests::install_writes_hook_and_settings ... ok1662test integration::tests::installing_replaces_only_the_legacy_managed_hook ... ok1663test integration::tests::internal_hook_dispatch_is_owned_by_the_agent_descriptor ... ok1664test integration::tests::kimi_hook_preserves_config_and_is_reversible ... ok1665test integration::tests::omp_extension_registers_only_documented_events_and_reports_via_cli ... ok1666test integration::tests::omp_extension_reports_authoritative_root_state_transitions ... ok1667test integration::tests::omp_extension_source_is_syntactically_valid_typescript ... ok1668test integration::tests::omp_install_accepts_pi_spelling_only_as_separate_agent ... ok1669test integration::tests::omp_install_writes_extension_and_is_idempotent ... ok1670test integration::tests::opencode_installs_the_current_v2_cli_plugin_without_touching_neighbors ... ok1671test integration::tests::uninstall_opencode_removes_the_plugin ... ok1672test integration::tests::uninstall_removes_only_luvuss_hook_not_the_agent_config ... ok1673test integration::tests::unsupported_agent_message_is_a_complete_localized_sentence ... ok1674test ipc::api::tests::agent_wait_parks_on_the_app_loop_with_validated_state_and_timeout ... ok1675test ipc::api::tests::agent_wait_status_sets_are_nonempty_unique_and_known ... ok1676test ipc::api::tests::bounded_frame_requires_lf_and_stops_after_one_request ... ok1677test ipc::api::tests::bounded_stream_frame_distinguishes_clean_eof_from_invalid_frames ... ok1678test ipc::api::tests::control_does_not_skip_output_during_initial_frame_write ... ok1679test ipc::api::tests::deadline_response_reader_does_not_wait_for_a_silent_peer ... ok1680test ipc::api::tests::deadline_response_reader_returns_a_written_frame ... ok1681test ipc::api::tests::deadline_response_reader_times_out_before_accept ... ok1682test ipc::api::tests::delegated_auth_tokens_are_bounded_printable_ascii ... ok1683test ipc::api::tests::delegated_tokens_enforce_scope_and_can_be_revoked ... ok1684test ipc::api::tests::duplicate_keys_are_rejected_at_every_object_depth ... ok1685test ipc::api::tests::event_bus_bounds_total_subscribers ... ok1686test ipc::api::tests::event_bus_sequences_filters_and_bounds_slow_consumers ... ok1687test ipc::api::tests::event_replay_requires_resync_after_the_bounded_window ... ok1688test ipc::api::tests::event_replay_resumes_after_a_sequence_without_cloning_frames ... ok1689test ipc::api::tests::event_wait_is_one_shot_filtered_and_event_driven ... ok1690test ipc::api::tests::event_wait_requires_resync_when_its_bounded_queue_overflows ... ok1691test ipc::api::tests::invalid_agent_wait_requests_do_not_reach_the_app_loop ... ok1692test ipc::api::tests::observe_does_not_skip_output_during_initial_frame_write ... ok1693test ipc::api::tests::observe_stream_sends_initial_and_change_driven_frames ... ok1694test ipc::api::tests::oversized_response_emits_the_bounded_fallback ... ok1695test ipc::api::tests::parked_wait_marks_cancellation_when_client_disconnects ... ok1696test ipc::api::tests::reload_handlers_reject_parameters_before_app_handoff ... ok1697test ipc::api::tests::request_log_preserves_missing_and_valid_id_state ... ok1698test ipc::api::tests::responses_are_lf_framed_and_flushed_before_disconnect ... ok1699test ipc::api::tests::subscription_events_are_lf_framed_and_flushed_immediately ... ok1700test ipc::api::tests::terminal_control_frames_reuse_strict_uhp_actions ... ok1701test ipc::api::tests::terminal_control_lease_is_exclusive_and_released ... ok1702test ipc::api::tests::terminal_stream_cursor_is_explicitly_negotiated ... ok1703test ipc::api::tests::terminal_stream_filter_requires_the_exact_terminal ... ok1704test ipc::api::tests::terminal_stream_frame_is_bounded_and_identified ... ok1705test ipc::api::tests::theme_reload_scans_on_the_connection_worker_before_app_handoff ... ok1706test ipc::api::tests::timeout_s_parses_without_panicking ... ok1707test ipc::api::tests::versioned_envelopes_reject_invalid_ids_and_normalize_null_params ... ok1708test ipc::client::paint_tests::file_link_locality_requires_direct_terminal_evidence ... ok1709test ipc::client::paint_tests::grok_prompt_caret_stays_put ... ok1710test ipc::client::paint_tests::hidden_in_view_pty_parks_without_showing ... ok1711test ipc::client::paint_tests::hidden_pty_cursor_does_not_show_a_luvus_caret ... ok1712test ipc::client::paint_tests::osc8_writer_preserves_valid_mjs_file_targets_and_closes_invalid_ones ... ok1713test ipc::client::paint_tests::out_of_bounds_cursor_hides_caret ... ok1714test ipc::client::paint_tests::pty_visible_cursor_is_restored_after_spinner_like_diff ... ok1715test ipc::client::paint_tests::remote_host_suppresses_server_file_targets_but_keeps_web_links ... ok1716test ipc::client::paint_tests::tab_row_caret_stays_put_on_a_tall_screen ... ok1717test ipc::client::render_tests::blocked_input_write_does_not_block_switch_or_close_or_restore_retired_writer ... ok1718test ipc::client::render_tests::image_paste_chord_uses_binary_data_and_falls_back_to_the_key ... ok1719test ipc::client::render_tests::incremental_diff_reconstructs_the_screen ... ok1720test ipc::client::render_tests::input_waits_for_busy_receipt_writer_and_wakes_on_route_change ... ok1721test ipc::client::render_tests::paste_event_preserves_windows_paths_quotes_and_unicode ... ok1722test ipc::client::render_tests::session_handoff_preserves_subcommand_session_flags ... ok1723test ipc::client::render_tests::session_handoff_replaces_only_the_session_selector ... ok1724test ipc::client::render_tests::session_input_route_moves_complete_events_and_survives_old_disconnect ... ok1725test ipc::client::tests::blit_skips_wide_char_continuation ... ok1726test ipc::client::tests::clipboard_completion_wakes_idle_and_partial_frame_reads ... ok1727test ipc::client::tests::clipboard_receipt_waits_for_busy_input_writer ... ok1728test ipc::client::tests::closed_remote_input_is_classified_as_a_handshake_failure ... ok1729test ipc::client::tests::empty_remote_stream_is_classified_as_a_handshake_failure ... ok1730test ipc::client::tests::real_server_accepts_a_terminal_palette ... ok1731test ipc::client::tests::streaming_copy_flushes_each_chunk_and_retries_interrupts ... ok1732test ipc::client::tests::streaming_copy_handles_bidirectional_bridge_traffic ... ok1733test ipc::client::tests::terminal_palette_server_helper ... ok1734test ipc::client::tests::welcome_reader_accepts_frozen_and_v0141_wire_positions ... ok1735test ipc::federated::tests::acknowledged_sidebar_revision_is_not_resent ... ok1736test ipc::federated::tests::active_highlight_moves_to_machine_only_when_collapsed ... ok1737test ipc::federated::tests::disabled_endpoints_have_no_runtime_deadline ... ok1738test ipc::federated::tests::endpoint_identity_is_machine_and_session_without_channels ... ok1739test ipc::federated::tests::endpoint_switches_use_active_native_geometry_over_stale_local_bounds ... ok1740test ipc::federated::tests::federated_docks_keep_repeat_and_release_with_the_press_owner ... ok1741test ipc::federated::tests::file_links_require_both_local_endpoint_and_terminal_filesystem ... ok1742test ipc::federated::tests::form_tail_truncation_preserves_wide_character_boundaries ... ok1743test ipc::federated::tests::frame_diff_repaints_only_when_it_touches_the_client_dock ... ok1744test ipc::federated::tests::handshake_eof_uses_the_same_bounded_retry_budget_as_timeout ... ok1745test ipc::federated::tests::handshake_timeouts_exhaust_budget_without_idle_retries ... ok1746test ipc::federated::tests::legacy_session_list_does_not_create_runtime_endpoints ... ok1747test ipc::federated::tests::local_failover_replaces_only_the_pending_selection ... ok1748test ipc::federated::tests::local_handshake_decodes_v0141_mismatch_as_actionable_error ... ok1749test ipc::federated::tests::local_negotiation_reads_server_identity_before_sending_metadata ... ok1750test ipc::federated::tests::machine_catalog_notifications_are_revision_fenced ... ok1751test ipc::federated::tests::machine_connection_menu_tracks_runtime_not_saved_enabled_flag ... ok1752test ipc::federated::tests::machine_disconnect_fences_events_and_stops_retry_without_clearing_workspaces ... ok1753test ipc::federated::tests::machine_form_edits_at_unicode_cursor_and_supports_navigation ... ok1754test ipc::federated::tests::machine_form_input_is_bounded_and_control_free ... ok1755test ipc::federated::tests::machine_form_labels_align_their_colons ... ok1756test ipc::federated::tests::machine_form_modified_delete_uses_word_and_line_boundaries ... ok1757test ipc::federated::tests::machine_form_value_window_keeps_cursor_visible_on_long_wide_text ... ok1758test ipc::federated::tests::machine_install_prompt_is_explicit_and_defaults_to_cancel ... ok1759test ipc::federated::tests::machine_menu_accepts_native_keyboard_navigation ... ok1760test ipc::federated::tests::one_endpoint_disconnect_does_not_mutate_a_sibling_runtime ... ok1761test ipc::federated::tests::one_machine_projects_workspaces_not_saved_session_rows ... ok1762test ipc::federated::tests::only_the_owner_local_endpoint_can_switch_named_sessions ... ok1763test ipc::federated::tests::owner_session_chrome_uses_the_active_minimum_width_slot ... ok1764test ipc::federated::tests::pointer_activation_releases_stale_keyboard_selection ... ok1765test ipc::federated::tests::protocol_failure_and_disabled_machine_never_enter_retry_loop ... ok1766test ipc::federated::tests::quiet_online_endpoint_schedules_one_health_deadline ... ok1767test ipc::federated::tests::reconnect_backoff_is_bounded_and_jittered_per_endpoint ... ok1768test ipc::federated::tests::remote_sidebar_drag_does_not_paint_ahead_of_the_endpoint_frame ... ok1769test ipc::federated::tests::rendered_sidebar_geometry_acknowledges_only_the_matching_width ... ok1770test ipc::federated::tests::saved_machine_navigation_preserves_fields_and_uses_catalog_identity ... ok1771test ipc::federated::tests::saved_machine_open_reuses_existing_endpoint_without_catalog_mutation ... ok1772test ipc::federated::tests::shell_geometry_commits_atomically_with_the_next_frame ... ok1773test ipc::federated::tests::workspace_drag_width_obeys_both_native_seams_and_bounds ... ok1774test ipc::federated::tests::workspace_reveal_tracks_keyboard_without_fighting_wheel_scroll ... ok1775test ipc::protocol::tests::client_reconstructs_a_frame_then_diff_stream_over_the_wire ... ok1776test ipc::protocol::tests::clipboard_image_rejects_an_oversized_declared_length_before_allocation ... ok1777test ipc::protocol::tests::clipboard_image_roundtrips_as_binary_png_data ... ok1778test ipc::protocol::tests::diff_and_apply_roundtrip ... ok1779test ipc::protocol::tests::diff_buffer_emits_changed_runs_and_updates_prev_in_place ... ok1780test ipc::protocol::tests::diff_coalesces_adjacent_same_style_into_one_run ... ok1781test ipc::protocol::tests::downsample_to_256 ... ok1782test ipc::protocol::tests::frozen_hello_decodes_without_later_fields ... ok1783test ipc::protocol::tests::hello_wire_shape_is_frozen ... ok1784test ipc::protocol::tests::hyperlink_intersection_detects_only_changed_link_cells ... ok1785test ipc::protocol::tests::hyperlink_projection_preserves_mjs_target_and_can_be_removed ... ok1786test ipc::protocol::tests::logical_session_switch_roundtrips_without_a_socket_path ... ok1787test ipc::protocol::tests::machine_health_identity_and_overlay_roundtrip ... ok1788test ipc::protocol::tests::message_roundtrip ... ok1789test ipc::protocol::tests::sound_signal_roundtrip_preserves_style_and_cue ... ok1790test ipc::protocol::tests::version_mismatch_reply_matches_the_requesting_client_wire_shape ... ok1791test ipc::protocol::tests::welcome_wire_shape_is_backward_decodable ... ok1792test ipc::protocol::tests::wire_blanks_wide_glyph_continuation_from_ratatui_chrome ... ok1793test ipc::server::tests::background_resize_is_local_and_interaction_promotes_its_view ... ok1794test ipc::server::tests::client_sidebar_state_keeps_the_existing_frame_diff_baseline ... ok1795test ipc::server::tests::client_sidebars_follow_native_files_input_without_changing_server_settings ... ok1796test ipc::server::tests::clients_removed_by_any_path_release_their_held_pane_keys ... ok1797test ipc::server::tests::clipboard_is_reliable_when_a_tab_frame_is_already_queued ... ok1798test ipc::server::tests::clipboard_success_toast_requires_foreground_receipt ... ok1799test ipc::server::tests::commander_copy_reaches_only_the_input_client ... ok1800test ipc::server::tests::different_client_sizes_receive_independent_frames_and_active_geometry ... ok1801test ipc::server::tests::empty_machine_catalog_still_enables_first_time_workspace_picker_tab ... ok1802test ipc::server::tests::explicit_detach_is_delivered_behind_a_queued_frame ... ok1803test ipc::server::tests::forced_and_resync_causes_request_repair_frames ... ok1804test ipc::server::tests::foreground_handoff_discards_commander_draft ... ok1805test ipc::server::tests::hidden_agent_titles_present_once_including_coalesced_output ... ok1806test ipc::server::tests::hidden_pty_activity_does_not_request_presentation ... ok1807test ipc::server::tests::image_staged_for_a_removed_client_is_discarded ... ok1808test ipc::server::tests::legacy_hello_still_gets_the_version_mismatch_reply ... ok1809test ipc::server::tests::machine_catalog_changes_reach_only_machine_aware_clients ... ok1810test ipc::server::tests::machine_client_can_focus_local_workspace_while_surface_is_suspended ... ok1811test ipc::server::tests::machine_endpoint_rows_follow_workspace_paths_without_resizing_the_pty ... ok1812test ipc::server::tests::machine_selector_does_not_end_the_client_writer ... ok1813test ipc::server::tests::machine_workspace_menu_uses_native_identity_and_requires_active_surface ... ok1814test ipc::server::tests::machine_workspace_path_toggle_is_client_owned_across_endpoints ... ok1815test ipc::server::tests::machine_workspace_projection_keeps_the_stored_root ... ok1816test ipc::server::tests::passive_retained_frames_match_full_projection_at_each_client_size ... ok1817test ipc::server::tests::prepared_frame_echoes_latest_ticket_without_taking_input_ownership ... ok1818test ipc::server::tests::suspended_surface_releases_frames_and_receives_no_render_or_effect ... ok1819test ipc::server::tests::terminal_streams_rearm_at_frame_cadence_without_changing_idle_cost ... ok1820test ipc::server::tests::unchanged_normal_render_attempts_remain_frame_capped ... ok1821test ipc::server::tests::visible_pty_only_frame_uses_retained_rows_after_full_baseline ... ok1822test ipc::server::tests::workspace_width_override_is_per_client_and_never_persisted ... ok1823test ipc::transport::tests::live_socket_is_never_reclaimed ... ok1824test ipc::transport::tests::non_socket_path_is_not_deleted ... ok1825test ipc::transport::tests::stale_socket_is_reclaimed_while_holding_startup_lock ... ok1826test layout::tests::auto_split_axis_accounts_for_tall_terminal_cells ... ok1827test layout::tests::auto_split_axis_cuts_the_longer_side ... ok1828test layout::tests::dividers_and_set_ratio ... ok1829test layout::tests::grid_navigation_never_moves_diagonally ... ok1830test layout::tests::keyboard_resize_grows_focus_then_equalizes ... ok1831test layout::tests::navigates_to_the_pane_actually_in_that_direction ... ok1832test layout::tests::resize_ratio_survives_serialization ... ok1833test layout::tests::socket_queries_and_tree_apply_preserve_live_leaf_identity ... ok1834test layout::tests::split_and_navigate ... ok1835test layout::tests::stepping_through_a_tall_column_visits_every_pane ... ok1836test links::tests::a_bare_domain_is_a_hit_with_its_port_intact ... ok1837test links::tests::a_scheme_with_no_host_is_not_a_link ... ok1838test links::tests::a_url_is_never_read_as_a_path ... ok1839test links::tests::bare_domains_get_a_sensible_scheme ... ok1840test links::tests::covers_reports_the_cells_it_occupies ... ok1841test links::tests::decodes_only_absolute_local_file_uris ... ok1842test links::tests::does_not_join_across_a_line_that_ended_early ... ok1843test links::tests::encodes_absolute_paths_as_local_file_uris ... ok1844test links::tests::finds_a_plain_url_anywhere_along_it ... ok1845test links::tests::finds_paths_and_splits_their_line_suffix ... ok1846test links::tests::ignores_text_without_a_scheme ... ok1847test links::tests::joins_a_url_wrapped_across_the_right_edge ... ok1848test links::tests::out_of_range_and_odd_input_are_safe ... ok1849test links::tests::plain_words_are_not_path_candidates ... ok1850test links::tests::recognises_bare_domains ... ok1851test links::tests::refuses_things_that_only_look_like_domains ... ok1852test links::tests::trims_trailing_punctuation_and_unbalanced_brackets ... ok1853test logging::path::tests::existing_non_directory_is_not_reported_writable ... ok1854test logging::path::tests::existing_symlink_log_directory_is_not_reported_writable ... ok1855test logging::path::tests::log_paths_follow_the_selected_test_home ... ok1856test logging::path::tests::rejects_symlink_log_files ... ok1857test logging::path::tests::writer_paths_are_private_on_unix ... ok1858test logging::redact::tests::event_field_allowlist_rejects_unrelated_metadata ... ok1859test logging::redact::tests::safe_id_accepts_only_the_public_identifier_alphabet ... ok1860test logging::rotate::tests::independent_appenders_keep_complete_lines ... ok1861test logging::rotate::tests::rotates_at_record_boundaries_and_keeps_one_archive ... ok1862test logging::tests::explicit_info_level_enables_logging ... ok1863test logging::tests::unknown_level_uses_info_logging ... ok1864test logging::tests::unset_level_uses_info_logging ... ok1865test logging::timestamp::tests::formats_before_epoch_and_leap_day ... ok1866test logging::timestamp::tests::formats_epoch_and_milliseconds ... ok1867test logging::writer::tests::encoding_uses_only_allowed_fields_and_valid_ndjson ... ok1868test logging::writer::tests::off_starts_no_writer_and_creates_no_directory ... ok1869test logging::writer::tests::uhp_completion_contains_only_safe_operational_metadata ... ok1870test logging::writer::tests::writer_persists_typed_records ... ok1871test logging::writer::tests::writer_reports_encode_recovery_separately_from_io ... ok1872test logging::writer::tests::writer_reports_recovery_without_panicking_on_io_failure ... ok1873test machine::api::catalog_warning_projection_never_exposes_owner_details ... ok1874test machine::api::tests::uhp_catalog_mutations_are_revision_checked_and_shape_strict ... ok1875test machine::catalog::tests::catalog_mutations_are_atomic_and_revision_checked ... ok1876test machine::catalog::tests::destinations_and_remote_paths_cannot_be_ssh_options_or_shell_fragments ... ok1877test machine::catalog::tests::label_changes_preserve_transport_identity ... ok1878test machine::catalog::tests::legacy_sessions_are_readable_but_never_persisted_or_connected ... ok1879test machine::catalog::tests::malformed_rows_are_isolated_and_block_lossy_mutation ... ok1880test machine::catalog::tests::named_sessions_have_independent_machine_catalogs ... ok1881test machine::catalog::tests::older_profiles_gain_their_preferred_or_default_session_without_a_format_bump ... ok1882test machine::catalog::tests::prepared_write_failure_has_recovery_details_and_retains_cause ... ok1883test machine::catalog::tests::proposed_enabled_profile_is_rejected_before_preparation ... ok1884test machine::catalog::tests::saved_sessions_are_deduplicated_and_globally_bounded ... ok1885test machine::cli::tests::disabled_profile_round_trip_never_needs_ssh ... ok1886test machine::cli::tests::explicit_remote_binary_disables_managed_provisioning ... ok1887test machine::cli::tests::implicit_revision_rejects_a_concurrent_writer ... ok1888test machine::cli::tests::revision_option_is_checked ... ok1889test machine::command::tests::windows_space_paths_use_encoded_native_launch_without_text_pipes ... ok1890test machine::command::tests::windows_unicode_and_apostrophe_paths_are_encoded_and_quoted ... ok1891test machine::link::tests::persistent_endpoint_uses_native_remote_client_bridge ... ok1892test machine::link::tests::windows_binary_is_passed_as_one_argument ... ok1893test machine::profile_tests::profile_ids_are_stable_and_allow_duplicate_destinations ... ok1894test machine::profile_tests::remove_profile_removes_only_the_exact_saved_machine ... ok1895test machine::provision::tests::cargo_target_context_handles_native_and_cross_target_layouts ... ok1896test machine::provision::tests::executable_headers_are_matched_to_the_remote_target ... ok1897test machine::provision::tests::installed_windows_paths_support_unicode_and_apostrophes ... ok1898test machine::provision::tests::local_build_provisioner_is_content_addressed_and_verified ... ok1899test machine::provision::tests::local_build_script_streams_and_verifies_before_installing ... ok1900test machine::provision::tests::managed_paths_match_each_remote_installer_destination ... ok1901test machine::provision::tests::provision_command_keeps_profile_data_out_of_the_remote_script ... ok1902test machine::provision::tests::provision_script_verifies_and_installs_in_the_user_prefix ... ok1903test machine::provision::tests::provisioner_is_fixed_verified_and_user_scoped ... ok1904test machine::provision::tests::windows_provision_command_uses_stdin_without_profile_or_prompts ... ok1905test machine::provision::tests::windows_provisioner_is_fixed_verified_and_user_scoped ... ok1906test machine::recovery::tests::catalog_conflict_retains_durable_install_receipt ... ok1907test machine::recovery::tests::failed_install_and_concurrent_operations_keep_separate_receipts ... ok1908test machine::recovery::tests::journal_is_bounded_and_private ... ok1909test machine::recovery::tests::planned_binary_survives_a_post_install_crash_window ... ok1910test machine::recovery::tests::unreadable_journal_fails_before_installation ... ok1911test machine::ssh::tests::bounded_runner_delivers_foreground_script_on_stdin ... ok1912test machine::ssh::tests::compatibility_uses_protocol_capability_not_package_version ... ok1913test machine::ssh::tests::deadline_includes_pipes_inherited_after_parent_exit ... ok1914test machine::ssh::tests::installation_permission_is_per_operation_not_saved_in_the_profile ... ok1915test machine::ssh::tests::ssh_arguments_do_not_use_a_shell_or_persist_credentials ... ok1916test machine::ssh::tests::unix_group_cleanup_releases_descendant_pipes_and_upload_worker ... ok1917test machine::ssh::tests::windows_discovery_is_fixed_read_only_and_versioned ... ok1918test machine::ssh::tests::windows_probe_paths_compare_case_and_separator_insensitively ... ok1919test mission::pricing::tests::anthropic_aliases_and_suffixes_are_strict ... ok1920test mission::pricing::tests::anthropic_family_aliases_use_current_rates_and_expected_windows ... ok1921test mission::pricing::tests::anthropic_latest_suffix_matches_resolved_version ... ok1922test mission::pricing::tests::anthropic_prices_distinguish_current_and_legacy_versions ... ok1923test mission::pricing::tests::anthropic_windows_distinguish_current_and_legacy_versions ... ok1924test mission::pricing::tests::compaction_threshold_flags_high_context ... ok1925test mission::pricing::tests::pricing_context_and_overrides ... ok1926test module::context::tests::empty_topology_builds_context_without_fake_ids ... ok1927test module::context::tests::explicit_tab_target_builds_context_for_that_tab ... ok1928test module::context::tests::stale_active_workspace_falls_back_to_surviving_topology ... ok1929test module::discovery::tests::parses_items ... ok1930test module::discovery::tests::rejects_garbage ... ok1931test module::discovery::tests::surfaces_api_message_as_error ... ok1932test module::discovery::tests::url_encodes_the_canonical_topic_query ... ok1933test module::install::tests::build_environment_scrubs_current_and_retired_control_data ... ok1934test module::install::tests::install_preview_escapes_command_arguments_and_terminal_controls ... ok1935test module::install::tests::install_preview_includes_startup_and_worktree_provider_commands ... ok1936test module::install::tests::install_preview_shows_commander_exposure_and_policy ... ok1937test module::install::tests::manifest_selection_cannot_change_during_build ... ok1938test module::install::tests::parse_owner_repo_and_paths ... ok1939test module::manifest::tests::action_contexts_gate_the_right_click_menus ... ok1940test module::manifest::tests::bar_declarations_validate_ids_titles_regions_and_duplicates ... ok1941test module::manifest::tests::commander_action_metadata_is_opt_in_and_validated ... ok1942test module::manifest::tests::commander_manifest_example_parses_with_default_confirmation ... ok1943test module::manifest::tests::duplicate_action_ids_rejected ... ok1944test module::manifest::tests::item_platforms_gate_actions ... ok1945test module::manifest::tests::parses_a_full_v2_manifest ... ok1946test module::manifest::tests::rejects_bad_ids_and_argv ... ok1947test module::manifest::tests::settings_validate_and_default ... ok1948test module::manifest::tests::valid_manifest_passes ... ok1949test module::manifest::tests::version_gate ... ok1950test module::manifest::tests::worktree_provider_validates_command_and_platform_gate ... ok1951test module::paths::tests::long_ids_truncate_with_hash ... ok1952test module::paths::tests::module_config_is_global_but_runtime_state_is_session_local ... ok1953test module::paths::tests::sanitizes_and_is_deterministic ... ok1954test module::runtime::tests::async_action_completes_when_a_descendant_keeps_output_open ... ok1955test module::runtime::tests::async_action_that_leaves_input_unread_is_not_reported_as_delivered ... ok1956test module::runtime::tests::async_action_without_input_may_leave_stdin_unread ... ok1957test module::runtime::tests::commander_no_text_action_can_close_stdin_and_exit_successfully ... ok1958test module::runtime::tests::complete_environment_keeps_canonical_module_variables ... ok1959test module::runtime::tests::sync_cancellation_kills_descendants_holding_output_pipes ... ok1960test module::runtime::tests::sync_provider_rejects_a_truncated_stdin_request_even_after_exit_zero ... ok1961test module::runtime::tests::sync_provider_writes_json_to_stdin ... ok1962test module::runtime::tests::sync_timeout_kills_descendants_holding_output_pipes ... ok1963test module::settings::tests::set_get_roundtrip_with_clamping_and_env ... ok1964test module::settings::tests::stale_values_from_an_older_manifest_are_ignored ... ok1965test module::settings::tests::stepping_wraps_enums_and_clamps_numbers ... ok1966test orch::tests::add_claim_done_lifecycle ... ok1967test orch::tests::binding_a_task_keeps_explicit_and_declared_paths ... ok1968test orch::tests::claim_of_claimed_is_rejected ... ok1969test orch::tests::completing_a_dep_reports_newly_ready_dependents ... ok1970test orch::tests::delete_removes_task_leases_and_dep_references ... ok1971test orch::tests::deps_gate_claimability ... ok1972test orch::tests::explicit_path_roundtrips_and_recovers_an_interrupted_merge ... ok1973test orch::tests::heartbeat_records_and_flags_the_threshold ... ok1974test orch::tests::integration_lifecycle_is_serial_and_terminal ... ok1975test orch::tests::interrupted_integration_recovers_to_done ... ok1976test orch::tests::interrupted_integration_restores_blocked_and_old_ledgers_fall_back_to_done ... ok1977test orch::tests::lease_input_and_count_are_bounded ... ok1978test orch::tests::leases_are_task_exclusive_and_require_a_real_task ... ok1979test orch::tests::ledger_growth_is_capped ... ok1980test orch::tests::legacy_tasks_deserialize_as_attempt_one ... ok1981test orch::tests::manual_prompt_is_editable_only_before_start ... ok1982test orch::tests::next_ready_hands_out_earliest_claimable ... ok1983test orch::tests::next_ready_is_scoped_to_the_requested_project ... ok1984test orch::tests::non_overlapping_leases_both_granted ... ok1985test orch::tests::overlap_rules ... ok1986test orch::tests::overlapping_lease_denied_with_holder ... ok1987test orch::tests::pane_death_releases_leases ... ok1988test orch::tests::path_leases_conflict_within_a_project_not_across_projects ... ok1989test orch::tests::reconciliation_drops_stale_invalid_and_conflicting_leases ... ok1990test orch::tests::retry_archives_the_attempt_and_clears_only_live_binding ... ok1991test orch::tests::retry_rejects_a_released_dependent_that_already_started ... ok1992test orch::tests::retry_rejects_active_integrated_and_started_dependency_states ... ok1993test orch::tests::same_pane_can_extend_its_own_leases ... ok1994test orch::tests::save_stays_on_the_path_captured_at_load ... ok1995test orch::tests::task_notes_allow_lines_but_reject_terminal_actions ... ok1996test orch::tests::task_title_and_prompt_are_bounded_and_created_atomically ... ok1997test orch::tests::test_load_and_default_state_remain_in_memory ... ok1998test orch::tests::unknown_dep_rejected ... ok1999test orch::tests::workspace_worker_binding_is_branchless_and_persistent ... ok2000test orch::worker::tests::direct_launch_delivers_a_multiline_briefing_beyond_canonical_tty_limits ... ok2001test orch::worker::tests::ownership_handshake_waits_before_allowing_consumption ... ok2002test orch::worker::tests::remote_sandbox_agent_cannot_claim_a_local_task ... ok2003test orch::worker::tests::staged_launch_is_private_and_consumed_once ... ok2004test persist::diff_snap_schema_tests::diff_snapshot_display_state_defaults_without_dropping_the_session ... ok2005test persist::diff_snap_schema_tests::older_sessions_default_to_no_closed_workspace_paths ... ok2006test persist::server_pid_file_tests::server_pid_file_reads_the_live_process ... ok2007test persist::server_pid_file_tests::server_pid_file_rejects_a_mismatched_start_marker ... ok2008test persist::tests::cli_socket_path_prefers_the_injected_socket ... ok2009test persist::tests::closing_the_final_project_saves_the_home_terminal_replacement ... ok2010test persist::tests::external_terminal_sessions_remain_claimed_for_restorable_panes ... ok2011test persist::tests::pane_screen_opt_out_removes_terminal_content_from_session_json ... ok2012test persist::tests::save_reports_failure_when_the_atomic_temp_file_cannot_be_created ... ok2013test persist::tests::snapshot_uses_the_live_process_identity_before_sidebar_detection_catches_up ... ok2014test persist::tests::state_dir_and_sockets_are_owner_only ... ok2015test persist::title_resolution_tests::a_titled_codex_pane_resolves_beside_another_in_its_directory ... ok2016test platform::tests::child_tree_guard_kills_the_group_before_reaping_an_exited_root ... ok2017test platform::tests::child_tree_guard_rejects_a_stale_root_identity ... ok2018test platform::tests::descendant_walk_does_not_truncate_after_sixty_four_processes ... ok2019test platform::tests::force_terminate_kills_a_setsid_child ... ok2020test platform::tests::git_root_recognizes_worktree_git_file ... ok2021test platform::tests::git_root_walks_every_ancestor ... ok2022test platform::tests::no_window_keeps_the_command_working ... ok2023test platform::tests::only_http_and_https_urls_are_openable ... ok2024test platform::tests::process_start_marker_is_stable_for_the_current_process ... ok2025test platform::tests::ps_command_line_handles_padded_numeric_columns ... ok2026test platform::tests::run_then_interactive_covers_shell_families ... ok2027test platform::tests::same_path_ignores_verbatim_prefix_and_trailing_separator ... ok2028test platform::tests::same_path_stays_case_sensitive_on_unix ... ok2029test platform::tests::shell_override_is_honored ... ok2030test platform::tests::spawned_helpers_are_reaped_after_they_exit ... ok2031test platform::tests::unix_stoppable_pid_rejects_self_and_missing ... ok2032test platform::unix_clipboard::tests::graphical_reader_order_follows_the_client_display ... ok2033test platform::unix_clipboard::tests::helper_output_is_binary_safe_and_bounded_by_time ... ok2034test platform::unix_clipboard::tests::macos_reader_uses_public_png_and_bounded_tiff_conversion ... ok2035test search::casefold::tests::default_simple_fold_contract_is_shared_and_scalar_preserving ... ok2036test search::casefold::tests::folded_chars_keep_original_utf8_offsets ... ok2037test search::federation::tests::bounded_socket_query_returns_typed_remote_target ... ok2038test search::federation::tests::kind_schema_is_strict ... ok2039test search::federation::tests::nonblocking_fallback_has_an_application_deadline ... ok2040test search::federation::tests::nonblocking_fallback_retries_zero_byte_reads ... ok2041test search::files::tests::cache_ttl_is_measured_from_insertion_not_last_hit ... ok2042test search::files::tests::fallback_walk_skips_git_and_directory_symlinks ... ok2043test search::files::tests::git_output_reader_caps_bytes_without_waiting_for_eof ... ok2044test search::files::tests::recent_catalog_is_reused ... ok2045test search::fuzzy::tests::ascii_catalog_storage_stays_close_to_two_source_copies ... ok2046test search::fuzzy::tests::case_sensitive_matching_is_strict ... ok2047test search::fuzzy::tests::exact_prefix_contiguous_and_subsequence_order ... ok2048test search::fuzzy::tests::output_rejects_sparse_but_keeps_dense_subsequences ... ok2049test search::fuzzy::tests::path_and_camel_boundaries_beat_unstructured_gaps ... ok2050test search::fuzzy::tests::tokens_may_match_different_fields ... ok2051test search::fuzzy::tests::unicode_case_semantics_match_local_search ... ok2052test search::fuzzy::tests::unicode_highlights_use_original_byte_boundaries ... ok2053test search::fuzzy::tests::utf8_length_changing_fold_keeps_original_highlight_offsets ... ok2054test search::local::tests::first_match_at_origin_wraps_when_origin_is_after_all_matches ... ok2055test search::local::tests::literal_matching_reports_utf8_bytes_and_display_cells ... ok2056test search::local::tests::local_state_edits_toggles_case_and_wraps_navigation ... ok2057test search::local::tests::matcher_caps_results_and_reports_truncation ... ok2058test search::local::tests::matching_is_non_overlapping_and_empty_queries_never_match ... ok2059test search::local::tests::query_input_is_bounded_at_a_utf8_boundary ... ok2060test search::local::tests::unicode_case_and_grapheme_cell_spans_are_preserved ... ok2061test search::tests::bounded_top_k_matches_a_full_reference_ranking ... ok2062test search::tests::global_ranking_prefers_exact_then_prefix_then_sparse ... ok2063test search::tests::scope_excludes_other_result_kinds ... ok2064test session::tests::attach_reuses_the_normal_tui_path ... ok2065test session::tests::client_session_restarts_only_a_running_stale_target ... ok2066test session::tests::default_paths_are_unchanged_and_named_paths_are_nested ... ok2067test session::tests::default_selector_uses_the_root_session ... ok2068test session::tests::deletion_guards_reject_default_and_unsafe_names ... ok2069test session::tests::duplicate_selectors_are_rejected ... ok2070test session::tests::environment_selector_is_used_only_without_an_inherited_socket ... ok2071test session::tests::explicit_cross_session_selector_discards_inherited_pane_context ... ok2072test session::tests::explicit_same_session_selector_keeps_inherited_pane_context ... ok2073test session::tests::explicit_selector_is_stripped_and_overrides_inherited_socket ... ok2074test session::tests::inherited_socket_wins_without_an_explicit_selector ... ok2075test session::tests::invalid_environment_selector_is_rejected_before_routing ... ok2076test session::tests::long_unix_socket_paths_get_stable_distinct_short_aliases ... ok2077test session::tests::subcommand_session_flag_is_not_a_server_selector ... ok2078test session::tests::timed_out_server_child_is_terminated_and_reaped ... ok2079test session::tests::validates_safe_session_names ... ok2080test skill::tests::bundled_install_refresh_and_modified_preservation_are_safe ... ok2081test skill::tests::canonical_and_plugin_skill_artifacts_stay_identical ... ok2082test skill::tests::changed_host_path_moves_only_an_unmodified_managed_skill ... ok2083test skill::tests::every_native_skill_host_has_detection_markers ... ok2084test skill::tests::external_skill_is_never_overwritten_or_removed ... ok2085test skill::tests::hermes_detection_respects_a_custom_home_without_a_path_binary ... ok2086test skill::tests::migration_removes_only_managed_blocks_and_preserves_unknown_skills ... ok2087test skill::tests::migration_strips_every_block_and_pairs_with_the_following_end ... ok2088test skill::tests::missing_managed_target_never_overwrites_replacement_content ... ok2089test skill::tests::native_targets_are_internal_adapters_not_agents_md ... ok2090test skill::tests::omp_is_a_recognized_skill_host_by_dir_or_binary ... ok2091test skill::tests::show_is_the_canonical_release_matched_skill ... ok2092test sound::tests::every_style_has_distinct_valid_done_and_blocked_wavs ... ok2093test sound::tests::unknown_style_falls_back_without_rejecting_config ... ok2094test terminal::appearance::tests::classifies_probed_terminal_colors_from_their_contrast ... ok2095test terminal::appearance::tests::static_theme_declaration_outranks_color_guessing ... ok2096test terminal::appearance::tests::terminal_reset_uses_probe_then_fallback ... ok2097test terminal::backend::tests::generated_ids_match_the_public_shape ... ok2098test terminal::backend::tests::mutation_errors_carry_dispatch_evidence ... ok2099test terminal::backend::tests::published_contract_tracks_runtime_version_limits_and_capabilities ... ok2100test terminal::backend::tests::schema_bundle_resolves_every_external_reference ... ok2101test terminal::host_input::console::tests::literal_backspace_stays_inside_paste ... ok2102test terminal::host_input::console::tests::native_modifiers_dead_keys_and_ctrl_space_keep_their_meaning ... ok2103test terminal::host_input::console::tests::native_paste_preserves_surrogate_pairs_repeats_and_control_data ... ok2104test terminal::host_input::console::tests::pending_control_sequences_are_bounded ... ok2105test terminal::host_input::console::tests::pending_win32_reports_are_bounded ... ok2106test terminal::host_input::console::tests::physical_escape_is_immediate ... ok2107test terminal::host_input::console::tests::raw_vti_paste_and_ctrl_mouse_remain_semantic ... ok2108test terminal::host_input::console::tests::win32_report_rejects_extra_fields ... ok2109test terminal::host_input::console::tests::win32_reports_restore_one_atomic_multiline_paste ... ok2110test terminal::host_input::tests::asynchronous_events_do_not_break_a_paste ... ok2111test terminal::host_input::tests::asynchronous_events_do_not_break_a_start_marker ... ok2112test terminal::host_input::tests::false_end_marker_prefix_stays_in_the_payload ... ok2113test terminal::host_input::tests::false_marker_prefix_replays_original_keys ... ok2114test terminal::host_input::tests::key_release_records_between_marker_bytes_are_ignored ... ok2115test terminal::host_input::tests::lone_escape_is_released_after_prefix_timeout ... ok2116test terminal::host_input::tests::native_paste_replays_a_held_prefix_first ... ok2117test terminal::host_input::tests::ordinary_and_native_paste_events_pass_through ... ok2118test terminal::host_input::tests::unterminated_paste_flushes_content_without_markers ... ok2119test terminal::host_input::tests::windows_marker_records_become_one_multiline_paste ... ok2120test terminal::host_key::tests::macos_option_is_restored_only_for_plain_editing_keys ... ok2121test terminal::keyboard::tests::raw_unknown_kitty_bits_are_retained_by_the_typed_value ... ok2122test terminal::keyboard::tests::semantic_helpers_preserve_disambiguate_and_report_all_behavior ... ok2123test terminal::keyboard::tests::zero_kitty_flags_are_legacy ... ok2124test terminal::pty::input::tests::admission_counts_capacity_and_reservations_survive_channel_drain ... ok2125test terminal::pty::input::tests::concurrent_empty_actions_are_bounded_and_overflow_is_coalesced ... ok2126test terminal::pty::input::tests::submit_reserves_enter_before_accepting_any_text ... ok2127test terminal::pty::io::unix_actor::tests::blocked_writer_keeps_input_bounded_and_cancellation_releases_it ... ok2128test terminal::pty::io::unix_actor::tests::history_maintenance_deadline_only_arms_poll_while_pending ... ok2129test terminal::pty::io::unix_actor::tests::pending_submit_retains_admission_until_enter_or_cancellation ... ok2130test terminal::pty::io::unix_actor::tests::submit_delay_preserves_fifo_order ... ok2131test terminal::pty::io::unix_actor::tests::zero_delay_submit_writes_paste_enter_and_following_bytes_in_order ... ok2132test terminal::pty::reap_tests::closing_one_pane_leaves_the_others_running ... ok2133test terminal::pty::reap_tests::deferred_pane_applies_a_resize_racing_the_spawn ... ok2134test terminal::pty::reap_tests::deferred_pane_delivers_input_and_spawns_its_child ... ok2135test terminal::pty::reap_tests::deferred_pane_retries_a_fallback_cwd ... ok2136test terminal::pty::reap_tests::dropping_a_live_child_is_still_reaped ... ok2137test terminal::pty::reap_tests::dropping_a_pane_reaps_its_child ... ok2138test terminal::pty::reap_tests::inherited_blocked_sigchld_still_reaps_natural_exit ... ok2139test terminal::pty::reap_tests::panes_share_one_child_reaper_thread ... ok2140test terminal::pty::reap_tests::quiet_pty_history_and_resize_finish_incremental_maintenance ... ok2141test terminal::pty::reap_tests::restored_deferred_pane_replays_saved_screen_immediately ... ok2142test terminal::pty::reap_tests::restored_deferred_pane_retries_a_fallback_cwd ... ok2143test terminal::pty::reaper::tests::helper_registration_and_spawn_failures_leave_no_child ... ok2144test terminal::pty::reaper::tests::long_running_helpers_do_not_limit_links_or_delay_other_exits ... ok2145test terminal::pty::reaper::tests::pending_helper_lock_never_blocks_the_reaper ... ok2146test terminal::pty::reaper::tests::reaper_thread_startup_failure_is_reported ... ok2147test terminal::pty::reaper::tests::reaper_wake_blocks_until_signaled ... ok2148test terminal::pty::reaper::tests::slow_helper_startup_does_not_delay_pane_exit ... ok2149test terminal::pty::tests::pane_env_drops_ssh_terminal_identity_but_keeps_agent_forwarding ... ok2150test terminal::pty::tests::pane_path_pins_the_owning_server_binary_portably ... ok2151test terminal::pty::tests::paste_is_bracketed_only_when_the_child_asked ... ok2152test terminal::pty::tests::paste_preserves_windows_paths_quotes_and_unicode ... ok2153test terminal::pty::tests::reaper_retries_child_poll_errors ... ok2154test terminal::pty::tests::submit_action_writes_one_paste_then_exactly_one_enter ... ok2155test terminal::theme_probe::tests::parses_st_and_bel_color_replies ... ok2156test terminal::theme_probe::tests::pending_input_preserves_utf8_control_alt_and_modifiers ... ok2157test terminal::theme_probe::tests::separates_interleaved_input_without_injection ... ok2158test terminal::upload::tests::upload_is_ordered_private_atomic_and_disconnect_safe ... ok2159test terminal::upload::tests::upload_rejects_invalid_sizes_chunks_and_padding ... ok2160test terminal::vt::alacritty::tests::alt_screen_retains_bounded_capture_history_without_host_scrolling ... ok2161test terminal::vt::alacritty::tests::alternate_history_displaces_primary_rows_only_as_it_grows ... ok2162test terminal::vt::alacritty::tests::alternate_scroll_mode_is_reported ... ok2163test terminal::vt::alacritty::tests::backend_capture_cursor_tracks_normalized_visible_and_unwrapped_text ... ok2164test terminal::vt::alacritty::tests::backend_capture_is_bounded_and_never_replays_unsafe_controls ... ok2165test terminal::vt::alacritty::tests::claude_composer_accepts_tall_multiline_input ... ok2166test terminal::vt::alacritty::tests::claude_composer_marks_a_typed_divider_as_ambiguous ... ok2167test terminal::vt::alacritty::tests::claude_composer_rejects_disconnected_stale_prompt_and_rail ... ok2168test terminal::vt::alacritty::tests::claude_composer_requires_live_input_between_solid_rails ... ok2169test terminal::vt::alacritty::tests::codex_composer_region_finds_the_real_default_background_layout ... ok2170test terminal::vt::alacritty::tests::cold_history_compacts_losslessly_and_survives_reflow ... ok2171test terminal::vt::alacritty::tests::damage_snapshot_is_owned_bounded_and_generation_safe ... ok2172test terminal::vt::alacritty::tests::dense_history_width_reflow_preserves_oldest_feature_row ... ok2173test terminal::vt::alacritty::tests::detection_text_ignores_scrollback_offset ... ok2174test terminal::vt::alacritty::tests::for_each_cell_emits_the_whole_grapheme_cluster ... ok2175test terminal::vt::alacritty::tests::history_inspection_benchmark ... ignored2176test terminal::vt::alacritty::tests::history_maintenance_benchmark ... ignored2177test terminal::vt::alacritty::tests::history_metrics_cache_tracks_storage_changes_and_live_scroll ... ok2178test terminal::vt::alacritty::tests::incremental_history_maintenance_is_lossless_and_restarts_after_mutation ... ok2179test terminal::vt::alacritty::tests::mode_2031_queries_and_notifications_follow_engine_appearance ... ok2180test terminal::vt::alacritty::tests::mouse_tracking_modes_are_detected ... ok2181test terminal::vt::alacritty::tests::nested_keyboard_modes_are_tracked_across_config_updates ... ok2182test terminal::vt::alacritty::tests::non_empty_detection_reaches_prompts_above_blank_footer_rows ... ok2183test terminal::vt::alacritty::tests::opencode_composer_accepts_a_centered_box_in_a_wide_pty ... ok2184test terminal::vt::alacritty::tests::opencode_composer_rejects_a_short_border ... ok2185test terminal::vt::alacritty::tests::opencode_composer_rejects_an_unproven_blank_edge ... ok2186test terminal::vt::alacritty::tests::opencode_composer_requires_live_cursor_and_complete_box ... ok2187test terminal::vt::alacritty::tests::osc11_query_replies_with_theme_background_for_bel_and_st ... ok2188test terminal::vt::alacritty::tests::osc11_set_color_does_not_reply_or_print_the_payload ... ok2189test terminal::vt::alacritty::tests::osc52_store_forwards_clipboard_text ... ok2190test terminal::vt::alacritty::tests::output_generation_advances_only_with_parser_input ... ok2191test terminal::vt::alacritty::tests::packed_alternate_history_is_reclaimed_on_exit ... ok2192test terminal::vt::alacritty::tests::pane_search_scan_benchmark ... ignored2193test terminal::vt::alacritty::tests::partial_damage_carries_sparse_osc8_spans ... ok2194test terminal::vt::alacritty::tests::partial_damage_reuses_row_and_cell_storage ... ok2195test terminal::vt::alacritty::tests::pi_cursor_marker_apc_is_not_a_grid_cell ... ok2196test terminal::vt::alacritty::tests::pi_fullscreen_mouse_modes_are_detected ... ok2197test terminal::vt::alacritty::tests::pi_sync_frame_cursor_follows_final_cup_not_row_tail ... ok2198test terminal::vt::alacritty::tests::pi_sync_frame_without_closing_esu_does_not_apply_row_writes ... ok2199test terminal::vt::alacritty::tests::recent_capture_drops_cleared_rows_below_the_live_cursor ... ok2200test terminal::vt::alacritty::tests::recent_capture_joins_soft_wrapped_rows ... ok2201test terminal::vt::alacritty::tests::retained_row_visitor_stops_when_requested ... ok2202test terminal::vt::alacritty::tests::retained_selection_joins_soft_wraps_and_keeps_hard_breaks ... ok2203test terminal::vt::alacritty::tests::retained_selection_preserves_selected_indentation ... ok2204test terminal::vt::alacritty::tests::retained_selection_preserves_unicode_scripts_and_clusters ... ok2205test terminal::vt::alacritty::tests::retained_selection_preserves_wide_whitespace_cells ... ok2206test terminal::vt::alacritty::tests::retained_selection_uses_linear_cells_across_hard_lines ... ok2207test terminal::vt::alacritty::tests::retained_selection_uses_visual_columns_for_mixed_cjk_text ... ok2208test terminal::vt::alacritty::tests::rows_text_dumps_full_history_oldest_first ... ok2209test terminal::vt::alacritty::tests::screen_rows_ignore_the_scrollback_viewport ... ok2210test terminal::vt::alacritty::tests::scroll_to_lands_and_clamps ... ok2211test terminal::vt::alacritty::tests::scrollback_limit_is_honored_and_shrinks_live ... ok2212test terminal::vt::alacritty::tests::scrollback_offset_moves_clamps_and_resets ... ok2213test terminal::vt::alacritty::tests::scrolled_back_still_renders_and_copies_history ... ok2214test terminal::vt::alacritty::tests::selection_and_capture_cross_packed_and_hot_history ... ok2215test terminal::vt::alacritty::tests::shrinking_history_releases_packed_blocks ... ok2216test terminal::vt::alacritty::tests::snapshot_preserves_right_edge_and_blank_rows_after_resize ... ok2217test terminal::vt::alacritty::tests::snapshot_replays_live_unicode_cells_independent_of_scroll ... ok2218test terminal::vt::alacritty::tests::structural_terminal_changes_force_full_damage ... ok2219test terminal::vt::alacritty::tests::title_changes_force_full_damage_until_matching_acknowledgement ... ok2220test terminal::vt::alacritty::tests::visible_rows_retain_osc8_targets_and_spans ... ok2221test terminal::vt::tests::factory_builds_a_working_default_engine ... ok2222test tests::api_serves_requests ... ok2223test tests::base64_matches_known_vectors ... ok2224test tests::clicking_version_opens_the_changelog ... ok2225test tests::concurrent_sound_cache_publication_never_exposes_partial_wav ... ok2226test tests::control_probe_retries_with_a_longer_deadline_before_recovery ... ok2227test tests::copy_mode_reference_rows_are_not_clipped_in_any_language ... ok2228test tests::ensure_server_ready_fails_closed_when_control_ping_never_replies ... ok2229test tests::file_viewer_shows_git_change_markers ... ok2230test tests::host_keyboard_protocol_requests_only_crossterm_lossless_flags ... ok2231test tests::keys_tab_shows_help_and_scrolls_to_the_reference ... ok2232test tests::local_image_paste_uses_a_staged_path_and_falls_back_to_the_key ... ok2233test tests::matching_server_version_allows_binary_attach ... ok2234test tests::modal_footer_buttons_are_clickable ... ok2235test tests::named_session_is_visible_in_the_terminal_title ... ok2236test tests::naming_a_pane_renames_its_title ... ok2237test tests::nested_interactive_launch_requires_opt_in ... ok2238test tests::only_exact_json_session_list_uses_discovery_route ... ok2239test tests::pane_title_path_setting_appends_the_path ... ok2240test tests::remote_bridge_fallback_checks_standard_user_installations ... ok2241test tests::remote_bridge_preserves_the_selected_named_session ... ok2242test tests::remote_bridge_shell_arguments_are_single_quoted ... ok2243test tests::remote_start_if_missing_rejects_non_missing_endpoint_errors ... ok2244test tests::renders_across_phone_viewports ... ok2245test tests::renders_board_worker_binding_picker_and_detail ... ok2246test tests::renders_chrome ... ok2247test tests::renders_orch_board ... ok2248test tests::renders_pane_with_tab ... ok2249test tests::restart_all_targets_only_running_sessions_and_puts_selected_last ... ok2250test tests::send_server_stop_fails_closed_when_a_listener_never_replies ... ok2251test tests::send_server_stop_reports_absent_when_no_sockets ... ok2252test tests::sidebar_toggle_button_shows_and_hides ... ok2253test tests::sound_cache_rejects_a_non_directory_path ... ok2254test tests::sound_cache_uses_a_private_application_directory ... ok2255test tests::stale_server_version_fails_before_binary_attach ... ok2256test tests::startup_wait_rejects_bound_endpoints_without_an_app_response ... ok2257test tests::tiny_terminal_shows_guard_not_garbage ... ok2258test tests::unnamed_lone_pane_title_uses_id_and_honors_visibility ... ok2259test tests::wide_emoji_marks_its_continuation_cell ... ok2260test tests::workspace_context_menu_rename_and_close ... ok2261test theme::builtin::tests::bundled_theme_files_are_valid_and_unique ... ok2262test theme::format::tests::complete_theme_parses_and_resolves ... ok2263test theme::format::tests::parses_supported_color_specs ... ok2264test theme::format::tests::partial_theme_requires_a_parent ... ok2265test theme::format::tests::rejects_unknown_fields_and_unsafe_ids ... ok2266test theme::format::tests::website_maker_emits_the_012_contract_without_a_license_prompt ... ok2267test theme::format::tests::website_schema_matches_the_runtime_roles ... ok2268test theme::install::tests::community_coordinate_is_bounded_and_unambiguous ... ok2269test theme::install::tests::github_repository_and_file_urls_are_unambiguous ... ok2270test theme::install::tests::github_repository_requires_exactly_one_bounded_root_theme ... ok2271test theme::install::tests::parent_with_installed_dependents_cannot_be_removed ... ok2272test theme::install::tests::starter_is_valid_schema_one ... ok2273test theme::registry::tests::aliases_still_select_their_builtins ... ok2274test theme::registry::tests::baitong_builtin_retains_upstream_credit ... ok2275test theme::registry::tests::community_theme_files_are_valid ... ok2276test theme::registry::tests::loads_custom_themes_between_builtins_and_terminal ... ok2277test theme::registry::tests::loads_symlinked_theme_files ... ok2278test theme::registry::tests::missing_duplicate_and_overdeep_inheritance_are_omitted ... ok2279test theme::registry::tests::paper_builtins_retain_credit_and_light_contrast ... ok2280test theme::registry::tests::provenance_digest_mismatch_is_reported_without_disabling_manual_edits ... ok2281test theme::registry::tests::reports_broken_theme_symlinks_and_ignores_symlinked_directories ... ok2282test theme::registry::tests::resolves_inheritance_and_rejects_cycles_and_reserved_ids ... ok2283test theme::registry::tests::rose_pine_builtins_retain_upstream_attribution ... ok2284test theme::registry::tests::tokyo_night_builtin_retains_upstream_attribution ... ok2285test uhp::gateway::tests::access_allowlist_separates_observation_from_control ... ok2286test uhp::gateway::tests::access_capabilities_expose_only_effective_methods ... ok2287test uhp::gateway::tests::access_capabilities_preserve_owner_errors ... ok2288test uhp::gateway::tests::access_capabilities_reject_invalid_owner_replies ... ok2289test uhp::gateway::tests::access_capabilities_respect_projected_frame_boundary ... ok2290test uhp::gateway::tests::access_keys_rejections_never_admit_input ... ok2291test uhp::gateway::tests::control_access_forwards_validated_agent_keys ... ok2292test uhp::gateway::tests::control_access_forwards_validated_pane_rename ... ok2293test uhp::gateway::tests::control_pairing_exposes_only_bounded_write_authority ... ok2294test uhp::gateway::tests::gateway_pairs_once_and_denies_remote_mutation_before_local_ipc ... ok2295test uhp::gateway::tests::machine_access_is_explicit_and_capability_projected ... ok2296test uhp::gateway::tests::machine_gateway_mutates_only_with_control_and_catalog_revision ... ok2297test uhp::gateway::tests::request_window_is_bounded_and_resets ... ok2298test uhp::gateway::tests::response_ids_must_match_exactly ... ok2299test uhp::gateway::tests::stopping_gateway_drains_a_client_waiting_to_send_its_first_frame ... ok2300test uhp::gateway::tests::terminal_control_frames_are_strict_and_bounded ... ok2301test uhp::gateway::tests::terminal_control_stream_outlives_the_general_request_budget ... ok2302test uhp::pairing::tests::code_has_twelve_unambiguous_base32_symbols ... ok2303test uhp::pairing::tests::constant_time_comparison_checks_length_and_contents ... ok2304test uhp::pairing::tests::expired_pairing_is_rejected ... ok2305test uhp::pairing::tests::pairing_exhausts_after_five_failures ... ok2306test uhp::pairing::tests::pairing_is_one_use ... ok2307test uhp::tests::access_options_keep_safe_defaults_and_accept_a_bounded_ttl ... ok2308test uhp::tests::access_options_reject_invalid_or_ambiguous_ttls ... ok2309test uhp::tests::control_authority_is_explicit_and_bounded ... ok2310test uhp::tests::descriptor_is_transport_neutral_and_does_not_disclose_token ... ok2311test uhp::tests::expiries_are_bounded ... ok2312test ui::bar_projection_tests::mobile_projection_does_not_leak_profile_or_mobile_hits ... ok2313test ui::bar_projection_tests::secondary_viewport_preserves_active_bar_geometry_and_popup ... ok2314test ui::board::tests::automation_detail_explains_a_durable_active_agent_binding ... ok2315test ui::board::tests::automation_form_shows_each_agents_supported_access_profiles ... ok2316test ui::board::tests::automation_table_uses_spaced_headers_and_reports_the_target_pane ... ok2317test ui::board::tests::compact_flow_keeps_gate_failure_and_success_branches_visible ... ok2318test ui::board::tests::display_wrapping_consumes_whitespace_at_an_exact_word_boundary ... ok2319test ui::board::tests::empty_task_and_automation_messages_share_centered_emphasis ... ok2320test ui::board::tests::fleet_status_is_hidden_but_its_renderer_remains_available ... ok2321test ui::board::tests::inactive_task_prompt_starts_at_the_first_wrapped_line ... ok2322test ui::board::tests::long_task_title_keeps_its_tail_and_cursor_visible ... ok2323test ui::board::tests::overflowing_automation_table_draws_a_proportional_position_rail ... ok2324test ui::board::tests::short_mode_picker_registers_hits_only_inside_its_body ... ok2325test ui::board::tests::task_detail_shows_the_full_wrapped_title_and_prompt ... ok2326test ui::board::tests::task_form_keeps_the_multiline_prompt_tail_visible ... ok2327test ui::changelog::tests::a_click_inside_the_popup_does_not_dismiss ... ok2328test ui::changelog::tests::a_click_on_the_backdrop_dismisses ... ok2329test ui::changelog::tests::a_link_that_wraps_stays_clickable_on_both_rows ... ok2330test ui::changelog::tests::a_multi_word_label_is_one_span ... ok2331test ui::changelog::tests::bold_release_area_survives_wrapping_and_rendering ... ok2332test ui::changelog::tests::check_for_updates_button_sits_beside_the_close_box ... ok2333test ui::changelog::tests::clicking_check_for_updates_keeps_the_modal_open ... ok2334test ui::changelog::tests::clicking_each_update_command_copies_it_without_closing_the_modal ... ok2335test ui::changelog::tests::commit_references_are_clickable ... ok2336test ui::changelog::tests::every_check_outcome_reports_back ... ok2337test ui::changelog::tests::every_newer_check_shows_the_update_in_the_popup ... ok2338test ui::changelog::tests::latest_release_contributors_are_visible_in_the_app ... ok2339test ui::changelog::tests::only_the_recent_releases_are_built ... ok2340test ui::changelog::tests::punctuation_stays_attached_to_a_reference ... ok2341test ui::changelog::tests::scrolled_away_links_stop_being_clickable ... ok2342test ui::changelog::tests::the_button_hides_rather_than_collide_on_a_narrow_terminal ... ok2343test ui::changelog::tests::the_close_button_dismisses ... ok2344test ui::changelog::tests::the_rows_are_cached_between_frames ... ok2345test ui::changelog::tests::the_website_link_is_the_last_row_not_a_fixed_footer ... ok2346test ui::changelog::tests::update_guide_shows_the_copyable_luvus_brew_and_curl_commands ... ok2347test ui::commander_tests::commander_clipboard_images_render_as_markers_without_changing_delivery_text ... ok2348test ui::commander_tests::commander_editor_keeps_suffix_visible_after_mid_draft_caret ... ok2349test ui::commander_tests::commander_image_marker_maps_selection_to_the_visible_token ... ok2350test ui::commander_tests::commander_multiline_caret_and_text_share_the_visible_editor_rows ... ok2351test ui::commander_tests::commander_read_preview_uses_extra_rows_without_covering_the_editor_or_footer ... ok2352test ui::commander_tests::commander_shared_seam_drag_resizes_without_covering_the_terminal ... ok2353test ui::commander_tests::commander_slash_picker_previews_actions_and_filters_prefixes ... ok2354test ui::commander_tests::commander_slash_picker_scrolls_the_selected_row_into_a_short_viewport ... ok2355test ui::commander_tests::composer_gets_own_bottom_strip_and_is_private_to_active_view ... ok2356test ui::diff::tests::auto_and_split_fall_back_at_narrow_widths ... ok2357test ui::diff::tests::change_markers_are_explicit_in_both_layouts ... ok2358test ui::diff::tests::header_keeps_metadata_right_aligned_and_colors_change_counts ... ok2359test ui::diff::tests::inline_composer_pushes_following_source_rows_down ... ok2360test ui::diff::tests::marker_styles_offer_symbols_bars_and_both ... ok2361test ui::diff::tests::narrow_split_fallback_wraps_stack_rows_without_the_wrap_setting ... ok2362test ui::diff::tests::personal_note_composer_renders_inside_the_diff_and_owns_the_cursor ... ok2363test ui::diff::tests::saved_note_card_pushes_following_source_rows_down ... ok2364test ui::diff::tests::search_highlight_projects_unicode_matches_into_visible_fragments ... ok2365test ui::diff::tests::search_uses_the_diff_footer_including_on_mobile ... ok2366test ui::diff::tests::semantic_surfaces_preserve_addition_and_deletion_colors ... ok2367test ui::diff::tests::split_renders_addition_and_deletion_markers_without_line_numbers ... ok2368test ui::diff::tests::split_renders_old_side_notes_with_their_exact_anchor ... ok2369test ui::diff::tests::split_source_hits_preserve_the_clicked_side_and_stack_identity ... ok2370test ui::diff::tests::split_wraps_both_sides_inside_their_columns_and_aligns_row_groups ... ok2371test ui::diff::tests::stack_renders_markers_and_tints_the_full_changed_rows ... ok2372test ui::diff::tests::standard_color_mode_uses_stable_red_and_green_on_every_theme ... ok2373test ui::diff::tests::wrapping_is_unicode_safe_and_never_returns_zero_rows ... ok2374test ui::dock_projection_tests::early_projection_returns_do_not_export_stale_geometry ... ok2375test ui::dock_projection_tests::endpoint_projection_leaves_session_chrome_blank_and_inert ... ok2376test ui::dock_projection_tests::machine_capability_without_profiles_preserves_native_workspace_rendering ... ok2377test ui::dock_projection_tests::machine_picker_projects_only_its_native_modal_rectangle ... ok2378test ui::dock_projection_tests::machine_projection_reports_modal_bounds_semantically ... ok2379test ui::dock_projection_tests::machine_rows_follow_the_workspace_dock_without_mutating_active_geometry ... ok2380test ui::dock_projection_tests::passive_projection_reports_session_button_without_moving_active_hit_target ... ok2381test ui::dock_projection_tests::render_projection_preserves_active_dock_dividers ... ok2382test ui::files::tests::diff_note_count_uses_singular_and_plural_labels ... ok2383test ui::files::tests::diff_stats_are_colored_and_right_aligned ... ok2384test ui::files::tests::file_search_styles_complete_graphemes_without_changing_match_bytes ... ok2385test ui::files::tests::file_selection_highlight_excludes_the_line_number_gutter ... ok2386test ui::files::tests::mobile_search_footer_prioritizes_status_at_narrow_widths ... ok2387test ui::files::tests::mobile_search_uses_an_inner_footer_only_while_active ... ok2388test ui::files::tests::narrow_wrapped_file_shows_overflow_marker_and_following_text ... ok2389test ui::git::detail_layout_tests::discussion_rows_are_reused_until_target_or_width_changes ... ok2390test ui::git::detail_layout_tests::long_unbroken_comment_is_split_to_the_reader_width ... ok2391test ui::git::detail_layout_tests::narrow_detail_stacks_metadata_without_hiding_the_discussion ... ok2392test ui::git::detail_layout_tests::wide_issue_detail_shows_comments_and_ownership_rail ... ok2393test ui::git::detail_layout_tests::wide_pr_detail_keeps_discussion_left_and_metadata_right ... ok2394test ui::git::detail_layout_tests::wide_short_details_can_scroll_to_late_metadata ... ok2395test ui::git::tests::narrow_commit_rows_prioritize_the_subject ... ok2396test ui::git::tests::padded_columns_never_exceed_their_declared_width ... ok2397test ui::git::tests::pr_rows_reserve_fixed_columns_before_the_title ... ok2398test ui::git::tests::wide_commit_rows_fill_the_table_before_metadata ... ok2399test ui::help::tests::help_uses_current_bindings_and_includes_fixed_shortcuts ... ok2400test ui::help::tests::key_alignment_uses_terminal_cell_width ... ok2401test ui::menu::label_case_tests::every_english_context_menu_row_is_title_case ... ok2402test ui::menu::label_case_tests::mobile_menu_hover_covers_the_full_touch_row ... ok2403test ui::menu::label_case_tests::the_title_case_check_rejects_sentence_case ... ok2404test ui::menu::tests::a_menu_taller_than_its_space_scrolls_instead_of_dropping_its_last_rows ... ok2405test ui::menu::tests::an_overlapping_submenu_takes_the_wheel_from_the_menu_it_covers ... ok2406test ui::menu::tests::keyboard_selection_keeps_the_file_action_in_view ... ok2407test ui::menu::tests::menu_scroll_stops_at_both_ends ... ok2408test ui::menu::tests::reopening_a_menu_starts_it_at_the_top ... ok2409test ui::menu::tests::stopped_session_menu_renders_start_and_delete_for_keyboard_and_mouse ... ok2410test ui::menu::tests::the_wheel_away_from_a_popup_leaves_it_alone ... ok2411test ui::mission::tests::agent_columns_keep_exact_display_widths ... ok2412test ui::mobile::tests::both_rows_of_open_menu_are_clickable ... ok2413test ui::mobile::tests::mobile_header_reserves_a_compact_menu_target ... ok2414test ui::mobile::tests::mobile_header_switches_split_panes_and_wraps ... ok2415test ui::mobile::tests::mobile_navigator_uses_full_screen_and_explicit_close ... ok2416test ui::mobile::tests::mobile_replacement_surfaces_clear_underlying_symbols ... ok2417test ui::mobile::tests::mobile_settings_uses_equal_three_column_touch_grid ... ok2418test ui::mobile::tests::mobile_sheets_use_the_full_viewport ... ok2419test ui::mobile::tests::navigator_close_is_compact_and_rows_use_remaining_screen ... ok2420test ui::mobile::tests::repeated_mobile_navigation_keeps_hit_storage_bounded ... ok2421test ui::mobile::tests::short_mobile_settings_stays_inside_the_viewport ... ok2422test ui::mobile::tests::threshold_is_inclusive_and_zero_disables_mobile ... ok2423test ui::mobile::tests::viewport_matrix_keeps_desktop_and_mobile_geometry_distinct ... ok2424test ui::pane_navigation_tests::commander_preview_highlights_strip_without_focusing_input ... ok2425test ui::pane_navigation_tests::preview_highlights_candidate_without_moving_focus_or_cursor ... ok2426test ui::panes::tests::composer_uses_only_a_subtle_theme_fill_and_preserves_geometry ... ok2427test ui::panes::tests::hidden_in_view_pty_is_parked ... ok2428test ui::panes::tests::hovered_file_displaces_a_passive_link_at_capacity ... ok2429test ui::panes::tests::in_view_top_row_pty_is_followed ... ok2430test ui::panes::tests::out_of_view_pty_yields_none ... ok2431test ui::panes::tests::pane_chrome_clips_covered_hyperlink_cells ... ok2432test ui::panes::tests::pane_search_highlights_words_by_retained_row ... ok2433test ui::panes::tests::pane_search_rendering_limits_iteration_to_visible_matches ... ok2434test ui::panes::tests::pi_caret_prefers_bottom_then_left_reversed_cell ... ok2435test ui::panes::tests::rendered_hyperlinks_reject_oversized_uris_before_frame_projection ... ok2436test ui::panes::tests::visible_pty_caret_in_prompt_is_followed ... ok2437test ui::path_tests::short_path_honors_zero_and_one_column_budgets ... ok2438test ui::path_tests::short_path_keeps_a_wide_paths_tail_within_its_column_budget ... ok2439test ui::path_tests::short_path_keeps_joined_emoji_intact ... ok2440test ui::picker::tests::trunc_tail_measures_display_columns ... ok2441test ui::retained_render_tests::damaged_rows_match_a_forced_full_projection ... ok2442test ui::retained_render_tests::retained_projection_benchmark ... ignored2443test ui::retained_render_tests::successful_terminal_resize_invalidates_committed_search_coordinates ... ok2444test ui::search::tests::file_actions_render_over_the_finder_and_own_input ... ok2445test ui::search::tests::results_render_as_compact_single_line_rows ... ok2446test ui::search::tests::short_modal_never_places_result_rows_outside_the_overlay ... ok2447test ui::search::tests::unicode_highlight_positions_preserve_the_label ... ok2448test ui::session_menu::tests::cached_rows_remain_visible_while_discovery_refreshes ... ok2449test ui::session_menu::tests::desktop_header_shows_the_canonical_session_and_menu_rows ... ok2450test ui::session_menu::tests::desktop_selector_and_popup_follow_a_right_only_sidebar ... ok2451test ui::session_menu::tests::mobile_sheet_uses_two_row_touch_targets ... ok2452test ui::session_menu::tests::pending_action_is_rendered_without_animation ... ok2453test ui::settings::tests::keys_settings_exposes_diff_and_files_bindings ... ok2454test ui::settings::tests::layout_scroll_moves_only_when_selection_leaves_the_viewport ... ok2455test ui::settings::tests::plain_tabs_are_padded_separated_and_visible_at_80_columns ... ok2456test ui::settings::tests::slider_uses_terminal_width_for_cjk_value_and_arrow_targets ... ok2457test ui::sidebar::chrome_colour_tests::sidebar_rules_follow_the_theme_border ... ok2458test ui::sidebar::dock_tone_tests::a_wide_glyph_at_the_edge_ends_the_line_instead_of_being_skipped ... ok2459test ui::sidebar::dock_tone_tests::row_tone_colours_the_text_and_untoned_rows_keep_the_default ... ok2460test ui::sidebar::dock_tone_tests::spans_take_their_own_tone_or_inherit_the_rows ... ok2461test ui::sidebar::dock_tone_tests::spans_truncate_as_one_line_with_a_trailing_ellipsis ... ok2462test ui::sidebar::tests::a_body_below_every_floor_degrades_instead_of_panicking ... ok2463test ui::sidebar::tests::a_lopsided_weight_still_keeps_every_dock_at_the_floor ... ok2464test ui::sidebar::tests::agent_row_shows_the_pane_delegation_token ... ok2465test ui::sidebar::tests::agent_state_icons_keep_the_label_aligned ... ok2466test ui::sidebar::tests::agent_title_shows_module_title_not_alias ... ok2467test ui::sidebar::tests::agents_all_active_toggle_filters_history ... ok2468test ui::sidebar::tests::agents_workspace_scope_filters_both_row_kinds_and_keeps_attention_global ... ok2469test ui::sidebar::tests::equal_weights_reproduce_the_former_even_split ... ok2470test ui::sidebar::tests::focused_agent_meta_line_is_readable ... ok2471test ui::sidebar::tests::hidden_sidebar_paths_compact_workspace_and_agent_rows ... ok2472test ui::sidebar::tests::keyboard_focus_highlights_workspace_and_agent_rows ... ok2473test ui::sidebar::tests::long_workspace_name_is_ellipsized_not_hard_cut ... ok2474test ui::sidebar::tests::persisted_heights_round_trip_through_layout ... ok2475test ui::sidebar::tests::resumable_rows_show_module_session_title ... ok2476test ui::sidebar::tests::sidebar_chrome_keeps_one_blank_row_above_dock_titles ... ok2477test ui::sidebar::tests::sidebar_scrollbar_is_thin_and_proportional ... ok2478test ui::sidebar::tests::weights_split_the_sidebar_in_proportion ... ok2479test ui::sidebar::tests::workspace_sidebar_keeps_the_stored_root_when_the_pane_moves ... ok2480test ui::status::tests::bottom_bar_is_right_aligned_and_capped_at_100_columns ... ok2481test ui::status::tests::copy_mode_guidance_keeps_copy_and_cancel_in_every_language ... ok2482test ui::status::tests::default_guidance_and_fixed_version_keep_the_existing_edges ... ok2483test ui::status::tests::external_bottom_widgets_and_long_mode_hints_never_cover_version ... ok2484test ui::status::tests::file_search_uses_outer_status_guidance ... ok2485test ui::status::tests::files_guidance_matches_tree_and_opened_view_actions ... ok2486test ui::status::tests::prefix_guidance_omits_incomplete_compound_bindings ... ok2487test ui::status::tests::prefix_guidance_omits_unbound_mission_control ... ok2488test ui::status::tests::prefix_guidance_shows_the_mission_control_binding ... ok2489test ui::status::tests::preview_and_diff_search_leave_the_outer_status_bar_available ... ok2490test ui::status::tests::scroll_and_pane_search_guidance_shows_key_hints ... ok2491test ui::status::tests::session_guidance_tracks_the_focused_selector_and_its_action_menu ... ok2492test ui::status::tests::sidebar_guidance_matches_workspace_and_agent_actions ... ok2493test ui::tabbar::close_button_tests::dashboard_tabs_have_a_working_close_button ... ok2494test ui::tabbar::close_button_tests::mission_control_uses_the_bullseye_tab_icon ... ok2495test ui::tabbar::width_tests::a_120_column_tab_row_shows_100_bar_columns_and_keeps_navigation ... ok2496test ui::tabbar::width_tests::a_long_name_widens_its_tab_and_shows_in_full ... ok2497test ui::tabbar::width_tests::an_over_long_name_is_capped_but_keeps_its_padding_and_close_button ... ok2498test ui::tabbar::width_tests::focusing_a_tab_does_not_move_or_resize_it ... ok2499test ui::tabbar::width_tests::many_tabs_still_scroll_to_keep_the_active_one_visible ... ok2500test ui::tabbar::width_tests::overflow_arrows_move_the_active_tab_in_both_directions_with_a_wide_bar ... ok2501test ui::theme::tests::composer_surface_adapts_to_every_theme_and_256_color_variant ... ok2502test ui::theme::tests::from_terminal_preserves_the_default_background ... ok2503test ui::theme::tests::state_glyphs_are_one_column ... ok2504test ui::theme::tests::terminal_fallback_uses_the_terminal_palette ... ok2505test ui::theme::tests::theme_registry_is_consistent ... ok2506test ui::workspace_row::tests::path_tail_respects_terminal_cells ... ok2507test ui::workspace_row::tests::rows_reserve_scrollbar_and_keep_path_tail_and_selection ... ok2508test update::tests::check_once_reports_only_a_newer_release ... ok2509test update::tests::classifies_supported_and_managed_install_paths ... ok2510test update::tests::homebrew_verification_uses_the_formula_prefix ... ok2511test update::tests::newer_compares_semver_with_optional_v ... ok2512test update::tests::parses_the_manifest_version ... ok2513test update::tests::release_targets_cover_published_unix_archives ... ok2514test update::tests::structured_release_status_validates_a_local_manifest ... ok2515test update::tests::validates_versions_before_using_them_in_release_urls ... ok2516test update::tests::verifies_release_sha256_before_installing ... ok2517test web::assets::tests::embedded_index_references_embedded_assets ... ok2518test web::auth::tests::a_browser_may_lower_but_never_raise_the_operator_limit ... ok2519test web::auth::tests::a_ticket_reclaimed_after_authenticating_cannot_connect ... ok2520test web::auth::tests::a_valid_ticket_wins_without_spending_a_code_sent_with_it ... ok2521test web::auth::tests::operator_pairing_never_revokes_a_connected_device ... ok2522test web::auth::tests::operator_pairing_reclaims_one_long_disconnected_device ... ok2523test web::auth::tests::operator_pairing_replaces_the_oldest_unused_link_first ... ok2524test web::auth::tests::operator_pairing_spares_a_device_between_pairing_and_connecting ... ok2525test web::auth::tests::operator_pairing_spares_a_tab_that_may_be_reconnecting ... ok2526test web::auth::tests::pairing_is_one_use_and_tickets_are_independent ... ok2527test web::auth::tests::rolled_back_pairing_can_authenticate_again ... ok2528test web::auth::tests::url_tokens_use_only_unreserved_characters ... ok2529test web::server::tests::a_non_default_port_is_never_stripped ... ok2530test web::server::tests::a_pasted_remote_origin_is_answered_exactly ... ok2531test web::server::tests::authenticated_capacity_is_bounded_and_released ... ok2532test web::server::tests::identifiers_and_methods_keep_the_bridge_alphabet ... ok2533test web::server::tests::interactive_input_has_an_independent_rate_budget ... ok2534test web::server::tests::loopback_on_a_default_port_is_answered ... ok2535test web::server::tests::only_loopback_and_configured_hosts_are_answered ... ok2536test web::server::tests::origins_are_exact_and_pathless ... ok2537test web::server::tests::pending_authentications_have_their_own_cap ... ok2538test web::server::tests::terminal_frames_are_latest_wins_per_stream ... ok2539test web::tests::operator_input_accepts_only_complete_https_origins ... ok2540test web::tests::operator_messages_say_what_happened ... ok2541test web::tests::options_are_read_only_and_loopback_by_default ... ok2542test web::tests::options_validate_authority_devices_and_origins ... ok2543test web::tests::the_launcher_cannot_be_broken_out_of ... ok2544test web::tests::the_launcher_is_private_and_removed_afterwards ... ok2545test worktree::tests::cancelled_post_validation_cleans_receipted_worktree_and_branch ... ok2546test worktree::tests::config_requires_a_provider_id ... ok2547test worktree::tests::failed_validation_keeps_a_new_checkout_on_another_branch ... ok2548test worktree::tests::failed_validation_never_removes_a_preexisting_worktree ... ok2549test worktree::tests::parses_strict_provider_json_and_rejects_other_output ... ok25502551failures:25522553---- app::input::tests::a_key_that_dismisses_the_bar_overflow_never_repeats_into_the_view stdout ----25542555thread 'app::input::tests::a_key_that_dismisses_the_bar_overflow_never_repeats_into_the_view' (55141184) panicked at src/app/input.rs:6248:9:2556fixture opens the Git dashboard25572558---- app::tests::api_worktree_create_uses_configured_module_provider stdout ----25592560thread 'app::tests::api_worktree_create_uses_configured_module_provider' (55152606) panicked at src/app/mod.rs:12258:9:2561assertion `left == right` failed: {"error":{"code":"git_error","message":"worktree provider returned a non-absolute path"},"id":"create"}2562 left: Null2563 right: "/nix/var/nix/builds/nix-28177-3218472384/luvus-module-provider-api-create-72306/wt-topic"256425652566failures:2567 app::input::tests::a_key_that_dismisses_the_bar_overflow_never_repeats_into_the_view2568 app::tests::api_worktree_create_uses_configured_module_provider25692570test result: FAILED. 2348 passed; 2 failed; 6 ignored; 0 measured; 11 filtered out; finished in 83.19s25712572error: test failed, to rerun pass `--bin luvus`