setup
checks.x86_64-linux.pkgs-luvus
· build #6333
· raw
1these 2 derivations will be built:2 /nix/store/fskcwgl987ndbvzsp4cijj9igxmswbh1-luvus-0.14.3.drv3 /nix/store/ard7axip6zwzanra4s0mirpi7afxna33-check-luvus.drv4error: Cannot build '/nix/store/fskcwgl987ndbvzsp4cijj9igxmswbh1-luvus-0.14.3.drv'.5 Reason: builder failed with exit code 101.6 Output paths:7 /nix/store/nhbpcq5jfx50jgkbqrbcvjwcs24gwrnz-luvus-0.14.38 Last 25 log lines:9 >10 > ---- app::tests::api_worktree_create_uses_configured_module_provider stdout ----11 >12 > thread 'app::tests::api_worktree_create_uses_configured_module_provider' (8647) panicked at src/app/mod.rs:12258:9:13 > assertion `left == right` failed: {"error":{"code":"git_error","message":"worktree provider returned a non-absolute path"},"id":"create"}14 > left: Null15 > right: "/build/luvus-module-provider-api-create-3975/wt-topic"16 >17 > ---- orch::worker::tests::direct_launch_delivers_a_multiline_briefing_beyond_canonical_tty_limits stdout ----18 >19 > thread 'orch::worker::tests::direct_launch_delivers_a_multiline_briefing_beyond_canonical_tty_limits' (11430) panicked at src/orch/worker.rs:433:9:20 > assertion failed: launch(&nested_command, &briefing, "t42").unwrap().success()21 >22 >23 > failures:24 > app::dispatch::tests::agents::observed_prompt_requires_a_new_active_state_and_preserves_until25 > app::input::tests::a_key_that_dismisses_the_bar_overflow_never_repeats_into_the_view26 > app::input::tests::pane_search_word_highlight_does_not_use_global_flash27 > app::search::tests::legacy_exact_search_uses_shared_folding_and_original_byte_columns28 > app::tests::api_worktree_create_uses_configured_module_provider29 > orch::worker::tests::direct_launch_delivers_a_multiline_briefing_beyond_canonical_tty_limits30 >31 > test result: FAILED. 2344 passed; 6 failed; 6 ignored; 0 measured; 10 filtered out; finished in 38.28s32 >33 > error: test failed, to rerun pass `--bin luvus`34 For full logs, run:35 nix log /nix/store/fskcwgl987ndbvzsp4cijj9igxmswbh1-luvus-0.14.3.drv36error: Cannot build '/nix/store/ard7axip6zwzanra4s0mirpi7afxna33-check-luvus.drv'.37 Reason: 1 dependency failed.38 Output paths:39 /nix/store/yq0m9nkp8wi4f0kxi07msk2vz3jf4bpz-check-luvus