setup
checks.aarch64-linux.pkgs-luvus
· build #6333
· raw
1these 2 derivations will be built:2 /nix/store/gxlikwlz33ii0bar2831h23a8iwafz7z-luvus-0.14.3.drv3 /nix/store/xz45iwi423ivc4i9w5mhi1lmafkz4p2d-check-luvus.drv4error: build of '/nix/store/gxlikwlz33ii0bar2831h23a8iwafz7z-luvus-0.14.3.drv' on 'grpc://farm.numtide.com:50051?client-cert=/run/secrets/vars/per-machine/bld1/nix-farm-ci/crt&client-key=/run/secrets/vars/per-machine/bld1/nix-farm-ci/key&connect-timeout=21&system=aarch64-linux' failed: Cannot build '/nix/store/gxlikwlz33ii0bar2831h23a8iwafz7z-luvus-0.14.3.drv'.5 Reason: builder failed with exit code 101.6 Output paths:7 /nix/store/ibd842l0zjfgiiv3pap4d96w7wd845fq-luvus-0.14.38 Last 25 log lines:9 > right: 110 >11 > ---- app::tests::api_worktree_create_uses_configured_module_provider stdout ----12 >13 > thread 'app::tests::api_worktree_create_uses_configured_module_provider' (8641) panicked at src/app/mod.rs:12258:9:14 > assertion `left == right` failed: {"error":{"code":"git_error","message":"worktree provider returned a non-absolute path"},"id":"create"}15 > left: Null16 > right: "/build/luvus-module-provider-api-create-3964/wt-topic"17 >18 > ---- orch::worker::tests::direct_launch_delivers_a_multiline_briefing_beyond_canonical_tty_limits stdout ----19 >20 > thread 'orch::worker::tests::direct_launch_delivers_a_multiline_briefing_beyond_canonical_tty_limits' (11424) panicked at src/orch/worker.rs:433:9:21 > assertion failed: launch(&nested_command, &briefing, "t42").unwrap().success()22 >23 >24 > failures:25 > app::input::tests::a_key_that_dismisses_the_bar_overflow_never_repeats_into_the_view26 > app::input::tests::pane_search_word_highlight_does_not_use_global_flash27 > app::search::tests::legacy_exact_search_uses_shared_folding_and_original_byte_columns28 > app::tests::api_worktree_create_uses_configured_module_provider29 > orch::worker::tests::direct_launch_delivers_a_multiline_briefing_beyond_canonical_tty_limits30 >31 > test result: FAILED. 2345 passed; 5 failed; 6 ignored; 0 measured; 10 filtered out; finished in 39.48s32 >33 > error: test failed, to rerun pass `--bin luvus`34 For full logs, run:35 nix log /nix/store/gxlikwlz33ii0bar2831h23a8iwafz7z-luvus-0.14.3.drv36error: Cannot build '/nix/store/gxlikwlz33ii0bar2831h23a8iwafz7z-luvus-0.14.3.drv'.37 Reason: builder failed with exit code 1.38 Output paths:39 /nix/store/ibd842l0zjfgiiv3pap4d96w7wd845fq-luvus-0.14.340error: Cannot build '/nix/store/xz45iwi423ivc4i9w5mhi1lmafkz4p2d-check-luvus.drv'.41 Reason: 1 dependency failed.42 Output paths:43 /nix/store/hzbhadsdb1mzgw1ls58ddc8hiv5r6jid-check-luvus