nixbot

builds

failed mcptoon-0.8.5 checks.x86_64-linux.pkgs-mcptoon · build #6332 · raw

1Sourcing python-remove-tests-dir-hook2Sourcing python-catch-conflicts-hook.sh3Sourcing python-remove-bin-bytecode-hook.sh4Sourcing pypa-build-hook5Using pypaBuildPhase6Sourcing python-runtime-deps-check-hook7Using pythonRuntimeDepsCheckHook8Sourcing pypa-install-hook9Using pypaInstallPhase10Sourcing python-imports-check-hook.sh11Using pythonImportsCheckPhase12Sourcing python-namespaces-hook13Sourcing python-catch-conflicts-hook.sh14Sourcing pytest-check-hook15Using pytestCheckPhase
unpackPhase
16unpacking source archive /nix/store/1s4fdarqykxrf6wamy9ccnih8vf6zfdb-source17source root is source18setting SOURCE_DATE_EPOCH to timestamp 315619200 of file "source/tests/test_watch.py"
configurePhase
19no configure script, doing nothing
buildPhase
20Executing pypaBuildPhase21Creating a wheel...22pypa build flags: --no-isolation --outdir dist/ --wheel23* Getting build dependencies for wheel...24/nix/store/gyficbimx12q5975523ps3kjzz8ys4pq-python3.14-setuptools-83.0.0/lib/python3.14/site-packages/setuptools/config/_apply_pyprojecttoml.py:82: SetuptoolsDeprecationWarning: `project.license` as a TOML table is deprecated25!!2627 ********************************************************************************28 Please use a simple string containing a SPDX expression for `project.license`. You can also use `project.license-files`. (Both options available on setuptools>=77.0.0).2930 By 2027-Feb-18, you need to update your project and remove deprecated calls31 or your builds will no longer be supported.3233 See https://packaging.python.org/en/latest/guides/writing-pyproject-toml/#license for details.34 ********************************************************************************3536!!37 corresp(dist, value, root_dir)38/nix/store/gyficbimx12q5975523ps3kjzz8ys4pq-python3.14-setuptools-83.0.0/lib/python3.14/site-packages/setuptools/config/_apply_pyprojecttoml.py:61: SetuptoolsDeprecationWarning: License classifiers are deprecated.39!!4041 ********************************************************************************42 Please consider removing the following classifiers in favor of a SPDX license expression:4344 License :: OSI Approved :: Apache Software License4546 See https://packaging.python.org/en/latest/guides/writing-pyproject-toml/#license for details.47 ********************************************************************************4849!!50 dist._finalize_license_expression()51/nix/store/gyficbimx12q5975523ps3kjzz8ys4pq-python3.14-setuptools-83.0.0/lib/python3.14/site-packages/setuptools/dist.py:765: SetuptoolsDeprecationWarning: License classifiers are deprecated.52!!5354 ********************************************************************************55 Please consider removing the following classifiers in favor of a SPDX license expression:5657 License :: OSI Approved :: Apache Software License5859 See https://packaging.python.org/en/latest/guides/writing-pyproject-toml/#license for details.60 ********************************************************************************6162!!63 self._finalize_license_expression()64running egg_info65creating src/mcptoon.egg-info66writing src/mcptoon.egg-info/PKG-INFO67writing dependency_links to src/mcptoon.egg-info/dependency_links.txt68writing entry points to src/mcptoon.egg-info/entry_points.txt69writing requirements to src/mcptoon.egg-info/requires.txt70writing top-level names to src/mcptoon.egg-info/top_level.txt71writing manifest file 'src/mcptoon.egg-info/SOURCES.txt'72reading manifest file 'src/mcptoon.egg-info/SOURCES.txt'73adding license file 'LICENSE'74adding license file 'NOTICE'75writing manifest file 'src/mcptoon.egg-info/SOURCES.txt'76* Building wheel...77/nix/store/gyficbimx12q5975523ps3kjzz8ys4pq-python3.14-setuptools-83.0.0/lib/python3.14/site-packages/setuptools/config/_apply_pyprojecttoml.py:82: SetuptoolsDeprecationWarning: `project.license` as a TOML table is deprecated78!!7980 ********************************************************************************81 Please use a simple string containing a SPDX expression for `project.license`. You can also use `project.license-files`. (Both options available on setuptools>=77.0.0).8283 By 2027-Feb-18, you need to update your project and remove deprecated calls84 or your builds will no longer be supported.8586 See https://packaging.python.org/en/latest/guides/writing-pyproject-toml/#license for details.87 ********************************************************************************8889!!90 corresp(dist, value, root_dir)91/nix/store/gyficbimx12q5975523ps3kjzz8ys4pq-python3.14-setuptools-83.0.0/lib/python3.14/site-packages/setuptools/config/_apply_pyprojecttoml.py:61: SetuptoolsDeprecationWarning: License classifiers are deprecated.92!!9394 ********************************************************************************95 Please consider removing the following classifiers in favor of a SPDX license expression:9697 License :: OSI Approved :: Apache Software License9899 See https://packaging.python.org/en/latest/guides/writing-pyproject-toml/#license for details.100 ********************************************************************************101102!!103 dist._finalize_license_expression()104/nix/store/gyficbimx12q5975523ps3kjzz8ys4pq-python3.14-setuptools-83.0.0/lib/python3.14/site-packages/setuptools/dist.py:765: SetuptoolsDeprecationWarning: License classifiers are deprecated.105!!106107 ********************************************************************************108 Please consider removing the following classifiers in favor of a SPDX license expression:109110 License :: OSI Approved :: Apache Software License111112 See https://packaging.python.org/en/latest/guides/writing-pyproject-toml/#license for details.113 ********************************************************************************114115!!116 self._finalize_license_expression()117running bdist_wheel118running build119running build_py120creating build/lib/mcptoon121copying src/mcptoon/cli.py -> build/lib/mcptoon122copying src/mcptoon/installer.py -> build/lib/mcptoon123copying src/mcptoon/client.py -> build/lib/mcptoon124copying src/mcptoon/cache.py -> build/lib/mcptoon125copying src/mcptoon/skills.py -> build/lib/mcptoon126copying src/mcptoon/__init__.py -> build/lib/mcptoon127copying src/mcptoon/bench.py -> build/lib/mcptoon128copying src/mcptoon/watch.py -> build/lib/mcptoon129copying src/mcptoon/errors.py -> build/lib/mcptoon130copying src/mcptoon/schema_simplifier.py -> build/lib/mcptoon131copying src/mcptoon/headers.py -> build/lib/mcptoon132copying src/mcptoon/plugin.py -> build/lib/mcptoon133copying src/mcptoon/demo_server.py -> build/lib/mcptoon134copying src/mcptoon/compressor.py -> build/lib/mcptoon135copying src/mcptoon/output.py -> build/lib/mcptoon136copying src/mcptoon/usage.py -> build/lib/mcptoon137copying src/mcptoon/bench_tokens.py -> build/lib/mcptoon138copying src/mcptoon/footer.py -> build/lib/mcptoon139copying src/mcptoon/update.py -> build/lib/mcptoon140copying src/mcptoon/discover.py -> build/lib/mcptoon141copying src/mcptoon/native_tools.py -> build/lib/mcptoon142copying src/mcptoon/packs.py -> build/lib/mcptoon143copying src/mcptoon/serve.py -> build/lib/mcptoon144copying src/mcptoon/health.py -> build/lib/mcptoon145copying src/mcptoon/__main__.py -> build/lib/mcptoon146copying src/mcptoon/sync.py -> build/lib/mcptoon147copying src/mcptoon/toon_vendored.py -> build/lib/mcptoon148copying src/mcptoon/router.py -> build/lib/mcptoon149copying src/mcptoon/manifest.py -> build/lib/mcptoon150copying src/mcptoon/ccr.py -> build/lib/mcptoon151copying src/mcptoon/config.py -> build/lib/mcptoon152copying src/mcptoon/demo.py -> build/lib/mcptoon153copying src/mcptoon/report.py -> build/lib/mcptoon154copying src/mcptoon/welcome.py -> build/lib/mcptoon155running egg_info156writing src/mcptoon.egg-info/PKG-INFO157writing dependency_links to src/mcptoon.egg-info/dependency_links.txt158writing entry points to src/mcptoon.egg-info/entry_points.txt159writing requirements to src/mcptoon.egg-info/requires.txt160writing top-level names to src/mcptoon.egg-info/top_level.txt161reading manifest file 'src/mcptoon.egg-info/SOURCES.txt'162adding license file 'LICENSE'163adding license file 'NOTICE'164writing manifest file 'src/mcptoon.egg-info/SOURCES.txt'165copying src/mcptoon/packs.json -> build/lib/mcptoon166creating build/lib/mcptoon/skill167copying src/mcptoon/skill/SKILL.md -> build/lib/mcptoon/skill168installing to build/bdist.linux-x86_64/wheel169running install170running install_lib171creating build/bdist.linux-x86_64/wheel172creating build/bdist.linux-x86_64/wheel/mcptoon173copying build/lib/mcptoon/skills.py -> build/bdist.linux-x86_64/wheel/./mcptoon174creating build/bdist.linux-x86_64/wheel/mcptoon/skill175copying build/lib/mcptoon/skill/SKILL.md -> build/bdist.linux-x86_64/wheel/./mcptoon/skill176copying build/lib/mcptoon/demo.py -> build/bdist.linux-x86_64/wheel/./mcptoon177copying build/lib/mcptoon/discover.py -> build/bdist.linux-x86_64/wheel/./mcptoon178copying build/lib/mcptoon/headers.py -> build/bdist.linux-x86_64/wheel/./mcptoon179copying build/lib/mcptoon/client.py -> build/bdist.linux-x86_64/wheel/./mcptoon180copying build/lib/mcptoon/__main__.py -> build/bdist.linux-x86_64/wheel/./mcptoon181copying build/lib/mcptoon/demo_server.py -> build/bdist.linux-x86_64/wheel/./mcptoon182copying build/lib/mcptoon/packs.py -> build/bdist.linux-x86_64/wheel/./mcptoon183copying build/lib/mcptoon/serve.py -> build/bdist.linux-x86_64/wheel/./mcptoon184copying build/lib/mcptoon/packs.json -> build/bdist.linux-x86_64/wheel/./mcptoon185copying build/lib/mcptoon/errors.py -> build/bdist.linux-x86_64/wheel/./mcptoon186copying build/lib/mcptoon/toon_vendored.py -> build/bdist.linux-x86_64/wheel/./mcptoon187copying build/lib/mcptoon/manifest.py -> build/bdist.linux-x86_64/wheel/./mcptoon188copying build/lib/mcptoon/cli.py -> build/bdist.linux-x86_64/wheel/./mcptoon189copying build/lib/mcptoon/compressor.py -> build/bdist.linux-x86_64/wheel/./mcptoon190copying build/lib/mcptoon/sync.py -> build/bdist.linux-x86_64/wheel/./mcptoon191copying build/lib/mcptoon/plugin.py -> build/bdist.linux-x86_64/wheel/./mcptoon192copying build/lib/mcptoon/output.py -> build/bdist.linux-x86_64/wheel/./mcptoon193copying build/lib/mcptoon/usage.py -> build/bdist.linux-x86_64/wheel/./mcptoon194copying build/lib/mcptoon/footer.py -> build/bdist.linux-x86_64/wheel/./mcptoon195copying build/lib/mcptoon/update.py -> build/bdist.linux-x86_64/wheel/./mcptoon196copying build/lib/mcptoon/ccr.py -> build/bdist.linux-x86_64/wheel/./mcptoon197copying build/lib/mcptoon/health.py -> build/bdist.linux-x86_64/wheel/./mcptoon198copying build/lib/mcptoon/welcome.py -> build/bdist.linux-x86_64/wheel/./mcptoon199copying build/lib/mcptoon/__init__.py -> build/bdist.linux-x86_64/wheel/./mcptoon200copying build/lib/mcptoon/config.py -> build/bdist.linux-x86_64/wheel/./mcptoon201copying build/lib/mcptoon/watch.py -> build/bdist.linux-x86_64/wheel/./mcptoon202copying build/lib/mcptoon/installer.py -> build/bdist.linux-x86_64/wheel/./mcptoon203copying build/lib/mcptoon/bench.py -> build/bdist.linux-x86_64/wheel/./mcptoon204copying build/lib/mcptoon/router.py -> build/bdist.linux-x86_64/wheel/./mcptoon205copying build/lib/mcptoon/bench_tokens.py -> build/bdist.linux-x86_64/wheel/./mcptoon206copying build/lib/mcptoon/cache.py -> build/bdist.linux-x86_64/wheel/./mcptoon207copying build/lib/mcptoon/native_tools.py -> build/bdist.linux-x86_64/wheel/./mcptoon208copying build/lib/mcptoon/schema_simplifier.py -> build/bdist.linux-x86_64/wheel/./mcptoon209copying build/lib/mcptoon/report.py -> build/bdist.linux-x86_64/wheel/./mcptoon210running install_egg_info211Copying src/mcptoon.egg-info to build/bdist.linux-x86_64/wheel/./mcptoon-0.8.5-py3.14.egg-info212running install_scripts213creating build/bdist.linux-x86_64/wheel/mcptoon-0.8.5.dist-info/WHEEL214creating '/build/source/dist/.tmp-vke7zjw3/mcptoon-0.8.5-py3-none-any.whl' and adding 'build/bdist.linux-x86_64/wheel' to it215adding 'mcptoon/__init__.py'216adding 'mcptoon/__main__.py'217adding 'mcptoon/bench.py'218adding 'mcptoon/bench_tokens.py'219adding 'mcptoon/cache.py'220adding 'mcptoon/ccr.py'221adding 'mcptoon/cli.py'222adding 'mcptoon/client.py'223adding 'mcptoon/compressor.py'224adding 'mcptoon/config.py'225adding 'mcptoon/demo.py'226adding 'mcptoon/demo_server.py'227adding 'mcptoon/discover.py'228adding 'mcptoon/errors.py'229adding 'mcptoon/footer.py'230adding 'mcptoon/headers.py'231adding 'mcptoon/health.py'232adding 'mcptoon/installer.py'233adding 'mcptoon/manifest.py'234adding 'mcptoon/native_tools.py'235adding 'mcptoon/output.py'236adding 'mcptoon/packs.json'237adding 'mcptoon/packs.py'238adding 'mcptoon/plugin.py'239adding 'mcptoon/report.py'240adding 'mcptoon/router.py'241adding 'mcptoon/schema_simplifier.py'242adding 'mcptoon/serve.py'243adding 'mcptoon/skills.py'244adding 'mcptoon/sync.py'245adding 'mcptoon/toon_vendored.py'246adding 'mcptoon/update.py'247adding 'mcptoon/usage.py'248adding 'mcptoon/watch.py'249adding 'mcptoon/welcome.py'250adding 'mcptoon/skill/SKILL.md'251adding 'mcptoon-0.8.5.dist-info/licenses/LICENSE'252adding 'mcptoon-0.8.5.dist-info/licenses/NOTICE'253adding 'mcptoon-0.8.5.dist-info/METADATA'254adding 'mcptoon-0.8.5.dist-info/WHEEL'255adding 'mcptoon-0.8.5.dist-info/entry_points.txt'256adding 'mcptoon-0.8.5.dist-info/top_level.txt'257adding 'mcptoon-0.8.5.dist-info/RECORD'258removing build/bdist.linux-x86_64/wheel259Successfully built mcptoon-0.8.5-py3-none-any.whl260Finished creating a wheel...261Finished executing pypaBuildPhase
pythonRuntimeDepsCheckHook
262Executing pythonRuntimeDepsCheck263Checking runtime dependencies for mcptoon-0.8.5-py3-none-any.whl264Finished executing pythonRuntimeDepsCheck
installPhase
265Executing pypaInstallPhase266Successfully installed mcptoon-0.8.5-py3-none-any.whl267Finished executing pypaInstallPhase
pythonOutputDistPhase
268Executing pythonOutputDistPhase269Finished executing pythonOutputDistPhase
fixupPhase
270shrinking RPATHs of ELF executables and libraries in /nix/store/z57lbhyc0g6n0cgzlm0asm7b6n8l5rx9-mcptoon-0.8.5271checking for references to /build/ in /nix/store/z57lbhyc0g6n0cgzlm0asm7b6n8l5rx9-mcptoon-0.8.5...272patching script interpreter paths in /nix/store/z57lbhyc0g6n0cgzlm0asm7b6n8l5rx9-mcptoon-0.8.5273stripping (with command strip and flags -S -p) in /nix/store/z57lbhyc0g6n0cgzlm0asm7b6n8l5rx9-mcptoon-0.8.5/lib /nix/store/z57lbhyc0g6n0cgzlm0asm7b6n8l5rx9-mcptoon-0.8.5/bin274shrinking RPATHs of ELF executables and libraries in /nix/store/0gfp6m0wcr8vw32vm3mxxz2s3953w3nz-mcptoon-0.8.5-dist275checking for references to /build/ in /nix/store/0gfp6m0wcr8vw32vm3mxxz2s3953w3nz-mcptoon-0.8.5-dist...276patching script interpreter paths in /nix/store/0gfp6m0wcr8vw32vm3mxxz2s3953w3nz-mcptoon-0.8.5-dist277Rewriting #!/nix/store/d64q19q1xjdwfhqx6czvrjgrhq0n3lcc-python3-3.14.7/bin/python3.14 to #!/nix/store/d64q19q1xjdwfhqx6czvrjgrhq0n3lcc-python3-3.14.7278wrapping `/nix/store/z57lbhyc0g6n0cgzlm0asm7b6n8l5rx9-mcptoon-0.8.5/bin/mcptoon'...279Executing pythonRemoveTestsDir280Finished executing pythonRemoveTestsDir
installCheckPhase
281no Makefile or custom installCheckPhase, doing nothing
pythonImportsCheckPhase
282Executing pythonImportsCheckPhase283Check whether the following modules can be imported: mcptoon
pytestCheckPhase
284Executing pytestCheckPhase285pytest flags: -m pytest -k not\ \(test_search_registry_returns_list\)\ and\ not\ \(test_search_smithery_returns_list\)\ and\ not\ \(test_search_mcp_registry_returns_list\)286============================= test session starts ==============================287platform linux -- Python 3.14.7, pytest-9.1.1, pluggy-1.6.0288rootdir: /build/source289configfile: pyproject.toml290testpaths: tests291collected 1740 items / 3 deselected / 1737 selected 292293tests/test_add_url_validation.py .............. [ 0%]294tests/test_bench.py ............. [ 1%]295tests/test_bench_tokens.py ....ss.. [ 2%]296tests/test_cache.py .... [ 2%]297tests/test_calculator.py .......................... [ 3%]298tests/test_ccr.py ........... [ 4%]299tests/test_claude_plugin_package.py ............. [ 5%]300tests/test_cli_flags.py ........... [ 5%]301tests/test_cli_smoke.py ....... [ 6%]302tests/test_client.py .............................. [ 7%]303tests/test_command_coverage.py ......... [ 8%]304tests/test_completion.py ........... [ 9%]305tests/test_compressor.py ......................... [ 10%]306tests/test_config.py .................... [ 11%]307tests/test_dead_server_diagnostics.py ... [ 11%]308tests/test_demo.py ..................... [ 13%]309tests/test_demo_dead_package.py ........ [ 13%]310tests/test_demo_server.py .............................................. [ 16%]311..... [ 16%]312tests/test_discover.py .................................... [ 18%]313tests/test_doctor_star_hint.py ..... [ 18%]314tests/test_envelope.py ........ [ 19%]315tests/test_exit_codes.py .................... [ 20%]316tests/test_fallback_json.py ...... [ 20%]317tests/test_footer_broadcast.py ......................................... [ 23%]318.... [ 23%]319tests/test_footprint_claims.py ............ [ 24%]320tests/test_gemini_manifest.py ...... [ 24%]321tests/test_health.py ............. [ 25%]322tests/test_help_shortcircuit.py ......... [ 25%]323tests/test_http_user_agent.py ......... [ 26%]324tests/test_import.py ..................... [ 27%]325tests/test_installer_registry.py ............................ [ 28%]326tests/test_lang.py .............................. [ 30%]327tests/test_llms_txt.py ...... [ 31%]328tests/test_native_tools.py ............................................. [ 33%]329........................ [ 35%]330tests/test_output.py ................................................... [ 37%]331........................................................................ [ 42%]332................ [ 43%]333tests/test_plugin_install.py .......... [ 43%]334tests/test_plugin_scan.py ............................... [ 45%]335tests/test_policy_overrides.py ................ [ 46%]336tests/test_presence.py ................................................. [ 49%]337........... [ 49%]338tests/test_readme_links.py ... [ 49%]339tests/test_registry_sync.py ............. [ 50%]340tests/test_report.py .............. [ 51%]341tests/test_reversible.py ............................................... [ 54%]342................. [ 55%]343tests/test_router.py .............................................. [ 57%]344tests/test_schema_call_e2e.py .. [ 57%]345tests/test_search.py ................................... [ 59%]346tests/test_serve.py .................................................... [ 62%]347 [ 62%]348tests/test_serve_perf.py .......... [ 63%]349tests/test_serve_prompts.py ........ [ 63%]350tests/test_skill_package.py ..F......................... [ 65%]351tests/test_skill_packs.py ................ [ 66%]352tests/test_skill_search.py .......... [ 67%]353tests/test_skills.py ................................................... [ 70%]354.....................ss................................................. [ 74%]355................................... [ 76%]356tests/test_smart_compress_e2e.py ................. [ 77%]357tests/test_stats_toggle.py ......... [ 77%]358tests/test_stderr_pipe_deadlock.py .... [ 77%]359tests/test_sync.py ..................................................... [ 80%]360................................ [ 82%]361tests/test_tier_claims_consistent.py .... [ 83%]362tests/test_toml_config.py .......................... [ 84%]363tests/test_toon_cross_validate.py ............................... [ 86%]364tests/test_uninstall_end_to_end.py .......... [ 86%]365tests/test_update.py .................... [ 88%]366tests/test_v02_features.py .................................... [ 90%]367tests/test_v04_features.py ................ [ 91%]368tests/test_v05_features.py ...................... [ 92%]369tests/test_v072_delight.py ..................s.. [ 93%]370tests/test_v073_http_security.py .............................. [ 95%]371tests/test_v074_stdio_timeout.py ............ [ 95%]372tests/test_v076_stateless_serve.py ................... [ 97%]373tests/test_v07_spec2026.py ..................... [ 98%]374tests/test_v081_env_headers.py ............. [ 98%]375tests/test_watch.py .................. [100%]376377=================================== FAILURES ===================================378_____ TestThreeCopiesAgree.test_packaged_path_resolves_to_the_copy_on_disk _____379380self = <tests.test_skill_package.TestThreeCopiesAgree object at 0x7ffff4d85350>381382 def test_packaged_path_resolves_to_the_copy_on_disk(self):383 """`install_self` copies from this path, so it must be the real one."""384 resolved = skills.packaged_skill_path()385 assert resolved.is_file(), resolved386> assert resolved.resolve() == COPIES["packaged"].resolve()387E AssertionError: assert PosixPath('/nix/store/z57lbhyc0g6n0cgzlm0asm7b6n8l5rx9-mcptoon-0.8.5/lib/python3.14/site-packages/mcptoon/skill/SKILL.md') == PosixPath('/build/source/src/mcptoon/skill/SKILL.md')388E + where PosixPath('/nix/store/z57lbhyc0g6n0cgzlm0asm7b6n8l5rx9-mcptoon-0.8.5/lib/python3.14/site-packages/mcptoon/skill/SKILL.md') = resolve()389E + where resolve = PosixPath('/nix/store/z57lbhyc0g6n0cgzlm0asm7b6n8l5rx9-mcptoon-0.8.5/lib/python3.14/site-packages/mcptoon/skill/SKILL.md').resolve390E + and PosixPath('/build/source/src/mcptoon/skill/SKILL.md') = resolve()391E + where resolve = PosixPath('/build/source/src/mcptoon/skill/SKILL.md').resolve392393tests/test_skill_package.py:86: AssertionError394=========================== short test summary info ============================395FAILED tests/test_skill_package.py::TestThreeCopiesAgree::test_packaged_path_resolves_to_the_copy_on_disk - AssertionError: assert PosixPath('/nix/store/z57lbhyc0g6n0cgzlm0asm7b6n8l5r...396====== 1 failed, 1731 passed, 5 skipped, 3 deselected in 73.52s (0:01:13) ======