setup
checks.x86_64-linux.pkgs-mcptoon
· build #6332
· raw
1these 2 derivations will be built:2 /nix/store/mdwnxjhwpvz0vh0p0n1z762gqvzr4gj3-mcptoon-0.8.5.drv3 /nix/store/bzlzcdkpnc5dw4lgx77xakyaqwpx0ap1-check-mcptoon.drv4error: Cannot build '/nix/store/mdwnxjhwpvz0vh0p0n1z762gqvzr4gj3-mcptoon-0.8.5.drv'.5 Reason: builder failed with exit code 1.6 Output paths:7 /nix/store/0gfp6m0wcr8vw32vm3mxxz2s3953w3nz-mcptoon-0.8.5-dist8 /nix/store/z57lbhyc0g6n0cgzlm0asm7b6n8l5rx9-mcptoon-0.8.59 Last 25 log lines:10 > tests/test_v076_stateless_serve.py ................... [ 97%]11 > tests/test_v07_spec2026.py ..................... [ 98%]12 > tests/test_v081_env_headers.py ............. [ 98%]13 > tests/test_watch.py .................. [100%]14 >15 > =================================== FAILURES ===================================16 > _____ TestThreeCopiesAgree.test_packaged_path_resolves_to_the_copy_on_disk _____17 >18 > self = <tests.test_skill_package.TestThreeCopiesAgree object at 0x7ffff4d85350>19 >20 > def test_packaged_path_resolves_to_the_copy_on_disk(self):21 > """`install_self` copies from this path, so it must be the real one."""22 > resolved = skills.packaged_skill_path()23 > assert resolved.is_file(), resolved24 > > assert resolved.resolve() == COPIES["packaged"].resolve()25 > E AssertionError: assert PosixPath('/nix/store/z57lbhyc0g6n0cgzlm0asm7b6n8l5rx9-mcptoon-0.8.5/lib/python3.14/site-packages/mcptoon/skill/SKILL.md') == PosixPath('/build/source/src/mcptoon/skill/SKILL.md')26 > E + where PosixPath('/nix/store/z57lbhyc0g6n0cgzlm0asm7b6n8l5rx9-mcptoon-0.8.5/lib/python3.14/site-packages/mcptoon/skill/SKILL.md') = resolve()27 > E + where resolve = PosixPath('/nix/store/z57lbhyc0g6n0cgzlm0asm7b6n8l5rx9-mcptoon-0.8.5/lib/python3.14/site-packages/mcptoon/skill/SKILL.md').resolve28 > E + and PosixPath('/build/source/src/mcptoon/skill/SKILL.md') = resolve()29 > E + where resolve = PosixPath('/build/source/src/mcptoon/skill/SKILL.md').resolve30 >31 > tests/test_skill_package.py:86: AssertionError32 > =========================== short test summary info ============================33 > FAILED tests/test_skill_package.py::TestThreeCopiesAgree::test_packaged_path_resolves_to_the_copy_on_disk - AssertionError: assert PosixPath('/nix/store/z57lbhyc0g6n0cgzlm0asm7b6n8l5r...34 > ====== 1 failed, 1731 passed, 5 skipped, 3 deselected in 73.52s (0:01:13) ======35 For full logs, run:36 nix log /nix/store/mdwnxjhwpvz0vh0p0n1z762gqvzr4gj3-mcptoon-0.8.5.drv37error: Cannot build '/nix/store/bzlzcdkpnc5dw4lgx77xakyaqwpx0ap1-check-mcptoon.drv'.38 Reason: 1 dependency failed.39 Output paths:40 /nix/store/m6gm7b4k23zh12hakin37r16qaa346nx-check-mcptoon