nixbot

builds
1elastic-arm-7477f843: building 44rgxg7pi0j2zw3bd2g2qcy8rjh9apxl-mcptoon-0.8.5.drv2Sourcing python-remove-tests-dir-hook3Sourcing python-catch-conflicts-hook.sh4Sourcing python-remove-bin-bytecode-hook.sh5Sourcing pypa-build-hook6Using pypaBuildPhase7Sourcing python-runtime-deps-check-hook8Using pythonRuntimeDepsCheckHook9Sourcing pypa-install-hook10Using pypaInstallPhase11Sourcing python-imports-check-hook.sh12Using pythonImportsCheckPhase13Sourcing python-namespaces-hook14Sourcing python-catch-conflicts-hook.sh15Sourcing pytest-check-hook16Using pytestCheckPhase
unpackPhase
17unpacking source archive /nix/store/1s4fdarqykxrf6wamy9ccnih8vf6zfdb-source18source root is source19setting SOURCE_DATE_EPOCH to timestamp 315619200 of file "source/tests/test_watch.py"
configurePhase
20no configure script, doing nothing
buildPhase
21Executing pypaBuildPhase22Creating a wheel...23pypa build flags: --no-isolation --outdir dist/ --wheel24* Getting build dependencies for wheel...25/nix/store/idlwgfiz0sx90mimq3jjxl7vyi4pqspy-python3.14-setuptools-83.0.0/lib/python3.14/site-packages/setuptools/config/_apply_pyprojecttoml.py:82: SetuptoolsDeprecationWarning: `project.license` as a TOML table is deprecated26!!2728 ********************************************************************************29 Please use a simple string containing a SPDX expression for `project.license`. You can also use `project.license-files`. (Both options available on setuptools>=77.0.0).3031 By 2027-Feb-18, you need to update your project and remove deprecated calls32 or your builds will no longer be supported.3334 See https://packaging.python.org/en/latest/guides/writing-pyproject-toml/#license for details.35 ********************************************************************************3637!!38 corresp(dist, value, root_dir)39/nix/store/idlwgfiz0sx90mimq3jjxl7vyi4pqspy-python3.14-setuptools-83.0.0/lib/python3.14/site-packages/setuptools/config/_apply_pyprojecttoml.py:61: SetuptoolsDeprecationWarning: License classifiers are deprecated.40!!4142 ********************************************************************************43 Please consider removing the following classifiers in favor of a SPDX license expression:4445 License :: OSI Approved :: Apache Software License4647 See https://packaging.python.org/en/latest/guides/writing-pyproject-toml/#license for details.48 ********************************************************************************4950!!51 dist._finalize_license_expression()52/nix/store/idlwgfiz0sx90mimq3jjxl7vyi4pqspy-python3.14-setuptools-83.0.0/lib/python3.14/site-packages/setuptools/dist.py:765: SetuptoolsDeprecationWarning: License classifiers are deprecated.53!!5455 ********************************************************************************56 Please consider removing the following classifiers in favor of a SPDX license expression:5758 License :: OSI Approved :: Apache Software License5960 See https://packaging.python.org/en/latest/guides/writing-pyproject-toml/#license for details.61 ********************************************************************************6263!!64 self._finalize_license_expression()65running egg_info66creating src/mcptoon.egg-info67writing src/mcptoon.egg-info/PKG-INFO68writing dependency_links to src/mcptoon.egg-info/dependency_links.txt69writing entry points to src/mcptoon.egg-info/entry_points.txt70writing requirements to src/mcptoon.egg-info/requires.txt71writing top-level names to src/mcptoon.egg-info/top_level.txt72writing manifest file 'src/mcptoon.egg-info/SOURCES.txt'73reading manifest file 'src/mcptoon.egg-info/SOURCES.txt'74adding license file 'LICENSE'75adding license file 'NOTICE'76writing manifest file 'src/mcptoon.egg-info/SOURCES.txt'77* Building wheel...78/nix/store/idlwgfiz0sx90mimq3jjxl7vyi4pqspy-python3.14-setuptools-83.0.0/lib/python3.14/site-packages/setuptools/config/_apply_pyprojecttoml.py:82: SetuptoolsDeprecationWarning: `project.license` as a TOML table is deprecated79!!8081 ********************************************************************************82 Please use a simple string containing a SPDX expression for `project.license`. You can also use `project.license-files`. (Both options available on setuptools>=77.0.0).8384 By 2027-Feb-18, you need to update your project and remove deprecated calls85 or your builds will no longer be supported.8687 See https://packaging.python.org/en/latest/guides/writing-pyproject-toml/#license for details.88 ********************************************************************************8990!!91 corresp(dist, value, root_dir)92/nix/store/idlwgfiz0sx90mimq3jjxl7vyi4pqspy-python3.14-setuptools-83.0.0/lib/python3.14/site-packages/setuptools/config/_apply_pyprojecttoml.py:61: SetuptoolsDeprecationWarning: License classifiers are deprecated.93!!9495 ********************************************************************************96 Please consider removing the following classifiers in favor of a SPDX license expression:9798 License :: OSI Approved :: Apache Software License99100 See https://packaging.python.org/en/latest/guides/writing-pyproject-toml/#license for details.101 ********************************************************************************102103!!104 dist._finalize_license_expression()105/nix/store/idlwgfiz0sx90mimq3jjxl7vyi4pqspy-python3.14-setuptools-83.0.0/lib/python3.14/site-packages/setuptools/dist.py:765: SetuptoolsDeprecationWarning: License classifiers are deprecated.106!!107108 ********************************************************************************109 Please consider removing the following classifiers in favor of a SPDX license expression:110111 License :: OSI Approved :: Apache Software License112113 See https://packaging.python.org/en/latest/guides/writing-pyproject-toml/#license for details.114 ********************************************************************************115116!!117 self._finalize_license_expression()118running bdist_wheel119running build120running build_py121creating build/lib/mcptoon122copying src/mcptoon/watch.py -> build/lib/mcptoon123copying src/mcptoon/__main__.py -> build/lib/mcptoon124copying src/mcptoon/errors.py -> build/lib/mcptoon125copying src/mcptoon/report.py -> build/lib/mcptoon126copying src/mcptoon/update.py -> build/lib/mcptoon127copying src/mcptoon/plugin.py -> build/lib/mcptoon128copying src/mcptoon/demo_server.py -> build/lib/mcptoon129copying src/mcptoon/client.py -> build/lib/mcptoon130copying src/mcptoon/health.py -> build/lib/mcptoon131copying src/mcptoon/skills.py -> build/lib/mcptoon132copying src/mcptoon/serve.py -> build/lib/mcptoon133copying src/mcptoon/usage.py -> build/lib/mcptoon134copying src/mcptoon/router.py -> build/lib/mcptoon135copying src/mcptoon/compressor.py -> build/lib/mcptoon136copying src/mcptoon/__init__.py -> build/lib/mcptoon137copying src/mcptoon/config.py -> build/lib/mcptoon138copying src/mcptoon/output.py -> build/lib/mcptoon139copying src/mcptoon/headers.py -> build/lib/mcptoon140copying src/mcptoon/footer.py -> build/lib/mcptoon141copying src/mcptoon/sync.py -> build/lib/mcptoon142copying src/mcptoon/cache.py -> build/lib/mcptoon143copying src/mcptoon/native_tools.py -> build/lib/mcptoon144copying src/mcptoon/schema_simplifier.py -> build/lib/mcptoon145copying src/mcptoon/demo.py -> build/lib/mcptoon146copying src/mcptoon/ccr.py -> build/lib/mcptoon147copying src/mcptoon/bench.py -> build/lib/mcptoon148copying src/mcptoon/discover.py -> build/lib/mcptoon149copying src/mcptoon/cli.py -> build/lib/mcptoon150copying src/mcptoon/manifest.py -> build/lib/mcptoon151copying src/mcptoon/installer.py -> build/lib/mcptoon152copying src/mcptoon/bench_tokens.py -> build/lib/mcptoon153copying src/mcptoon/toon_vendored.py -> build/lib/mcptoon154copying src/mcptoon/packs.py -> build/lib/mcptoon155copying src/mcptoon/welcome.py -> build/lib/mcptoon156running egg_info157writing src/mcptoon.egg-info/PKG-INFO158writing dependency_links to src/mcptoon.egg-info/dependency_links.txt159writing entry points to src/mcptoon.egg-info/entry_points.txt160writing requirements to src/mcptoon.egg-info/requires.txt161writing top-level names to src/mcptoon.egg-info/top_level.txt162reading manifest file 'src/mcptoon.egg-info/SOURCES.txt'163adding license file 'LICENSE'164adding license file 'NOTICE'165writing manifest file 'src/mcptoon.egg-info/SOURCES.txt'166copying src/mcptoon/packs.json -> build/lib/mcptoon167creating build/lib/mcptoon/skill168copying src/mcptoon/skill/SKILL.md -> build/lib/mcptoon/skill169installing to build/bdist.linux-aarch64/wheel170running install171running install_lib172creating build/bdist.linux-aarch64/wheel173creating build/bdist.linux-aarch64/wheel/mcptoon174copying build/lib/mcptoon/watch.py -> build/bdist.linux-aarch64/wheel/./mcptoon175copying build/lib/mcptoon/__main__.py -> build/bdist.linux-aarch64/wheel/./mcptoon176copying build/lib/mcptoon/errors.py -> build/bdist.linux-aarch64/wheel/./mcptoon177copying build/lib/mcptoon/report.py -> build/bdist.linux-aarch64/wheel/./mcptoon178copying build/lib/mcptoon/update.py -> build/bdist.linux-aarch64/wheel/./mcptoon179creating build/bdist.linux-aarch64/wheel/mcptoon/skill180copying build/lib/mcptoon/skill/SKILL.md -> build/bdist.linux-aarch64/wheel/./mcptoon/skill181copying build/lib/mcptoon/plugin.py -> build/bdist.linux-aarch64/wheel/./mcptoon182copying build/lib/mcptoon/demo_server.py -> build/bdist.linux-aarch64/wheel/./mcptoon183copying build/lib/mcptoon/client.py -> build/bdist.linux-aarch64/wheel/./mcptoon184copying build/lib/mcptoon/health.py -> build/bdist.linux-aarch64/wheel/./mcptoon185copying build/lib/mcptoon/skills.py -> build/bdist.linux-aarch64/wheel/./mcptoon186copying build/lib/mcptoon/serve.py -> build/bdist.linux-aarch64/wheel/./mcptoon187copying build/lib/mcptoon/usage.py -> build/bdist.linux-aarch64/wheel/./mcptoon188copying build/lib/mcptoon/router.py -> build/bdist.linux-aarch64/wheel/./mcptoon189copying build/lib/mcptoon/compressor.py -> build/bdist.linux-aarch64/wheel/./mcptoon190copying build/lib/mcptoon/__init__.py -> build/bdist.linux-aarch64/wheel/./mcptoon191copying build/lib/mcptoon/config.py -> build/bdist.linux-aarch64/wheel/./mcptoon192copying build/lib/mcptoon/output.py -> build/bdist.linux-aarch64/wheel/./mcptoon193copying build/lib/mcptoon/headers.py -> build/bdist.linux-aarch64/wheel/./mcptoon194copying build/lib/mcptoon/footer.py -> build/bdist.linux-aarch64/wheel/./mcptoon195copying build/lib/mcptoon/sync.py -> build/bdist.linux-aarch64/wheel/./mcptoon196copying build/lib/mcptoon/cache.py -> build/bdist.linux-aarch64/wheel/./mcptoon197copying build/lib/mcptoon/native_tools.py -> build/bdist.linux-aarch64/wheel/./mcptoon198copying build/lib/mcptoon/schema_simplifier.py -> build/bdist.linux-aarch64/wheel/./mcptoon199copying build/lib/mcptoon/demo.py -> build/bdist.linux-aarch64/wheel/./mcptoon200copying build/lib/mcptoon/ccr.py -> build/bdist.linux-aarch64/wheel/./mcptoon201copying build/lib/mcptoon/bench.py -> build/bdist.linux-aarch64/wheel/./mcptoon202copying build/lib/mcptoon/discover.py -> build/bdist.linux-aarch64/wheel/./mcptoon203copying build/lib/mcptoon/cli.py -> build/bdist.linux-aarch64/wheel/./mcptoon204copying build/lib/mcptoon/manifest.py -> build/bdist.linux-aarch64/wheel/./mcptoon205copying build/lib/mcptoon/installer.py -> build/bdist.linux-aarch64/wheel/./mcptoon206copying build/lib/mcptoon/bench_tokens.py -> build/bdist.linux-aarch64/wheel/./mcptoon207copying build/lib/mcptoon/packs.json -> build/bdist.linux-aarch64/wheel/./mcptoon208copying build/lib/mcptoon/toon_vendored.py -> build/bdist.linux-aarch64/wheel/./mcptoon209copying build/lib/mcptoon/packs.py -> build/bdist.linux-aarch64/wheel/./mcptoon210copying build/lib/mcptoon/welcome.py -> build/bdist.linux-aarch64/wheel/./mcptoon211running install_egg_info212Copying src/mcptoon.egg-info to build/bdist.linux-aarch64/wheel/./mcptoon-0.8.5-py3.14.egg-info213running install_scripts214creating build/bdist.linux-aarch64/wheel/mcptoon-0.8.5.dist-info/WHEEL215creating '/build/source/dist/.tmp-cxc68dwe/mcptoon-0.8.5-py3-none-any.whl' and adding 'build/bdist.linux-aarch64/wheel' to it216adding 'mcptoon/__init__.py'217adding 'mcptoon/__main__.py'218adding 'mcptoon/bench.py'219adding 'mcptoon/bench_tokens.py'220adding 'mcptoon/cache.py'221adding 'mcptoon/ccr.py'222adding 'mcptoon/cli.py'223adding 'mcptoon/client.py'224adding 'mcptoon/compressor.py'225adding 'mcptoon/config.py'226adding 'mcptoon/demo.py'227adding 'mcptoon/demo_server.py'228adding 'mcptoon/discover.py'229adding 'mcptoon/errors.py'230adding 'mcptoon/footer.py'231adding 'mcptoon/headers.py'232adding 'mcptoon/health.py'233adding 'mcptoon/installer.py'234adding 'mcptoon/manifest.py'235adding 'mcptoon/native_tools.py'236adding 'mcptoon/output.py'237adding 'mcptoon/packs.json'238adding 'mcptoon/packs.py'239adding 'mcptoon/plugin.py'240adding 'mcptoon/report.py'241adding 'mcptoon/router.py'242adding 'mcptoon/schema_simplifier.py'243adding 'mcptoon/serve.py'244adding 'mcptoon/skills.py'245adding 'mcptoon/sync.py'246adding 'mcptoon/toon_vendored.py'247adding 'mcptoon/update.py'248adding 'mcptoon/usage.py'249adding 'mcptoon/watch.py'250adding 'mcptoon/welcome.py'251adding 'mcptoon/skill/SKILL.md'252adding 'mcptoon-0.8.5.dist-info/licenses/LICENSE'253adding 'mcptoon-0.8.5.dist-info/licenses/NOTICE'254adding 'mcptoon-0.8.5.dist-info/METADATA'255adding 'mcptoon-0.8.5.dist-info/WHEEL'256adding 'mcptoon-0.8.5.dist-info/entry_points.txt'257adding 'mcptoon-0.8.5.dist-info/top_level.txt'258adding 'mcptoon-0.8.5.dist-info/RECORD'259removing build/bdist.linux-aarch64/wheel260Successfully built mcptoon-0.8.5-py3-none-any.whl261Finished creating a wheel...262Finished executing pypaBuildPhase
pythonRuntimeDepsCheckHook
263Executing pythonRuntimeDepsCheck264Checking runtime dependencies for mcptoon-0.8.5-py3-none-any.whl265Finished executing pythonRuntimeDepsCheck
installPhase
266Executing pypaInstallPhase267Successfully installed mcptoon-0.8.5-py3-none-any.whl268Finished executing pypaInstallPhase
pythonOutputDistPhase
269Executing pythonOutputDistPhase270Finished executing pythonOutputDistPhase
fixupPhase
271shrinking RPATHs of ELF executables and libraries in /nix/store/zm494ipn17xdsggm5rqqj7b4x3rbaax9-mcptoon-0.8.5272checking for references to /build/ in /nix/store/zm494ipn17xdsggm5rqqj7b4x3rbaax9-mcptoon-0.8.5...273patching script interpreter paths in /nix/store/zm494ipn17xdsggm5rqqj7b4x3rbaax9-mcptoon-0.8.5274stripping (with command strip and flags -S -p) in /nix/store/zm494ipn17xdsggm5rqqj7b4x3rbaax9-mcptoon-0.8.5/lib /nix/store/zm494ipn17xdsggm5rqqj7b4x3rbaax9-mcptoon-0.8.5/bin275shrinking RPATHs of ELF executables and libraries in /nix/store/79h7s6br7kvk6pk2i7nigli8smq8c6b4-mcptoon-0.8.5-dist276checking for references to /build/ in /nix/store/79h7s6br7kvk6pk2i7nigli8smq8c6b4-mcptoon-0.8.5-dist...277patching script interpreter paths in /nix/store/79h7s6br7kvk6pk2i7nigli8smq8c6b4-mcptoon-0.8.5-dist278Rewriting #!/nix/store/3fl7bdkdxk2k4nssy1d1161isbzn6bsr-python3-3.14.7/bin/python3.14 to #!/nix/store/3fl7bdkdxk2k4nssy1d1161isbzn6bsr-python3-3.14.7279wrapping `/nix/store/zm494ipn17xdsggm5rqqj7b4x3rbaax9-mcptoon-0.8.5/bin/mcptoon'...280Executing pythonRemoveTestsDir281Finished executing pythonRemoveTestsDir
installCheckPhase
282no Makefile or custom installCheckPhase, doing nothing
pythonImportsCheckPhase
283Executing pythonImportsCheckPhase284Check whether the following modules can be imported: mcptoon
pytestCheckPhase
285Executing pytestCheckPhase286pytest flags: -m pytest -k not\ \(test_search_registry_returns_list\)\ and\ not\ \(test_search_smithery_returns_list\)\ and\ not\ \(test_search_mcp_registry_returns_list\)287============================= test session starts ==============================288platform linux -- Python 3.14.7, pytest-9.1.1, pluggy-1.6.0289rootdir: /build/source290configfile: pyproject.toml291testpaths: tests292collected 1740 items / 3 deselected / 1737 selected 293294tests/test_add_url_validation.py .............. [ 0%]295tests/test_bench.py ............. [ 1%]296tests/test_bench_tokens.py ....ss.. [ 2%]297tests/test_cache.py .... [ 2%]298tests/test_calculator.py .......................... [ 3%]299tests/test_ccr.py ........... [ 4%]300tests/test_claude_plugin_package.py ............. [ 5%]301tests/test_cli_flags.py ........... [ 5%]302tests/test_cli_smoke.py ....... [ 6%]303tests/test_client.py .............................. [ 7%]304tests/test_command_coverage.py ......... [ 8%]305tests/test_completion.py ........... [ 9%]306tests/test_compressor.py ......................... [ 10%]307tests/test_config.py .................... [ 11%]308tests/test_dead_server_diagnostics.py ... [ 11%]309tests/test_demo.py ..................... [ 13%]310tests/test_demo_dead_package.py ........ [ 13%]311tests/test_demo_server.py .............................................. [ 16%]312..... [ 16%]313tests/test_discover.py .................................... [ 18%]314tests/test_doctor_star_hint.py ..... [ 18%]315tests/test_envelope.py ........ [ 19%]316tests/test_exit_codes.py .................... [ 20%]317tests/test_fallback_json.py ...... [ 20%]318tests/test_footer_broadcast.py ......................................... [ 23%]319.... [ 23%]320tests/test_footprint_claims.py ............ [ 24%]321tests/test_gemini_manifest.py ...... [ 24%]322tests/test_health.py ............. [ 25%]323tests/test_help_shortcircuit.py ......... [ 25%]324tests/test_http_user_agent.py ......... [ 26%]325tests/test_import.py ..................... [ 27%]326tests/test_installer_registry.py ............................ [ 28%]327tests/test_lang.py .............................. [ 30%]328tests/test_llms_txt.py ...... [ 31%]329tests/test_native_tools.py ............................................. [ 33%]330........................ [ 35%]331tests/test_output.py ................................................... [ 37%]332........................................................................ [ 42%]333................ [ 43%]334tests/test_plugin_install.py .......... [ 43%]335tests/test_plugin_scan.py ............................... [ 45%]336tests/test_policy_overrides.py ................ [ 46%]337tests/test_presence.py ................................................. [ 49%]338........... [ 49%]339tests/test_readme_links.py ... [ 49%]340tests/test_registry_sync.py ............. [ 50%]341tests/test_report.py .............. [ 51%]342tests/test_reversible.py ............................................... [ 54%]343................. [ 55%]344tests/test_router.py .............................................. [ 57%]345tests/test_schema_call_e2e.py .. [ 57%]346tests/test_search.py ................................... [ 59%]347tests/test_serve.py .................................................... [ 62%]348 [ 62%]349tests/test_serve_perf.py .......... [ 63%]350tests/test_serve_prompts.py ........ [ 63%]351tests/test_skill_package.py ..F......................... [ 65%]352tests/test_skill_packs.py ................ [ 66%]353tests/test_skill_search.py .......... [ 67%]354tests/test_skills.py ................................................... [ 70%]355.....................ss................................................. [ 74%]356................................... [ 76%]357tests/test_smart_compress_e2e.py ................. [ 77%]358tests/test_stats_toggle.py ......... [ 77%]359tests/test_stderr_pipe_deadlock.py .... [ 77%]360tests/test_sync.py ..................................................... [ 80%]361................................ [ 82%]362tests/test_tier_claims_consistent.py .... [ 83%]363tests/test_toml_config.py .......................... [ 84%]364tests/test_toon_cross_validate.py ............................... [ 86%]365tests/test_uninstall_end_to_end.py .......... [ 86%]366tests/test_update.py .................... [ 88%]367tests/test_v02_features.py .................................... [ 90%]368tests/test_v04_features.py ................ [ 91%]369tests/test_v05_features.py ...................... [ 92%]370tests/test_v072_delight.py ..................s.. [ 93%]371tests/test_v073_http_security.py .............................. [ 95%]372tests/test_v074_stdio_timeout.py ............ [ 95%]373tests/test_v076_stateless_serve.py ................... [ 97%]374tests/test_v07_spec2026.py ..................... [ 98%]375tests/test_v081_env_headers.py ............. [ 98%]376tests/test_watch.py .................. [100%]377378=================================== FAILURES ===================================379_____ TestThreeCopiesAgree.test_packaged_path_resolves_to_the_copy_on_disk _____380381self = <tests.test_skill_package.TestThreeCopiesAgree object at 0xfffff4889350>382383 def test_packaged_path_resolves_to_the_copy_on_disk(self):384 """`install_self` copies from this path, so it must be the real one."""385 resolved = skills.packaged_skill_path()386 assert resolved.is_file(), resolved387> assert resolved.resolve() == COPIES["packaged"].resolve()388E AssertionError: assert PosixPath('/nix/store/zm494ipn17xdsggm5rqqj7b4x3rbaax9-mcptoon-0.8.5/lib/python3.14/site-packages/mcptoon/skill/SKILL.md') == PosixPath('/build/source/src/mcptoon/skill/SKILL.md')389E + where PosixPath('/nix/store/zm494ipn17xdsggm5rqqj7b4x3rbaax9-mcptoon-0.8.5/lib/python3.14/site-packages/mcptoon/skill/SKILL.md') = resolve()390E + where resolve = PosixPath('/nix/store/zm494ipn17xdsggm5rqqj7b4x3rbaax9-mcptoon-0.8.5/lib/python3.14/site-packages/mcptoon/skill/SKILL.md').resolve391E + and PosixPath('/build/source/src/mcptoon/skill/SKILL.md') = resolve()392E + where resolve = PosixPath('/build/source/src/mcptoon/skill/SKILL.md').resolve393394tests/test_skill_package.py:86: AssertionError395=========================== short test summary info ============================396FAILED tests/test_skill_package.py::TestThreeCopiesAgree::test_packaged_path_resolves_to_the_copy_on_disk - AssertionError: assert PosixPath('/nix/store/zm494ipn17xdsggm5rqqj7b4x3rbaa...397====== 1 failed, 1731 passed, 5 skipped, 3 deselected in 82.88s (0:01:22) ======