setup
checks.aarch64-linux.pkgs-mcptoon
· build #6332
· raw
1these 2 derivations will be built:2 /nix/store/44rgxg7pi0j2zw3bd2g2qcy8rjh9apxl-mcptoon-0.8.5.drv3 /nix/store/3qy1cbd1wq28h8xkk1igg072lfzgvagc-check-mcptoon.drv4error: build of '/nix/store/44rgxg7pi0j2zw3bd2g2qcy8rjh9apxl-mcptoon-0.8.5.drv' on 'grpc://farm.numtide.com:50051?client-cert=/run/secrets/vars/per-machine/bld1/nix-farm-ci/crt&client-key=/run/secrets/vars/per-machine/bld1/nix-farm-ci/key&connect-timeout=20&system=aarch64-linux' failed: Cannot build '/nix/store/44rgxg7pi0j2zw3bd2g2qcy8rjh9apxl-mcptoon-0.8.5.drv'.5 Reason: builder failed with exit code 1.6 Output paths:7 /nix/store/79h7s6br7kvk6pk2i7nigli8smq8c6b4-mcptoon-0.8.5-dist8 /nix/store/zm494ipn17xdsggm5rqqj7b4x3rbaax9-mcptoon-0.8.59 Last 25 log lines:10 > tests/test_v076_stateless_serve.py ................... [ 97%]11 > tests/test_v07_spec2026.py ..................... [ 98%]12 > tests/test_v081_env_headers.py ............. [ 98%]13 > tests/test_watch.py .................. [100%]14 >15 > =================================== FAILURES ===================================16 > _____ TestThreeCopiesAgree.test_packaged_path_resolves_to_the_copy_on_disk _____17 >18 > self = <tests.test_skill_package.TestThreeCopiesAgree object at 0xfffff4889350>19 >20 > def test_packaged_path_resolves_to_the_copy_on_disk(self):21 > """`install_self` copies from this path, so it must be the real one."""22 > resolved = skills.packaged_skill_path()23 > assert resolved.is_file(), resolved24 > > assert resolved.resolve() == COPIES["packaged"].resolve()25 > E AssertionError: assert PosixPath('/nix/store/zm494ipn17xdsggm5rqqj7b4x3rbaax9-mcptoon-0.8.5/lib/python3.14/site-packages/mcptoon/skill/SKILL.md') == PosixPath('/build/source/src/mcptoon/skill/SKILL.md')26 > E + where PosixPath('/nix/store/zm494ipn17xdsggm5rqqj7b4x3rbaax9-mcptoon-0.8.5/lib/python3.14/site-packages/mcptoon/skill/SKILL.md') = resolve()27 > E + where resolve = PosixPath('/nix/store/zm494ipn17xdsggm5rqqj7b4x3rbaax9-mcptoon-0.8.5/lib/python3.14/site-packages/mcptoon/skill/SKILL.md').resolve28 > E + and PosixPath('/build/source/src/mcptoon/skill/SKILL.md') = resolve()29 > E + where resolve = PosixPath('/build/source/src/mcptoon/skill/SKILL.md').resolve30 >31 > tests/test_skill_package.py:86: AssertionError32 > =========================== short test summary info ============================33 > FAILED tests/test_skill_package.py::TestThreeCopiesAgree::test_packaged_path_resolves_to_the_copy_on_disk - AssertionError: assert PosixPath('/nix/store/zm494ipn17xdsggm5rqqj7b4x3rbaa...34 > ====== 1 failed, 1731 passed, 5 skipped, 3 deselected in 82.88s (0:01:22) ======35 For full logs, run:36 nix log /nix/store/44rgxg7pi0j2zw3bd2g2qcy8rjh9apxl-mcptoon-0.8.5.drv37error: Cannot build '/nix/store/44rgxg7pi0j2zw3bd2g2qcy8rjh9apxl-mcptoon-0.8.5.drv'.38 Reason: builder failed with exit code 1.39 Output paths:40 /nix/store/79h7s6br7kvk6pk2i7nigli8smq8c6b4-mcptoon-0.8.5-dist41 /nix/store/zm494ipn17xdsggm5rqqj7b4x3rbaax9-mcptoon-0.8.542error: Cannot build '/nix/store/3qy1cbd1wq28h8xkk1igg072lfzgvagc-check-mcptoon.drv'.43 Reason: 1 dependency failed.44 Output paths:45 /nix/store/n23cqpq54zhzmjxhpjz45nrzj54pgmy0-check-mcptoon