1these 3 derivations will be built:2 /nix/store/jw4c11rzgc165gw9mv4dg1chvqhcgvrv-openresearch-0.2.14-vendor.drv3 /nix/store/9i92ck9fyf21z8r6w1rwwl5fqvg7hfx9-openresearch-0.2.14.drv4 /nix/store/g4qs9vphfv5nh5w3i6ci6wv9ww21r9c2-check-openresearch.drv5error: Cannot build '/nix/store/9i92ck9fyf21z8r6w1rwwl5fqvg7hfx9-openresearch-0.2.14.drv'.6 Reason: builder failed with exit code 101.7 Output paths:8 /nix/store/ddcgbbi4hmhylvj583v2jrjhzzv8p9kr-openresearch-0.2.149 Last 25 log lines:10 > test slurm_supervisor_survives_connection_and_accounting_loss ... FAILED11 > test ssh_config_conflict_and_execution_target_checks ... ok12 > test standalone_settings_defaults_and_instruction_conflicts ... ok13 >14 > failures:15 >16 > ---- slurm_cancel_requires_acknowledgement_and_survives_restart_without_accounting stdout ----17 >18 > thread 'slurm_cancel_requires_acknowledgement_and_survives_restart_without_accounting' (9593) panicked at tests/compute_cli.rs:449:13:19 > assertion failed: Instant::now() < deadline20 > note: run with `RUST_BACKTRACE=1` environment variable to display a backtrace21 >22 > ---- slurm_supervisor_survives_connection_and_accounting_loss stdout ----23 >24 > thread 'slurm_supervisor_survives_connection_and_accounting_loss' (9857) panicked at tests/compute_cli.rs:250:13:25 > supervisor did not reach expected state26 >27 >28 > failures:29 > slurm_cancel_requires_acknowledgement_and_survives_restart_without_accounting30 > slurm_supervisor_survives_connection_and_accounting_loss31 >32 > test result: FAILED. 7 passed; 2 failed; 0 ignored; 0 measured; 0 filtered out; finished in 100.63s33 >34 > error: test failed, to rerun pass `--test compute_cli`35 For full logs, run:36 nix log /nix/store/9i92ck9fyf21z8r6w1rwwl5fqvg7hfx9-openresearch-0.2.14.drv37error: Cannot build '/nix/store/g4qs9vphfv5nh5w3i6ci6wv9ww21r9c2-check-openresearch.drv'.38 Reason: 1 dependency failed.39 Output paths:40 /nix/store/w2xxh0flhfid8mqva4jyspczy8hxvfrj-check-openresearch