numtide/llm-agents.nix build #6224 failed ← #6223 #6225 →
eval warnings
2 kinds
· 6 occurrences
- warn stdenv.isLinux is deprecated, use stdenv.hostPlatform.isLinux instead ×3
- warn stdenv.isDarwin is deprecated, use stdenv.hostPlatform.isDarwin instead ×3
25 failed
| status | attribute | duration |
|---|---|---|
checks.aarch64-darwin.pkgs-agent-slack
|
3h 0m | |
setup: /nix/store/ycv1ascj8l3yc0wvhm3lpsc29z4612j0-bun-pkg-es-define-property-1.0.1.drv /nix/store/yjs5jaf2n4kz89izqchym3n9ywy2j72f-bun-pkg--oxlint-binding- …setup: /nix/store/ycv1ascj8l3yc0wvhm3lpsc29z4612j0-bun-pkg-es-define-property-1.0.1.drv /nix/store/yjs5jaf2n4kz89izqchym3n9ywy2j72f-bun-pkg--oxlint-binding-openharmony-arm64-1.49.0.drv /nix/store/zbjmc98ysbng80wgq9gp7j0sghv3fsb0-bun-pkg-bun-types-1.3.9.drv /nix/store/zgvf6lj0py1ycp2vwpnjh19wk5s1gs51-bun-pkg--oxlint-binding-win32-ia32-msvc-1.49.0.drv /nix/store/zkzxl52gn14lmcjazvr1kjyf95ih55gy-bun-pkg-is-stream-2.0.1.drv /nix/store/kslvnx7jar4hl7sxa3s06lcj0bk0b12v-bun-cache.drv /nix/store/m2nzqd38jnwmfyrdrm487w7qsiibqb0b-agent-slack-0.10.2.drv /nix/store/lbymwqn3hp0ljb1w0kx0y4k6sgyyj71h-check-agent-slack.drv |
||
checks.aarch64-darwin.pkgs-autolith
|
2h 58m | |
sbcl-with-packages: mkdir: created directory '/nix/store/y57ydqnrygf2j34zllr7kriz50qa1614-sbcl-with-packages/bin' <stdin>:62:6: error: --prefix CL_SOURCE_REGIST …sbcl-with-packages: mkdir: created directory '/nix/store/y57ydqnrygf2j34zllr7kriz50qa1614-sbcl-with-packages/bin' <stdin>:62:6: error: --prefix CL_SOURCE_REGISTRY would introduce an empty PATH-like segment (empty, or a leading/trailing/doubled `:`). This is interpreted as "search the current directory" by shells, execvp() and the dynamic linker, see https://github.com/NixOS/nixpkgs/security/advisories/GHSA-p7v3-pr2c-8584. Guard the value with e.g. lib.optionalString (list != []). 62 | #error --prefix CL_SOURCE_REGISTRY would introduce an empty PATH-like segment (empty, or a leading/trailing/doubled `:`). This is interpreted as "search the current directory" by shells, execvp() and the dynamic linker, see https://github.com/NixOS/nixpkgs/security/advisories/GHSA-p7v3-pr2c-8584. Guard the value with e.g. lib.optionalString (list != []). | ^ <stdin>:64:6: error: --prefix ASDF_OUTPUT_TRANSLATIONS would introduce an empty PATH-like segment (empty, or a leading/trailing/doubled `:`). This is interpreted as "search the current directory" by shells, execvp() and the dynamic linker, see https://github.com/NixOS/nixpkgs/security/advisories/GHSA-p7v3-pr2c-8584. Guard the value with e.g. lib.optionalString (list != []). 64 | #error --prefix ASDF_OUTPUT_TRANSLATIONS would introduce an empty PATH-like segment (empty, or a leading/trailing/doubled `:`). This is interpreted as "search the current directory" by shells, execvp() and the dynamic linker, see https://github.com/NixOS/nixpkgs/security/advisories/GHSA-p7v3-pr2c-8584. Guard the value with e.g. lib.optionalString (list != []). | ^ 2 errors generated. |
||
checks.aarch64-darwin.pkgs-backlog-md
|
3h 0m | |
setup: /nix/store/zsk3mgvm135i5bb0hm87fg5gg2xjq42k-bun-pkg--csstools-css-color-parser-4.1.9.drv /nix/store/zvxxxx2cgpg42al6y17nznczxhing69d-bun-pkg--antfu-i …setup: /nix/store/zsk3mgvm135i5bb0hm87fg5gg2xjq42k-bun-pkg--csstools-css-color-parser-4.1.9.drv /nix/store/zvxxxx2cgpg42al6y17nznczxhing69d-bun-pkg--antfu-install-pkg-1.1.0.drv /nix/store/zw7acf0i7hw8k7zvspw3bwpy8f4h29mk-bun-pkg-fast-deep-equal-3.1.3.drv /nix/store/zw8fs967a5qjlwfrp4v6igapmi787c3v-bun-pkg-d3-brush-3.0.0.drv /nix/store/zxl9h94p00pl7bjfxiid95n1yj0fkh3p-bun-pkg--jimp-js-jpeg-1.6.1.drv /nix/store/5pm8q4h6indnrija0kvybx663sk59nr9-bun-cache.drv /nix/store/xh4c2yhkp0866xspks2qnpihs98pffcz-backlog-md-1.53.0.drv /nix/store/xdyl3g3ahbrs27mgapz0ccmc91fg1ly9-check-backlog-md.drv |
||
checks.aarch64-linux.pkgs-autolith
|
2h 14m | |
fff-c-0.10.3: Compiling dirs v5.0.1 Compiling fff-grep v0.10.3 (/build/source/crates/fff-grep) Compiling memmap2 v0.9.11 Compiling neo_frizbee v0.11 …fff-c-0.10.3: Compiling dirs v5.0.1 Compiling fff-grep v0.10.3 (/build/source/crates/fff-grep) Compiling memmap2 v0.9.11 Compiling neo_frizbee v0.11.0 Compiling fff-query-parser v0.10.3 (/build/source/crates/fff-query-parser) Compiling pathdiff v0.2.3 Compiling glidesort v0.1.2 Compiling git2 v0.21.0 sbcl-with-packages: elastic-arm-64da6151: building hhqfhwr6rjpyjlf25wpm28fs4mnv69ch-sbcl-with-packages.drv no Makefile or custom buildPhase, doing nothing mkdir: created directory '/nix/store/rgd5j85dwq5my4vawams4xdd8p4sds2w-sbcl-with-packages' mkdir: created directory '/nix/store/rgd5j85dwq5my4vawams4xdd8p4sds2w-sbcl-with-packages/bin' <stdin>: In function 'main': <stdin>:62:6: error: #error --prefix CL_SOURCE_REGISTRY would introduce an empty PATH-like segment (empty, or a leading/trailing/doubled `:`). This is interpreted as "search the current directory" by shells, execvp() and the dynamic linker, see https: <stdin>:64:6: error: #error --prefix ASDF_OUTPUT_TRANSLATIONS would introduce an empty PATH-like segment (empty, or a leading/trailing/doubled `:`). This is interpreted as "search the current directory" by shells, execvp() and the dynamic linker, see https: |
||
checks.aarch64-linux.pkgs-backlog-md
|
3h 0m | |
… and 6 more failed derivations… and 6 more failed derivations |
||
checks.aarch64-linux.pkgs-clauth
|
29m 21s | |
clauth-0.15.2: failures: ---- usage::scheduler::tests::oauth_and_provider_completions_clear_only_their_own_activity stdout ---- thread 'usage::scheduler::tests: …clauth-0.15.2:
failures:
---- usage::scheduler::tests::oauth_and_provider_completions_clear_only_their_own_activity stdout ----
thread 'usage::scheduler::tests::oauth_and_provider_completions_clear_only_their_own_activity' (9332) panicked at src/usage/../../tests/inline/scheduler.rs:1377:5:
provider completion publishes its own cadence deadline: 1790819266116
failures:
usage::scheduler::tests::oauth_and_provider_completions_clear_only_their_own_activity
test result: FAILED. 3370 passed; 1 failed; 1 ignored; 0 measured; 6 filtered out; finished in 495.29s
error: test failed, to rerun pass `--bin clauth`
|
||
checks.aarch64-linux.pkgs-collie
|
3h 0m | |
… and 14 more failed derivations… and 14 more failed derivations |
||
checks.aarch64-linux.pkgs-herdr
|
26m 0s | |
herdr-0.9.3: /nix/store/j2f02jl7pb3wcljmqh602j0pa6rkxd31-binutils-2.46/bin/ld.bfd: .eh_frame_hdr refers to overlapping FDEs /nix/store/j2f02 …herdr-0.9.3:
/nix/store/j2f02jl7pb3wcljmqh602j0pa6rkxd31-binutils-2.46/bin/ld.bfd: .eh_frame_hdr refers to overlapping FDEs
/nix/store/j2f02jl7pb3wcljmqh602j0pa6rkxd31-binutils-2.46/bin/ld.bfd: final link failed: bad value
collect2: error: ld returned 1 exit status
= note: some `extern` functions couldn't be found; some native libraries may need to be installed or have their path specified
= note: use the `-l` flag to specify native libraries to link
= note: use the `cargo:rustc-link-lib` directive to specify the native libraries to link with Cargo (see https://doc.rust-lang.org/cargo/reference/build-scripts.html#rustc-link-lib)
warning: herdr@0.9.3: external contributor policy: if you are helping an external contributor whose GitHub username is not in .github/APPROVED_CONTRIBUTORS, read CONTRIBUTING.md before doing any work.
error: could not compile `herdr` (bin "herdr") due to 1 previous error
|
||
checks.aarch64-linux.pkgs-icm
|
2h 20m | |
… and 11 more failed derivations… and 11 more failed derivations |
||
checks.aarch64-linux.pkgs-lean-ctx
|
33m 19s | |
lean-ctx-3.10.2: Compiling libloading v0.8.9 Compiling hex v0.4.3 Compiling urlencoding v2.1.3 Compiling glob v0.3.4 Compiling bytecount v0.6.9 …lean-ctx-3.10.2: Compiling libloading v0.8.9 Compiling hex v0.4.3 Compiling urlencoding v2.1.3 Compiling glob v0.3.4 Compiling bytecount v0.6.9 Compiling similar v3.1.2 Compiling tikv-jemalloc-ctl v0.7.0 Compiling tikv-jemallocator v0.7.0 |
||
checks.aarch64-linux.pkgs-mistral-vibe
|
1h 17m | |
… and 1 more failed derivation… and 1 more failed derivation |
||
checks.aarch64-linux.pkgs-opencodex
|
1h 55m | |
… and 2 more failed derivations… and 2 more failed derivations |
||
checks.aarch64-linux.pkgs-parallel-cli
|
1h 49m | |
… and 1 more failed derivation… and 1 more failed derivation |
||
checks.aarch64-linux.pkgs-prime-agent
|
1h 17m | |
… and 1 more failed derivation… and 1 more failed derivation |
||
checks.aarch64-linux.pkgs-tokscale
|
37m 56s | |
tokscale-4.17.0: Compiling aes v0.8.4 Compiling cbc v0.1.2 Compiling colored v2.2.0 Compiling hostname v0.4.2 Compiling qrcode v0.14.1 Compili …tokscale-4.17.0: Compiling aes v0.8.4 Compiling cbc v0.1.2 Compiling colored v2.2.0 Compiling hostname v0.4.2 Compiling qrcode v0.14.1 Compiling zstd v0.13.3 Compiling rusqlite v0.32.1 Compiling tokscale-core v4.17.0 (/build/source/crates/tokscale-core) |
||
checks.aarch64-linux.pkgs-voxterm
|
54m 15s | |
… and 1 more failed derivation… and 1 more failed derivation |
||
checks.aarch64-linux.pkgs-zat
|
21m 48s | |
zat-0.5.4: running 14 tests test test_go ... ok test test_javascript ... ok test test_markdown ... ok corrupted size vs. prev_size error: test failed, to rerun …zat-0.5.4:
running 14 tests
test test_go ... ok
test test_javascript ... ok
test test_markdown ... ok
corrupted size vs. prev_size
error: test failed, to rerun pass `--test outline_test`
Caused by:
process didn't exit successfully: `/build/source/target/aarch64-unknown-linux-gnu/release/deps/outline_test-1601e347c9460133` (signal: 6, SIGABRT: process abort signal)
|
||
checks.x86_64-linux.pkgs-autolith
|
22m 48s | |
sbcl-with-packages: no Makefile or custom buildPhase, doing nothing mkdir: created directory '/nix/store/9vhqv8343h6mc81i91dc68i5imm4q672-sbcl-with-packages' mk …sbcl-with-packages: no Makefile or custom buildPhase, doing nothing mkdir: created directory '/nix/store/9vhqv8343h6mc81i91dc68i5imm4q672-sbcl-with-packages' mkdir: created directory '/nix/store/9vhqv8343h6mc81i91dc68i5imm4q672-sbcl-with-packages/bin' <stdin>: In function 'main': <stdin>:62:6: error: #error --prefix CL_SOURCE_REGISTRY would introduce an empty PATH-like segment (empty, or a leading/trailing/doubled `:`). This is interpreted as "search the current directory" by shells, execvp() and the dynamic linker, see https: <stdin>:64:6: error: #error --prefix ASDF_OUTPUT_TRANSLATIONS would introduce an empty PATH-like segment (empty, or a leading/trailing/doubled `:`). This is interpreted as "search the current directory" by shells, execvp() and the dynamic linker, see https: |
||
checks.x86_64-linux.pkgs-codex-auth
|
9m 21s | |
codex-auth-0.3.0: failed command: CODEX_AUTH_CLI_INTEGRATION_PROJECT_ROOT=/build/source ./.zig-cache/o/1cbf38015f276daef787bc14090e8efb/test --cache-dir=./.zig- …codex-auth-0.3.0: failed command: CODEX_AUTH_CLI_INTEGRATION_PROJECT_ROOT=/build/source ./.zig-cache/o/1cbf38015f276daef787bc14090e8efb/test --cache-dir=./.zig-cache --seed=0xae6a94fa --listen=- CODEX_AUTH_CLI_INTEGRATION_PROJECT_ROOT=/build/source ./.zig-cache/o/7ee6bbbf0e5380c497c2d598de6bea85/test --cache-dir=./.zig-cache --seed=0xae6a94fa --listen=- Build Summary: 39/41 steps succeeded (1 failed); 433/440 tests passed (5 skipped, 2 failed) test transitive failure mq run test 15 pass, 2 fail (17 total) error: the following build command failed with exit code 1: .zig-cache/o/4982744e04dca2d859554fa4ec17285b/build /nix/store/qsk2cha4nk70bpz53qix9mypj4mjcbsr-zig-0.16.0/bin/zig /nix/store/qsk2cha4nk70bpz53qix9mypj4mjcbsr-zig-0.16.0/lib/zig /build/source .zig-cache /build/tmp.CYchAfwqTL --seed 0xae6a94fa -Z632cfb47d7231094 test -j48 -Dcpu=baseline --release=safe --verbose |
||
checks.x86_64-linux.pkgs-herdr
|
14m 12s | |
herdr-0.9.3: | = note: "/nix/store/j1938gsbvbhkyz4kbmvjk56r479mkw3s-gcc-wrapper-16.2.0/bin/cc" "-m64" "/build/source/target/x86_64-unknown-linux-gnu/releas …herdr-0.9.3: | = note: "/nix/store/j1938gsbvbhkyz4kbmvjk56r479mkw3s-gcc-wrapper-16.2.0/bin/cc" "-m64" "/build/source/target/x86_64-unknown-linux-gnu/release/deps/rustc5uddFW/symbols.o" "<17 object files omitted>" "-Wl,--as-needed" "-Wl,-Bstatic" "/build/source/target/x86_64-unknown-linux-gnu/release/deps/{libzbus-a1061b51e09ce3c6,libhex-e9ad39ea1e2a9363,libuuid-f5e0ebcd70178ee8,libordered_stream-a52c12187610df54,libfutures_lite-bdf63e447532b967,libfutures_io-edbb6d22b3f08992,libasync_broadcast-9b721913fa4eda44,libevent_listener_strategy-87faf6921d9153d6,libevent_listener-9be9e9e6eed615f8,libparking-bddfabd56bb33a55,libzbus_names-e8479f11a296691b,libzvar… = note: some arguments are omitted. use `--verbose` to show all linker arguments = note: /nix/store/y5sgl0vvrpbcwgjwpjs60r1hg0gi7i0n-binutils-2.46/bin/ld.bfd: .eh_frame_hdr refers to overlapping FDEs /nix/store/y5sgl0vvrpbcwgjwpjs60r1hg0gi7i0n-binutils-2.46/bin/ld.bfd: final link failed: bad value collect2: error: ld returned 1 exit status warning: herdr@0.9.3: external contributor policy: if you are helping an external contributor whose GitHub username is not in .github/APPROVED_CONTRIBUTORS, read CONTRIBUTING.md before doing any work. error: could not compile `herdr` (bin "herdr") due to 1 previous error |
||
checks.x86_64-linux.pkgs-lean-ctx
|
25m 53s | |
setup: these 3 derivations will be built: /nix/store/aflif20jwn14pgq41w056xwl6gcar759-lean-ctx-3.10.2-vendor.drv /nix/store/2sq41fgad007v8ivryh7ybpiavh9gfys …setup: these 3 derivations will be built: /nix/store/aflif20jwn14pgq41w056xwl6gcar759-lean-ctx-3.10.2-vendor.drv /nix/store/2sq41fgad007v8ivryh7ybpiavh9gfys-lean-ctx-3.10.2.drv /nix/store/lq0gyw9j3h7vd9prxddf3r4jhcp18v2x-check-lean-ctx.drv error: timed out after 1200 seconds error: Cannot build '/nix/store/lq0gyw9j3h7vd9prxddf3r4jhcp18v2x-check-lean-ctx.drv'. Reason: 1 dependency failed. Output paths: /nix/store/33qvqrkfjkcs1d3crll21y4wj4v6rffm-check-lean-ctx |
||
checks.x86_64-linux.pkgs-nono
|
23m 59s | |
setup: these 3 derivations will be built: /nix/store/bnbwi70iarb3mh9v5h83r6icgx3kwxzw-nono-0.78.0-vendor.drv /nix/store/ncpz7jf41dhj3ppbjxgv1fwhszd5143h-non …setup: these 3 derivations will be built: /nix/store/bnbwi70iarb3mh9v5h83r6icgx3kwxzw-nono-0.78.0-vendor.drv /nix/store/ncpz7jf41dhj3ppbjxgv1fwhszd5143h-nono-0.78.0.drv /nix/store/5653qskp2vir405bzspavqp6nlkgs1gj-check-nono.drv error: timed out after 1200 seconds error: Cannot build '/nix/store/5653qskp2vir405bzspavqp6nlkgs1gj-check-nono.drv'. Reason: 1 dependency failed. Output paths: /nix/store/db0jafr12vqrc0lf8sailwp5jnghqx5g-check-nono |
||
checks.x86_64-linux.pkgs-tokscale
|
25m 35s | |
setup: these 3 derivations will be built: /nix/store/ig44zncx62389659r9qj07ww1342ffci-tokscale-4.17.0-vendor.drv /nix/store/lapsvxfji5kxnvinhcai4cmkx844pvnl …setup: these 3 derivations will be built: /nix/store/ig44zncx62389659r9qj07ww1342ffci-tokscale-4.17.0-vendor.drv /nix/store/lapsvxfji5kxnvinhcai4cmkx844pvnl-tokscale-4.17.0.drv /nix/store/lv6k2gpvml3013kf8m49ra8gxa3x42jy-check-tokscale.drv error: timed out after 1200 seconds error: Cannot build '/nix/store/lv6k2gpvml3013kf8m49ra8gxa3x42jy-check-tokscale.drv'. Reason: 1 dependency failed. Output paths: /nix/store/xfs4wm0gyqx9b4h38wvypfkw3qyn90qg-check-tokscale |
||
checks.x86_64-linux.pkgs-voxterm
|
19m 12s | |
python3.14-torchcodec-0.16.0: FAILED test/test_encoders.py::TestEncoder::test_audio_against_cli[to_file-mp3-8000-None-0-asset1] - AssertionError: Tensor-likes a …python3.14-torchcodec-0.16.0: FAILED test/test_encoders.py::TestEncoder::test_audio_against_cli[to_file-mp3-8000-None-0-asset1] - AssertionError: Tensor-likes are not close! FAILED test/test_encoders.py::TestEncoder::test_audio_against_cli[to_file-mp3-8000-1-None-asset1] - AssertionError: Tensor-likes are not close! FAILED test/test_encoders.py::TestEncoder::test_audio_against_cli[to_file-mp3-8000-1-0-asset1] - AssertionError: Tensor-likes are not close! FAILED test/test_encoders.py::TestEncoder::test_audio_against_cli[to_file_like-mp3-8000-None-None-asset1] - AssertionError: Tensor-likes are not close! FAILED test/test_encoders.py::TestEncoder::test_audio_against_cli[to_file_like-mp3-8000-None-0-asset1] - AssertionError: Tensor-likes are not close! FAILED test/test_encoders.py::TestEncoder::test_audio_against_cli[to_file_like-mp3-8000-1-None-asset1] - AssertionError: Tensor-likes are not close! FAILED test/test_encoders.py::TestEncoder::test_audio_against_cli[to_file_like-mp3-8000-1-0-asset1] - AssertionError: Tensor-likes are not close! = 8 failed, 1935 passed, 737 skipped, 1 deselected, 5 warnings in 1026.30s (0:17:06) = |
||
checks.x86_64-linux.pkgs-zat
|
1m 30s | |
zat-0.5.4: running 0 tests test result: ok. 0 passed; 0 failed; 0 ignored; 0 measured; 0 filtered out; finished in 0.00s Running tests/outline_test.rs (tar …zat-0.5.4: running 0 tests test result: ok. 0 passed; 0 failed; 0 ignored; 0 measured; 0 filtered out; finished in 0.00s Running tests/outline_test.rs (target/x86_64-unknown-linux-gnu/release/deps/outline_test-7e07af7366c64847) running 14 tests corrupted size vs. prev_size error: test failed, to rerun pass `--test outline_test` Caused by: process didn't exit successfully: `/build/source/target/x86_64-unknown-linux-gnu/release/deps/outline_test-7e07af7366c64847` (signal: 6, SIGABRT: process abort signal) |
||
8 cancelled
| status | attribute | duration |
|---|---|---|
| loading… | ||