setup
checks.aarch64-linux.pkgs-mcptoon
· build #6208
· raw
1these 3 derivations will be built:2 /nix/store/c7b3f732m0qch7bg5vyyqg7qsym0gvyb-source.drv3 /nix/store/44rgxg7pi0j2zw3bd2g2qcy8rjh9apxl-mcptoon-0.8.5.drv4 /nix/store/3qy1cbd1wq28h8xkk1igg072lfzgvagc-check-mcptoon.drv5error: build of '/nix/store/44rgxg7pi0j2zw3bd2g2qcy8rjh9apxl-mcptoon-0.8.5.drv' on 'grpc://farm.numtide.com:50051?client-cert=/run/secrets/vars/per-machine/bld1/nix-farm-ci/crt&client-key=/run/secrets/vars/per-machine/bld1/nix-farm-ci/key&connect-timeout=23&system=aarch64-linux' failed: Cannot build '/nix/store/44rgxg7pi0j2zw3bd2g2qcy8rjh9apxl-mcptoon-0.8.5.drv'.6 Reason: builder failed with exit code 1.7 Output paths:8 /nix/store/79h7s6br7kvk6pk2i7nigli8smq8c6b4-mcptoon-0.8.5-dist9 /nix/store/zm494ipn17xdsggm5rqqj7b4x3rbaax9-mcptoon-0.8.510 Last 25 log lines:11 >12 > tests/test_skill_package.py:86: AssertionError13 > ____________ TestStdioResponsePump.test_eof_wakes_waiter_fail_fast _____________14 >15 > self = <tests.test_v074_stdio_timeout.TestStdioResponsePump testMethod=test_eof_wakes_waiter_fail_fast>16 >17 > def test_eof_wakes_waiter_fail_fast(self):18 > """Server dies after first request → EOF sentinel wakes the queue19 > waiter → PROCESS_DIED immediately (not the full timeout)."""20 > client = MCPClient(stdio=[PY, self.dier], timeout=30)21 > t0 = time.time()22 > with self.assertRaises(MCPError) as cm:23 > client.initialize()24 > elapsed = time.time() - t025 > > self.assertEqual(cm.exception.code, "PROCESS_DIED")26 > E AssertionError: 'RESPONSE_TIMEOUT' != 'PROCESS_DIED'27 > E - RESPONSE_TIMEOUT28 > E + PROCESS_DIED29 >30 > tests/test_v074_stdio_timeout.py:217: AssertionError31 > =========================== short test summary info ============================32 > FAILED tests/test_demo_dead_package.py::TestDeadServerStderrSurfaces::test_process_died_includes_stderr - AssertionError: 'RESPONSE_TIMEOUT' != 'PROCESS_DIED'33 > FAILED tests/test_skill_package.py::TestThreeCopiesAgree::test_packaged_path_resolves_to_the_copy_on_disk - AssertionError: assert PosixPath('/nix/store/zm494ipn17xdsggm5rqqj7b4x3rbaa...34 > FAILED tests/test_v074_stdio_timeout.py::TestStdioResponsePump::test_eof_wakes_waiter_fail_fast - AssertionError: 'RESPONSE_TIMEOUT' != 'PROCESS_DIED'35 > ===== 3 failed, 1729 passed, 5 skipped, 3 deselected in 119.28s (0:01:59) ======36 For full logs, run:37 nix log /nix/store/44rgxg7pi0j2zw3bd2g2qcy8rjh9apxl-mcptoon-0.8.5.drv38error: Cannot build '/nix/store/44rgxg7pi0j2zw3bd2g2qcy8rjh9apxl-mcptoon-0.8.5.drv'.39 Reason: builder failed with exit code 1.40 Output paths:41 /nix/store/79h7s6br7kvk6pk2i7nigli8smq8c6b4-mcptoon-0.8.5-dist42 /nix/store/zm494ipn17xdsggm5rqqj7b4x3rbaax9-mcptoon-0.8.543error: Cannot build '/nix/store/3qy1cbd1wq28h8xkk1igg072lfzgvagc-check-mcptoon.drv'.44 Reason: 1 dependency failed.45 Output paths:46 /nix/store/n23cqpq54zhzmjxhpjz45nrzj54pgmy0-check-mcptoon