setup
checks.aarch64-darwin.pkgs-mcptoon
· build #6208
· raw
1these 3 derivations will be built:2 /nix/store/34z375slqyx5p1k2gmgw0b0mvzhd5gpi-source.drv3 /nix/store/zi9rij5vgwqw8psazixhml7d2cdvkb7f-mcptoon-0.8.5.drv4 /nix/store/aprfz4qjzxhr8l38jjzj5kavcr9jrqx5-check-mcptoon.drv5error: build of '/nix/store/zi9rij5vgwqw8psazixhml7d2cdvkb7f-mcptoon-0.8.5.drv' on 'ssh-ng://customer@mac02.m.ntd.one' failed: Cannot build '/nix/store/zi9rij5vgwqw8psazixhml7d2cdvkb7f-mcptoon-0.8.5.drv'.6 Reason: builder failed with exit code 1.7 Output paths:8 /nix/store/0vql6fanx524pmr3xnwf2i53b5h25xap-mcptoon-0.8.59 /nix/store/nglffqg3cnxnw1rj3106i2y1zzf6ia9j-mcptoon-0.8.5-dist10 Last 25 log lines:11 > tests/test_v076_stateless_serve.py ................... [ 97%]12 > tests/test_v07_spec2026.py ..................... [ 98%]13 > tests/test_v081_env_headers.py ............. [ 98%]14 > tests/test_watch.py .................. [100%]15 >16 > =================================== FAILURES ===================================17 > _____ TestThreeCopiesAgree.test_packaged_path_resolves_to_the_copy_on_disk _____18 >19 > self = <tests.test_skill_package.TestThreeCopiesAgree object at 0x10bbc1350>20 >21 > def test_packaged_path_resolves_to_the_copy_on_disk(self):22 > """`install_self` copies from this path, so it must be the real one."""23 > resolved = skills.packaged_skill_path()24 > assert resolved.is_file(), resolved25 > > assert resolved.resolve() == COPIES["packaged"].resolve()26 > E AssertionError: assert PosixPath('/nix/store/0vql6fanx524pmr3xnwf2i53b5h25xap-mcptoon-0.8.5/lib/python3.14/site-packages/mcptoon/skill/SKILL.md') == PosixPath('/nix/var/nix/builds/nix-64055-4182724772/source/src/mcptoon/skill/SKILL.md')27 > E + where PosixPath('/nix/store/0vql6fanx524pmr3xnwf2i53b5h25xap-mcptoon-0.8.5/lib/python3.14/site-packages/mcptoon/skill/SKILL.md') = resolve()28 > E + where resolve = PosixPath('/nix/store/0vql6fanx524pmr3xnwf2i53b5h25xap-mcptoon-0.8.5/lib/python3.14/site-packages/mcptoon/skill/SKILL.md').resolve29 > E + and PosixPath('/nix/var/nix/builds/nix-64055-4182724772/source/src/mcptoon/skill/SKILL.md') = resolve()30 > E + where resolve = PosixPath('/nix/var/nix/builds/nix-64055-4182724772/source/src/mcptoon/skill/SKILL.md').resolve31 >32 > tests/test_skill_package.py:86: AssertionError33 > =========================== short test summary info ============================34 > FAILED tests/test_skill_package.py::TestThreeCopiesAgree::test_packaged_path_resolves_to_the_copy_on_disk - AssertionError: assert PosixPath('/nix/store/0vql6fanx524pmr3xnwf2i53b5h25x...35 > ====== 1 failed, 1730 passed, 6 skipped, 3 deselected in 83.83s (0:01:23) ======36 For full logs, run:37 nix log /nix/store/zi9rij5vgwqw8psazixhml7d2cdvkb7f-mcptoon-0.8.5.drv38error: Cannot build '/nix/store/zi9rij5vgwqw8psazixhml7d2cdvkb7f-mcptoon-0.8.5.drv'.39 Reason: builder failed with exit code 1.40 Output paths:41 /nix/store/0vql6fanx524pmr3xnwf2i53b5h25xap-mcptoon-0.8.542 /nix/store/nglffqg3cnxnw1rj3106i2y1zzf6ia9j-mcptoon-0.8.5-dist43error: Cannot build '/nix/store/aprfz4qjzxhr8l38jjzj5kavcr9jrqx5-check-mcptoon.drv'.44 Reason: 1 dependency failed.45 Output paths:46 /nix/store/3nzp596w823s25gk3qybfry7snn56qkd-check-mcptoon