setup
checks.aarch64-darwin.pkgs-luvus
· build #6198
· raw
1these 5 derivations will be built:2 /nix/store/pw75633k9bwh266aaa7jlqfg1w247yl1-source.drv3 /nix/store/1jj27z4gazksvckny5x7w7zijjr2a7kp-luvus-0.14.3-vendor-staging.drv4 /nix/store/9k7sfi17sv37595fn3z36wn3yzlqijcw-luvus-0.14.3-vendor.drv5 /nix/store/q6b96ax69s8br7l95aph3kkj3gyldb1x-luvus-0.14.3.drv6 /nix/store/m4sc964fnla1dqly6qy9nivszicnzisy-check-luvus.drv7error: build of '/nix/store/q6b96ax69s8br7l95aph3kkj3gyldb1x-luvus-0.14.3.drv' on 'ssh-ng://customer@mac02.m.ntd.one' failed: Cannot build '/nix/store/q6b96ax69s8br7l95aph3kkj3gyldb1x-luvus-0.14.3.drv'.8 Reason: builder failed with exit code 101.9 Output paths:10 /nix/store/zj3fiy3i7hb3b689wxc8m1kqxx1xw098-luvus-0.14.311 Last 25 log lines:12 > test worktree::tests::failed_validation_never_removes_a_preexisting_worktree ... ok13 > test worktree::tests::parses_strict_provider_json_and_rejects_other_output ... ok14 >15 > failures:16 >17 > ---- app::input::tests::a_key_that_dismisses_the_bar_overflow_never_repeats_into_the_view stdout ----18 >19 > thread 'app::input::tests::a_key_that_dismisses_the_bar_overflow_never_repeats_into_the_view' (41111029) panicked at src/app/input.rs:6248:9:20 > fixture opens the Git dashboard21 >22 > ---- app::tests::api_worktree_create_uses_configured_module_provider stdout ----23 >24 > thread 'app::tests::api_worktree_create_uses_configured_module_provider' (41119613) panicked at src/app/mod.rs:12258:9:25 > assertion `left == right` failed: {"error":{"code":"git_error","message":"worktree provider returned a non-absolute path"},"id":"create"}26 > left: Null27 > right: "/nix/var/nix/builds/nix-45573-658454102/luvus-module-provider-api-create-68659/wt-topic"28 >29 >30 > failures:31 > app::input::tests::a_key_that_dismisses_the_bar_overflow_never_repeats_into_the_view32 > app::tests::api_worktree_create_uses_configured_module_provider33 >34 > test result: FAILED. 2348 passed; 2 failed; 6 ignored; 0 measured; 11 filtered out; finished in 59.22s35 >36 > error: test failed, to rerun pass `--bin luvus`37 For full logs, run:38 nix log /nix/store/q6b96ax69s8br7l95aph3kkj3gyldb1x-luvus-0.14.3.drv39error: Cannot build '/nix/store/q6b96ax69s8br7l95aph3kkj3gyldb1x-luvus-0.14.3.drv'.40 Reason: builder failed with exit code 1.41 Output paths:42 /nix/store/zj3fiy3i7hb3b689wxc8m1kqxx1xw098-luvus-0.14.343error: Cannot build '/nix/store/m4sc964fnla1dqly6qy9nivszicnzisy-check-luvus.drv'.44 Reason: 1 dependency failed.45 Output paths:46 /nix/store/4srmma1z04avlqrzb491yvbpz0ia7sak-check-luvus