these 4 derivations will be built: /nix/store/f5w4dbbr6g6lz8zwk38gxj5prjcgk1gr-openresearch-0.2.11-vendor-staging.drv /nix/store/031a50pqrifsb5cqqvk5w9kyax8998q9-openresearch-0.2.11-vendor.drv /nix/store/6l9q4y5n5j9x40sifx74hk95kgxw9bk6-openresearch-0.2.11.drv /nix/store/jlwhbc87awqvb52ssmj1pvj9fygfpj86-check-openresearch.drv error: Cannot build '/nix/store/6l9q4y5n5j9x40sifx74hk95kgxw9bk6-openresearch-0.2.11.drv'. Reason: builder failed with exit code 101. Output paths: /nix/store/9g40dizyglxr897nywwpi401sh45pb0m-openresearch-0.2.11 Last 25 log lines: > test slurm_supervisor_survives_connection_and_accounting_loss ... FAILED > test ssh_config_conflict_and_execution_target_checks ... ok > test standalone_settings_defaults_and_instruction_conflicts ... ok > > failures: > > ---- slurm_cancel_requires_acknowledgement_and_survives_restart_without_accounting stdout ---- > > thread 'slurm_cancel_requires_acknowledgement_and_survives_restart_without_accounting' (9061) panicked at tests/compute_cli.rs:444:13: > assertion failed: Instant::now() < deadline > note: run with `RUST_BACKTRACE=1` environment variable to display a backtrace > > ---- slurm_supervisor_survives_connection_and_accounting_loss stdout ---- > > thread 'slurm_supervisor_survives_connection_and_accounting_loss' (9325) panicked at tests/compute_cli.rs:250:13: > supervisor did not reach expected state > > > failures: > slurm_cancel_requires_acknowledgement_and_survives_restart_without_accounting > slurm_supervisor_survives_connection_and_accounting_loss > > test result: FAILED. 7 passed; 2 failed; 0 ignored; 0 measured; 0 filtered out; finished in 30.55s > > error: test failed, to rerun pass `--test compute_cli` For full logs, run: nix log /nix/store/6l9q4y5n5j9x40sifx74hk95kgxw9bk6-openresearch-0.2.11.drv error: Cannot build '/nix/store/jlwhbc87awqvb52ssmj1pvj9fygfpj86-check-openresearch.drv'. Reason: 1 dependency failed. Output paths: /nix/store/fdcf4nnvd57zlkhycip992006xm0dyax-check-openresearch