plannotator-tui-0.9.4
checks.aarch64-darwin.pkgs-plannotator-tui
· build #5787
· raw
1Using versionCheckHook
unpackPhase
2unpacking source archive /nix/store/hx3qvqbykzjzyp4lk0rq2wzb1a066prj-source3source root is source4Executing cargoSetupPostUnpackHook5Finished cargoSetupPostUnpackHookpatchPhase
6Executing cargoSetupPostPatchHook7Validating consistency between /nix/var/nix/builds/nix-90209-1124066261/source/Cargo.lock and /nix/var/nix/builds/nix-90209-1124066261/plannotator-tui-0.9.4-vendor/Cargo.lock8Finished cargoSetupPostPatchHookbuildPhase
9Executing cargoBuildHook10cargoBuildHook flags: -j 10 --target aarch64-apple-darwin --offline --profile release11 Compiling proc-macro2 v1.0.10712 Compiling unicode-ident v1.0.2413 Compiling quote v1.0.4714 Compiling libc v0.2.18915 Compiling cfg-if v1.0.416 Compiling bitflags v2.13.117 Compiling rustversion v1.0.2318 Compiling foldhash v0.2.019 Compiling itoa v1.0.1820 Compiling allocator-api2 v0.2.2121 Compiling equivalent v1.0.222 Compiling thiserror v2.0.2023 Compiling serde_core v1.0.22924 Compiling either v1.18.025 Compiling unicode-width v0.2.226 Compiling ident_case v1.0.127 Compiling heck v0.5.028 Compiling once_cell v1.21.429 Compiling strsim v0.11.130 Compiling hashbrown v0.17.131 Compiling hashbrown v0.16.132 Compiling itertools v0.14.033 Compiling unicode-segmentation v1.13.334 Compiling smallvec v1.15.235 Compiling typenum v1.20.136 Compiling static_assertions v1.1.037 Compiling version_check v0.9.538 Compiling ryu v1.0.2339 Compiling zerocopy v0.8.5640 Compiling lru v0.18.341 Compiling ahash v0.8.1242 Compiling find-msvc-tools v0.1.1143 Compiling castaway v0.2.444 Compiling hybrid-array v0.4.1445 Compiling parking_lot_core v0.9.1246 Compiling signal-hook v0.3.1847 Compiling critical-section v1.2.048 Compiling syn v3.0.449 Compiling syn v2.0.11950 Compiling unicode-truncate v2.0.151 Compiling memchr v2.8.352 Compiling instability v0.3.1353 Compiling semver v1.0.2854 Compiling errno v0.3.1455 Compiling shlex v2.0.156 Compiling winnow v1.0.457 Compiling log v0.4.3458 Compiling cc v1.4.459 Compiling mio v1.2.260 Compiling compact_str v0.9.161 Compiling aho-corasick v1.1.562 Compiling indexmap v2.14.063 Compiling signal-hook-registry v1.4.864 Compiling rustc_version v0.4.165 Compiling convert_case v0.10.066 Compiling toml_parser v1.1.3+spec-1.1.067 Compiling pkg-config v0.3.3468 Compiling regex-syntax v0.8.1169 Compiling scopeguard v1.2.070 Compiling indoc v2.0.771 Compiling toml_datetime v1.1.1+spec-1.1.072 Compiling vcpkg v0.2.1573 Compiling zmij v1.0.2374 Compiling rustix v1.1.475 Compiling toml_edit v0.25.13+spec-1.1.076 Compiling lock_api v0.4.1477 Compiling libsqlite3-sys v0.28.078 Compiling darling_core v0.24.179 Compiling rstest_macros v0.26.180 Compiling num_threads v0.1.781 Compiling crypto-common v0.2.282 Compiling block-buffer v0.12.183 Compiling time-core v0.1.984 Compiling powerfmt v0.2.085 Compiling num-conv v0.2.286 Compiling serde_json v1.0.15187 Compiling deranged v0.5.888 Compiling litrs v1.0.089 Compiling pin-project-lite v0.2.1790 Compiling const-oid v0.10.291 Compiling document-features v0.2.1292 Compiling regex-automata v0.4.1893 Compiling digest v0.11.394 Compiling thiserror-impl v2.0.2095 Compiling futures-macro v0.3.3496 Compiling proc-macro-crate v3.5.097 Compiling parking_lot v0.12.598 Compiling time v0.3.5599 Compiling hashbrown v0.14.5100 Compiling signal-hook-mio v0.2.5101 Compiling cpufeatures v0.3.1102 Compiling line-clipping v0.3.8103 Compiling pulldown-cmark v0.13.4104 Compiling strum_macros v0.28.0105 Compiling derive_more-impl v2.1.1106 Compiling glob v0.3.4107 Compiling slab v0.4.12108 Compiling futures-task v0.3.34109 Compiling serde v1.0.229110 Compiling relative-path v1.9.3111 Compiling futures-core v0.3.34112 Compiling kasuari v0.4.12113 Compiling derive_more v2.1.1114 Compiling futures-util v0.3.34115 Compiling hashlink v0.9.1116 Compiling darling_macro v0.24.1117 Compiling tracing-attributes v0.1.31118 Compiling crossterm v0.29.0119 Compiling darling v0.24.1120 Compiling regex v1.13.1121 Compiling strum v0.28.0122 Compiling serde_derive v1.0.229123 Compiling tracing-core v0.1.36124 Compiling ratatui-core v0.1.2125 Compiling getopts v0.2.24126 Compiling yansi v1.0.1127 Compiling fallible-iterator v0.3.0128 Compiling fallible-streaming-iterator v0.1.9129 Compiling pulldown-cmark-escape v0.11.0130 Compiling anyhow v1.0.104131 Compiling unicase v2.9.0132 Compiling futures-timer v3.0.4133 Compiling diff v0.1.13134 Compiling pretty_assertions v1.4.1135 Compiling tracing v0.1.44136 Compiling sha1 v0.11.0137 Compiling sha2 v0.11.0138 Compiling serde_spanned v1.1.1139 Compiling ratatui-widgets v0.3.2140 Compiling ratatui-crossterm v0.1.2141 Compiling terminal-trx v0.2.6142 Compiling itertools v0.15.0143 Compiling xterm-color v1.0.2144 Compiling toml_writer v1.1.2+spec-1.1.0145 Compiling terminal-colorsaurus v1.0.3146 Compiling toml v1.1.4+spec-1.1.0147 Compiling similar v3.2.0148 Compiling rstest v0.26.1149 Compiling ratatui-macros v0.7.2150 Compiling plannotator-tui-schema v0.9.4 (/nix/var/nix/builds/nix-90209-1124066261/source/crates/plannotator-tui-schema)151 Compiling ratatui v0.30.2152 Compiling tui-markdown v0.3.9153 Compiling rusqlite v0.31.0154 Compiling plannotator-tui-hosts v0.9.4 (/nix/var/nix/builds/nix-90209-1124066261/source/crates/plannotator-tui-hosts)155 Compiling plannotator-tui v0.9.4 (/nix/var/nix/builds/nix-90209-1124066261/source/crates/plannotator-tui)156 Finished `release` profile [optimized] target(s) in 29.85s157Executing cargoInstallPostBuildHook158Finished cargoInstallPostBuildHook159Finished cargoBuildHook160buildPhase completed in 30 secondscheckPhase
161Executing cargoCheckHook162cargoCheckHook flags: -j 10 --profile release --target aarch64-apple-darwin --offline --163 Compiling serde v1.0.229164 Compiling getrandom v0.3.4165 Compiling ahash v0.8.12166 Compiling serde_json v1.0.151167 Compiling strum v0.28.0168 Compiling autocfg v1.5.1169 Compiling ref-cast v1.0.27170 Compiling regex-syntax v0.8.11171 Compiling ref-cast-impl v1.0.27172 Compiling aho-corasick v1.1.5173 Compiling ratatui-core v0.1.2174 Compiling num-traits v0.2.19175 Compiling bit-vec v0.8.0176 Compiling unicode-general-category v1.1.0177 Compiling borrow-or-share v0.2.4178 Compiling bit-set v0.8.0179 Compiling num-cmp v0.1.0180 Compiling ratatui-widgets v0.3.2181 Compiling ratatui-crossterm v0.1.2182 Compiling tui-markdown v0.3.9183 Compiling regex-automata v0.4.18184 Compiling hashbrown v0.14.5185 Compiling plannotator-tui-schema v0.9.4 (/nix/var/nix/builds/nix-90209-1124066261/source/crates/plannotator-tui-schema)186 Compiling ratatui-macros v0.7.2187 Compiling ratatui v0.30.2188 Compiling bytecount v0.6.9189 Compiling outref v0.5.2190 Compiling micromap v0.3.0191 Compiling percent-encoding v2.3.2192 Compiling fluent-uri v0.4.1193 Compiling num-integer v0.1.47194 Compiling num-complex v0.4.6195 Compiling vsimd v0.8.0196 Compiling hashlink v0.9.1197 Compiling email_address v0.2.9198 Compiling num-bigint v0.4.8199 Compiling rusqlite v0.31.0200 Compiling num-iter v0.1.46201 Compiling uuid-simd v0.8.0202 Compiling jsonschema-regex v0.52.0203 Compiling data-encoding v2.11.1204 Compiling referencing v0.52.0205 Compiling plannotator-tui-hosts v0.9.4 (/nix/var/nix/builds/nix-90209-1124066261/source/crates/plannotator-tui-hosts)206 Compiling num-rational v0.4.2207 Compiling num v0.4.3208 Compiling fraction v0.17.0209 Compiling jsonschema-value v0.52.0210 Compiling plannotator-tui v0.9.4 (/nix/var/nix/builds/nix-90209-1124066261/source/crates/plannotator-tui)211 Compiling regex v1.13.1212 Compiling fancy-regex v0.19.0213 Compiling jsonschema v0.52.0214 Finished `release` profile [optimized] target(s) in 1m 17s215 Running unittests src/main.rs (target/aarch64-apple-darwin/release/deps/plannotator_tui-5d8f0561c23914e8)216217running 187 tests218test app::menu::tests::a_narrow_pane_keeps_both_header_buttons_on_one_line ... ok219test app::feedback::tests::reply_reviews_keep_sending_the_whole_transient_review ... ok220test app::feedback::tests::the_zero_pending_button_stays_visible_and_does_not_send_or_record_another_delivery ... ok221test app::menu::tests::clicking_the_review_button_opens_the_menu_and_clicking_a_row_runs_it ... ok222test app::menu::tests::a_rows_own_key_runs_it_from_the_menu ... ok223test app::pick::tests::a_stamp_that_already_carries_an_offset_is_shown_as_written ... ok224test app::pick::tests::a_utc_stamp_is_shown_on_the_local_clock ... ok225test app::pick::tests::a_zone_string_reads_as_minutes_east_of_utc ... ok226test app::pick::tests::the_local_offset_is_a_real_time_zone_on_every_platform ... ok227test app::feedback::tests::folder_feedback_ends_every_file_block_with_a_blank_line ... ok228test app::feedback::tests::incremental_send_and_explicit_resend_use_the_same_set_for_body_history_and_ids ... ok229test app::feedback::tests::folder_counts_and_delivery_cover_collapsed_files_but_exclude_orphans_and_siblings ... ok230test app::menu::tests::movement_skips_dimmed_rows_and_opens_on_the_first_that_applies ... ok231test app::menu::tests::enter_runs_the_highlighted_row_and_closes_the_menu ... ok232test app::menu::tests::the_header_holds_send_and_review_and_m_opens_and_closes_the_menu ... ok233test app::menu::tests::the_menu_is_unavailable_while_composing_and_in_reply_reviews ... ok234test app::selection::tests::columns_span_rows_in_either_drag_direction ... ok235test app::feedback::tests::a_folder_opens_expands_and_reloads_when_one_annotated_file_is_unreadable ... ok236test app::feedback::tests::unsuccessful_sends_leave_the_record_pending_and_offer_retry ... ok237test app::review::tests::a_failed_undo_stays_available_for_retry_without_losing_the_archive ... ok238test app::review::tests::finished_notes_are_recoverable_with_submission_history_disabled ... ok239test app::send::tests::s_after_a_send_closes_without_sending_again ... ok240test app::review::tests::a_deleted_files_archive_is_still_visible_and_restores_when_its_source_returns ... ok241test app::send::tests::s_closes_a_reply_review_with_nothing_to_send ... ok242test app::review::tests::finish_undo_and_restore_keep_pending_edits_and_preserve_sent_status ... ok243test app::review::tests::sent_markers_clear_on_edit_and_review_shortcuts_are_text_while_composing ... ok244test app::send::tests::s_copies_then_closes_when_the_target_is_not_an_agent ... ok245test app::send::tests::s_sends_a_reply_review_and_closes ... ok246test app::tests::a_block_key_ends_roaming ... ok247test app::send::tests::s_keeps_the_window_open_while_the_agent_is_at_a_dialog ... ok248test app::tests::a_column_move_in_block_mode_starts_roaming_so_the_cursor_is_drawn ... ok249test app::review::tests::the_archive_picker_scrolls_and_restores_the_clicked_annotation ... ok250test app::send::tests::removing_a_sent_annotation_leaves_the_review_sent ... ok251test app::tests::a_comment_can_span_lines_and_enter_saves_it ... ok252test app::review::tests::folder_finish_reports_partial_failure_and_undo_covers_only_committed_archives ... ok253test app::tests::a_message_review_archives_the_session_id_and_the_transcript_path_separately ... ok254test app::tests::a_message_review_without_a_session_id_archives_only_the_transcript_path ... ok255test app::send::tests::the_footer_names_s_only_in_a_reply_review_and_fits_at_80_columns ... ok256test app::tests::a_status_leads_the_footer_so_a_narrow_pane_cannot_truncate_it_away ... ok257test app::tests::a_reply_already_sent_is_not_sent_again_from_another_reply ... ok258test app::send::tests::s_does_nothing_in_a_file_review ... ok259test app::tests::a_status_leads_the_footer_and_the_name_counters_and_key_help_stay ... ok260test app::tests::clicking_the_send_button_sends ... ok261test app::tests::escaping_the_picker_keeps_the_newest_message ... ok262test app::tests::double_clicking_a_block_offers_the_toolbar_for_the_whole_block ... ok263test app::tests::moving_the_picker_cursor_previews_that_message ... ok264test app::tests::newest_opens_the_newest_reply_and_leaves_the_picker_on_p ... ok265test app::tests::a_single_annotated_reply_sends_the_same_body_as_before ... ok266test app::tests::notes_on_every_reply_are_sent_together_each_under_its_own_reply ... ok267test app::tests::paging_a_one_row_pane_keeps_the_selection ... ok268test app::tests::paging_a_document_that_cannot_scroll_selects_the_edge_block ... ok269test app::tests::dot_in_the_tree_shows_hidden_folders_but_never_the_skipped_ones ... ok270test app::tests::paging_down_takes_the_selection_along_so_the_next_block_key_continues_on_screen ... ok271test app::tests::paging_through_a_block_taller_than_the_screen_selects_that_block ... ok272test app::tests::paging_up_takes_the_selection_along ... ok273test app::tests::pasting_into_the_comment_box_keeps_newlines ... ok274test app::tests::previewing_away_and_back_keeps_annotations ... ok275test archive::tests::a_sidecar_is_skipped_for_a_record_without_content ... ok276test archive::tests::host_labels_map_to_plannotators_spellings ... ok277test archive::tests::a_foreign_reader_sees_valid_json_with_a_numeric_v ... ok278test archive::tests::an_agent_message_submission_records_agent_provenance ... ok279test app::tests::the_picker_lists_newest_first_and_opens_the_chosen_message ... ok280test app::tests::quitting_with_notes_only_on_a_reply_that_is_not_open_asks_first ... ok281test app::tests::roaming_moves_by_row_so_a_selection_can_start_mid_block ... ok282test base64::tests::matches_reference_vectors ... ok283test app::tests::the_header_draws_the_send_button_and_records_where_it_is ... ok284test app::tests::quitting_with_unsent_feedback_asks_before_it_quits ... ok285test config::tests::config_path_precedence ... ok286test config::tests::a_configured_theme_is_read_and_leaves_the_rest_alone ... ok287test config::tests::an_unknown_theme_error_names_the_value ... ok288test config::tests::empty_file_is_the_default_config ... ok289test config::tests::invalid_placement_error_names_the_value ... ok290test config::tests::partial_file_keeps_other_defaults ... ok291test config::tests::roundtrips_through_toml ... ok292test config::tests::the_theme_defaults_to_asking_the_terminal ... ok293test config::tests::unknown_key_error_names_the_key ... ok294test app::send::tests::send_writeback_preserves_changes_made_while_the_transport_is_running ... ok295test delivery::tests::describe_names_the_agent_when_known ... ok296test delivery::tests::blocked_agent_is_blocked_with_herdrs_message ... ok297test delivery::tests::missing_or_unready_agent_is_unavailable ... ok298test delivery::tests::success_is_ok_regardless_of_output ... ok299test delivery::tests::the_clipboard_sequence_is_osc52_over_the_raw_utf8_bytes ... ok300test delivery::tests::unknown_code_and_garbage_are_failures_that_keep_the_text ... ok301test archive::tests::the_env_knob_follows_plannotators_resolver_semantics ... ok302test doc::tests::front_matter_is_dropped_and_nested_lists_stay_one_block ... ok303test export::tests::an_entry_without_lines_has_no_line_label ... ok304test doc::tests::splits_top_level_blocks_with_ranges ... ok305test export::tests::fences_grow_past_embedded_backticks ... ok306test export::tests::export_matches_the_agent_facing_shape ... ok307test herdr::context::tests::any_exact_session_or_pid_selects_the_message_entrypoint ... ok308test herdr::context::tests::context_pane_is_a_target_only_when_an_agent_runs_there ... ok309test herdr::context::tests::context_with_omitted_and_unknown_fields_parses ... ok310test herdr::context::tests::explicit_deliver_to_wins_and_carries_the_agent_label ... ok311test herdr::context::tests::only_an_exact_newest_flag_skips_the_picker ... ok312test herdr::context::tests::outside_herdr_nothing_is_set ... ok313test archive::tests::the_sidecar_carries_the_feedback_the_agent_received ... ok314test herdr::context::tests::own_pane_id_is_never_a_target ... ok315test herdr::context::tests::the_terminal_pane_and_line_count_come_from_the_launcher ... ok316test herdr::context::tests::the_reviewed_pane_is_the_focused_one_from_an_action_else_the_caller ... ok317test archive::tests::same_millisecond_submissions_bump_the_sidecar_counter ... ok318test herdr::launch::tests::a_human_in_a_plain_shell_pane_gets_no_agent_target ... ok319test herdr::launch::tests::a_last_launch_carries_the_pid_and_host_instead_of_a_file ... ok320test herdr::launch::tests::herdrs_agent_session_is_passed_to_the_pane_as_a_path_or_an_id ... ok321test herdr::launch::tests::env_placement_beats_config_and_arg_beats_env ... ok322test herdr::launch::tests::explicit_placement_still_wins_over_the_mirror_default ... ok323test herdr::launch::tests::herdrs_exact_agent_identity_needs_no_process_info ... ok324test archive::tests::the_index_line_matches_the_v1_contract_shape ... ok325test delivery::tests::an_oversized_copy_is_emitted_whole_rather_than_truncated ... ok326test herdr::launch::tests::newest_reaches_the_pane_only_when_last_was_asked_for_it ... ok327test herdr::launch::tests::mirror_defaults_to_a_split_next_to_the_remote_invoking_pane ... ok328test herdr::launch::tests::only_file_urls_are_opened ... ok329test herdr::launch::tests::popup_placement_emits_size_and_no_target_pane ... ok330test herdr::launch::tests::terminal_review_of_a_shell_splits_beside_it_and_delivers_nowhere ... ok331test herdr::launch::tests::run_refuses_outside_herdr ... ok332test herdr::launch::tests::terminal_review_reads_the_focused_pane_and_delivers_to_its_agent ... ok333test herdr::launch::tests::the_agent_pid_is_the_named_agent_process_else_the_group_leader ... ok334test herdr::launch::tests::the_plugin_id_comes_from_the_environment ... ok335test herdr::launch::tests::ctrl_click_opens_the_linked_file ... ok336test herdr::terminal::tests::output_with_nothing_visible_cleans_to_empty ... ok337test herdr::terminal::tests::blank_lines_inside_the_output_are_kept ... ok338test herdr::terminal::tests::cleaning_removes_escapes_controls_and_surrounding_blank_lines ... ok339test herdr::terminal::tests::long_lines_break_at_a_space_and_short_lines_are_untouched ... ok340test herdr::terminal::tests::the_document_renders_the_output_as_one_code_block ... ok341test herdr::launch::tests::agent_skill_delivers_to_and_splits_beside_the_calling_pane ... ok342test herdr::terminal::tests::the_fence_outlasts_any_backticks_in_the_output ... ok343test herdr::terminal::tests::the_review_is_transient_and_titled_by_its_pane ... ok344test last::fallback::tests::only_a_pid_registered_session_counts_as_exact ... ok345test last::roots::tests::every_documented_root_override_is_honoured ... ok346test last::roots::tests::pi_agent_and_xdg_overrides_apply_when_the_more_specific_values_are_absent ... ok347test herdr::launch::tests::human_keybind_opens_the_focused_folder_and_delivers_to_its_agent ... ok348test last::tests::an_exactly_identified_transcript_is_never_annotated ... ok349test last::tests::inside_herdr_a_guessed_transcript_names_the_missing_session_id ... ok350test last::tests::outside_herdr_a_guessed_transcript_says_what_was_shown_without_naming_herdr ... ok351test layout::tests::rendered_text_strips_markup_and_joins_blocks_without_separator ... ok352test srcmap::tests::decoration_maps_to_nothing ... ok353test srcmap::tests::maps_through_concealed_markup ... ok354test delivery::tests::headless_runs_never_reach_the_terminal_clipboard ... ok355test last::locate::tests::a_transcript_named_on_the_command_line_is_never_reported_as_a_guess ... ok356test store::review::tests::an_edit_advances_past_a_delivery_even_if_the_clock_went_backwards ... ok357test store::review::tests::every_written_timestamp_has_three_fractional_digits_and_a_trailing_z ... ok358test last::locate::tests::a_transcript_without_an_id_in_its_name_keeps_a_valid_supplied_id ... ok359test store::review::tests::restoring_never_overwrites_an_active_annotation_with_the_same_id ... ok360test store::review::tests::rfc3339_offsets_and_precision_are_compared_as_instants ... ok361test last::locate::tests::the_transcript_name_is_the_authority_over_a_supplied_id ... ok362test store::tests::civil_dates_are_correct ... ok363test herdr::terminal::tests::a_quote_across_a_broken_path_reads_as_printed ... ok364test store::tests::a_record_without_deliveries_still_loads ... ok365test theme::tests::a_theme_setting_roundtrips_through_its_own_name ... ok366test theme::tests::an_empty_environment_variable_is_not_a_choice ... ok367test theme::tests::an_unreadable_environment_variable_is_an_error_naming_the_value ... ok368test theme::tests::auto_in_the_environment_reopens_the_question_a_configured_theme_closed ... ok369test store::tests::saves_on_every_change_and_re_resolves_after_an_edit ... ok370test store::tests::legacy_sidecar_is_imported_once_and_left_alone ... ok371test store::review::tests::archive_only_records_are_discoverable_and_sent_orphans_can_be_finished ... ok372test theme::tests::auto_uses_the_terminals_answer_and_falls_back_to_dark_without_one ... ok373test theme::tests::no_light_role_reuses_its_dark_value ... ok374test theme::tests::the_config_file_beats_detection ... ok375test theme::tests::the_dark_palette_is_unchanged ... ok376test theme::tests::the_environment_beats_the_config_file ... ok377test theme::tests::the_light_selection_is_a_background_not_a_reversal ... ok378test theme::tests::the_palette_is_dark_until_something_installs_one ... ok379test store::review::tests::archive_and_restore_failures_leave_memory_and_disk_intact ... ok380test store::tests::all_delivered_tracks_the_last_send_across_reloads ... ok381test store::review::tests::an_unparsable_timestamp_can_be_finished_and_is_pending_again_after_an_edit ... ok382test workspace_paths::tests::relative_and_dotted_spellings_resolve_to_one_absolute_path ... ok383test wrap::table::tests::a_budget_too_small_for_the_words_is_still_spent_in_full ... ok384test wrap::table::tests::a_pipe_inside_a_cell_falls_back_to_clipping_instead_of_dropping_it ... ok385test wrap::table::tests::a_row_the_reflow_cannot_read_is_clipped_not_word_wrapped ... ok386test store::review::tests::archiving_keeps_pending_notes_and_restores_complete_annotations_and_history ... ok387test wrap::table::tests::a_window_narrower_than_the_box_gets_the_clipped_table ... ok388test wrap::table::tests::columns_keep_their_longest_word_and_share_the_rest_in_proportion ... ok389test wrap::table::tests::every_row_of_a_squeezed_table_is_the_same_width ... ok390test wrap::table::tests::table_cells_wrap_without_breaking_the_box ... ok391test app::tests::the_tree_scrolls_to_keep_the_cursor_visible_and_hit_tests_through_the_offset ... ok392test wrap::table::tests::words_stay_whole_when_a_wrapped_table_has_room_for_them ... ok393test wrap::table::tests::wrapped_table_cells_still_name_the_source_char_under_them ... ok394test wrap::tests::empty_line_is_one_row ... ok395test wrap::tests::hard_splits_long_tokens_and_wide_chars_take_two_cells ... ok396test wrap::tests::styles_survive_wrapping_at_span_and_line_level ... ok397test wrap::tests::wraps_on_word_boundaries_and_keeps_offsets ... ok398test store::review::tests::incremental_batches_and_edits_remain_correct_after_reopening ... ok399test tree::tests::the_shallowest_markdown_is_found_without_walking_everything ... ok400test tree::tests::hidden_entries_appear_only_once_they_are_asked_for ... ok401test tree::tests::skipped_directories_are_never_listed_or_read ... ok402test tree::tests::the_root_lists_one_level_and_expanding_descends_lazily ... ok403test tree::tests::the_shallowest_markdown_ignores_hidden_folders ... ok404test tree::tests::toggling_a_file_row_changes_nothing ... ok405406test result: ok. 187 passed; 0 failed; 0 ignored; 0 measured; 0 filtered out; finished in 0.08s407408 Running tests/annotate_occurrence.rs (target/aarch64-apple-darwin/release/deps/annotate_occurrence-ebde515f7d164613)409410running 3 tests411test a_missing_occurrence_fails_and_says_how_many_there_are ... ok412test occurrence_marks_the_named_match_of_a_repeated_phrase ... ok413test without_occurrence_the_first_match_is_marked ... ok414415test result: ok. 3 passed; 0 failed; 0 ignored; 0 measured; 0 filtered out; finished in 0.28s416417 Running tests/codex_pid.rs (target/aarch64-apple-darwin/release/deps/codex_pid-ecff11417d3c11de)418419running 0 tests420421test result: ok. 0 passed; 0 failed; 0 ignored; 0 measured; 0 filtered out; finished in 0.00s422423 Running tests/folder_export.rs (target/aarch64-apple-darwin/release/deps/folder_export-1545e678e4a5a9bf)424425running 1 test426test folder_export_includes_every_annotated_file ... ok427428test result: ok. 1 passed; 0 failed; 0 ignored; 0 measured; 0 filtered out; finished in 0.02s429430 Running tests/last.rs (target/aarch64-apple-darwin/release/deps/last-398949fb1626a124)431432running 13 tests433test print_never_fails_the_caller_when_nothing_is_found ... ok434test print_reads_a_codex_thread_from_a_sessions_root ... ok435test print_reads_a_droid_log ... ok436test a_session_path_without_a_host_is_sniffed ... ok437test print_reads_a_copilot_session_directory ... ok438test omp_reads_pi_format_sessions ... ok439test print_writes_the_newest_assistant_message_of_a_pi_session ... ok440test print_writes_the_newest_assistant_message_of_a_claude_transcript ... ok441test stdin_is_printed_back_verbatim ... ok442test herdr_open_rejects_newest_by_name ... ok443test claude_config_override_is_used_for_an_exact_id ... ok444test herdr_reported_codex_id_beats_a_newer_unrelated_rollout ... ok445test hermes_reads_the_session_named_by_id_from_hermes_home ... ok446447test result: ok. 13 passed; 0 failed; 0 ignored; 0 measured; 0 filtered out; finished in 0.01s448449 Running tests/terminal.rs (target/aarch64-apple-darwin/release/deps/terminal-2ccc36d6dfec59ca)450451running 6 tests452test line_counts_must_be_positive_numbers ... ok453test an_action_without_a_focused_pane_reads_nothing ... FAILED454test the_review_pane_opens_on_the_output_and_sends_to_the_agent_that_produced_it ... FAILED455test a_failed_read_reports_herdrs_error_without_opening_a_review ... FAILED456test print_shows_the_focused_panes_cleaned_output_as_one_code_block ... FAILED457test a_pane_with_nothing_on_it_fails_without_opening_a_review ... FAILED458459failures:460461---- an_action_without_a_focused_pane_reads_nothing stdout ----462463thread 'an_action_without_a_focused_pane_reads_nothing' (24438932) panicked at crates/plannotator-tui/tests/terminal.rs:32:5:464rustc failed: error: linking with `cc` failed: exit status: 1465 |466 = note: "cc" "/nix/var/nix/builds/nix-90209-1124066261/plannotator terminal unfocused ü-9707/fake herdr/rustc8XO4pn/symbols.o" "<2 object files omitted>" "<sysroot>/lib/rustlib/aarch64-apple-darwin/lib/{libstd-*,libpanic_unwind-*,libobject-*,libmemchr-*,libaddr2line-*,libgimli-*,libcfg_if-*,librustc_demangle-*,libstd_detect-*,libhashbrown-*,librustc_std_workspace_alloc-*,libminiz_oxide-*,libadler2-*,libunwind-*,liblibc-*,librustc_std_workspace_core-*,liballoc-*,libcore-*,libcompiler_builtins-*}.rlib" "-lSystem" "-lc" "-lm" "-arch" "arm64" "-mmacosx-version-min=14.0.0" "-o" "/nix/var/nix/builds/nix-90209-1124066261/plannotator terminal unfocused ü-9707/fake herdr/herdr" "-Wl,-dead_strip" "-nodefaultlibs"467 = note: some arguments are omitted. use `--verbose` to show all linker arguments468 = note: clang: error: no such file or directory: '$/nix/var/nix/builds/nix-90209-1124066261/plannotator terminal unfocused 303274-9707/fake herdr/rustc8XO4pn/symbols.o'469 clang: error: no such file or directory: '$/nix/var/nix/builds/nix-90209-1124066261/plannotator terminal unfocused 303274-9707/fake herdr/herdr.fake_herdr.1f3d8391611ad6f0-cgu.0.rcgu.o'470 clang: error: no such file or directory: '$/nix/var/nix/builds/nix-90209-1124066261/plannotator terminal unfocused 303274-9707/fake herdr/herdr.alxm6t0z2y2syuksm1amaasmz.rcgu.o'471 472473error: aborting due to 1 previous error474475476note: run with `RUST_BACKTRACE=1` environment variable to display a backtrace477478---- the_review_pane_opens_on_the_output_and_sends_to_the_agent_that_produced_it stdout ----479480thread 'the_review_pane_opens_on_the_output_and_sends_to_the_agent_that_produced_it' (24438935) panicked at crates/plannotator-tui/tests/terminal.rs:32:5:481rustc failed: error: linking with `cc` failed: exit status: 1482 |483 = note: "cc" "/nix/var/nix/builds/nix-90209-1124066261/plannotator terminal launch ü-9707/fake herdr/rustcNm6ox7/symbols.o" "<2 object files omitted>" "<sysroot>/lib/rustlib/aarch64-apple-darwin/lib/{libstd-*,libpanic_unwind-*,libobject-*,libmemchr-*,libaddr2line-*,libgimli-*,libcfg_if-*,librustc_demangle-*,libstd_detect-*,libhashbrown-*,librustc_std_workspace_alloc-*,libminiz_oxide-*,libadler2-*,libunwind-*,liblibc-*,librustc_std_workspace_core-*,liballoc-*,libcore-*,libcompiler_builtins-*}.rlib" "-lSystem" "-lc" "-lm" "-arch" "arm64" "-mmacosx-version-min=14.0.0" "-o" "/nix/var/nix/builds/nix-90209-1124066261/plannotator terminal launch ü-9707/fake herdr/herdr" "-Wl,-dead_strip" "-nodefaultlibs"484 = note: some arguments are omitted. use `--verbose` to show all linker arguments485 = note: clang: error: no such file or directory: '$/nix/var/nix/builds/nix-90209-1124066261/plannotator terminal launch 303274-9707/fake herdr/rustcNm6ox7/symbols.o'486 clang: error: no such file or directory: '$/nix/var/nix/builds/nix-90209-1124066261/plannotator terminal launch 303274-9707/fake herdr/herdr.fake_herdr.1f3d8391611ad6f0-cgu.0.rcgu.o'487 clang: error: no such file or directory: '$/nix/var/nix/builds/nix-90209-1124066261/plannotator terminal launch 303274-9707/fake herdr/herdr.alxm6t0z2y2syuksm1amaasmz.rcgu.o'488 489490error: aborting due to 1 previous error491492493494---- a_failed_read_reports_herdrs_error_without_opening_a_review stdout ----495496thread 'a_failed_read_reports_herdrs_error_without_opening_a_review' (24438930) panicked at crates/plannotator-tui/tests/terminal.rs:32:5:497rustc failed: error: linking with `cc` failed: exit status: 1498 |499 = note: "cc" "/nix/var/nix/builds/nix-90209-1124066261/plannotator terminal error ü-9707/fake herdr/rustcjYcJnp/symbols.o" "<2 object files omitted>" "<sysroot>/lib/rustlib/aarch64-apple-darwin/lib/{libstd-*,libpanic_unwind-*,libobject-*,libmemchr-*,libaddr2line-*,libgimli-*,libcfg_if-*,librustc_demangle-*,libstd_detect-*,libhashbrown-*,librustc_std_workspace_alloc-*,libminiz_oxide-*,libadler2-*,libunwind-*,liblibc-*,librustc_std_workspace_core-*,liballoc-*,libcore-*,libcompiler_builtins-*}.rlib" "-lSystem" "-lc" "-lm" "-arch" "arm64" "-mmacosx-version-min=14.0.0" "-o" "/nix/var/nix/builds/nix-90209-1124066261/plannotator terminal error ü-9707/fake herdr/herdr" "-Wl,-dead_strip" "-nodefaultlibs"500 = note: some arguments are omitted. use `--verbose` to show all linker arguments501 = note: clang: error: no such file or directory: '$/nix/var/nix/builds/nix-90209-1124066261/plannotator terminal error 303274-9707/fake herdr/rustcjYcJnp/symbols.o'502 clang: error: no such file or directory: '$/nix/var/nix/builds/nix-90209-1124066261/plannotator terminal error 303274-9707/fake herdr/herdr.fake_herdr.1f3d8391611ad6f0-cgu.0.rcgu.o'503 clang: error: no such file or directory: '$/nix/var/nix/builds/nix-90209-1124066261/plannotator terminal error 303274-9707/fake herdr/herdr.alxm6t0z2y2syuksm1amaasmz.rcgu.o'504 505506error: aborting due to 1 previous error507508509510---- print_shows_the_focused_panes_cleaned_output_as_one_code_block stdout ----511512thread 'print_shows_the_focused_panes_cleaned_output_as_one_code_block' (24438934) panicked at crates/plannotator-tui/tests/terminal.rs:32:5:513rustc failed: error: linking with `cc` failed: exit status: 1514 |515 = note: "cc" "/nix/var/nix/builds/nix-90209-1124066261/plannotator terminal print ü-9707/fake herdr/rustczK3GPQ/symbols.o" "<2 object files omitted>" "<sysroot>/lib/rustlib/aarch64-apple-darwin/lib/{libstd-*,libpanic_unwind-*,libobject-*,libmemchr-*,libaddr2line-*,libgimli-*,libcfg_if-*,librustc_demangle-*,libstd_detect-*,libhashbrown-*,librustc_std_workspace_alloc-*,libminiz_oxide-*,libadler2-*,libunwind-*,liblibc-*,librustc_std_workspace_core-*,liballoc-*,libcore-*,libcompiler_builtins-*}.rlib" "-lSystem" "-lc" "-lm" "-arch" "arm64" "-mmacosx-version-min=14.0.0" "-o" "/nix/var/nix/builds/nix-90209-1124066261/plannotator terminal print ü-9707/fake herdr/herdr" "-Wl,-dead_strip" "-nodefaultlibs"516 = note: some arguments are omitted. use `--verbose` to show all linker arguments517 = note: clang: error: no such file or directory: '$/nix/var/nix/builds/nix-90209-1124066261/plannotator terminal print 303274-9707/fake herdr/rustczK3GPQ/symbols.o'518 clang: error: no such file or directory: '$/nix/var/nix/builds/nix-90209-1124066261/plannotator terminal print 303274-9707/fake herdr/herdr.fake_herdr.1f3d8391611ad6f0-cgu.0.rcgu.o'519 clang: error: no such file or directory: '$/nix/var/nix/builds/nix-90209-1124066261/plannotator terminal print 303274-9707/fake herdr/herdr.alxm6t0z2y2syuksm1amaasmz.rcgu.o'520 521522error: aborting due to 1 previous error523524525526---- a_pane_with_nothing_on_it_fails_without_opening_a_review stdout ----527528thread 'a_pane_with_nothing_on_it_fails_without_opening_a_review' (24438931) panicked at crates/plannotator-tui/tests/terminal.rs:32:5:529rustc failed: error: linking with `cc` failed: exit status: 1530 |531 = note: "cc" "/nix/var/nix/builds/nix-90209-1124066261/plannotator terminal empty ü-9707/fake herdr/rustcRLNBbA/symbols.o" "<2 object files omitted>" "<sysroot>/lib/rustlib/aarch64-apple-darwin/lib/{libstd-*,libpanic_unwind-*,libobject-*,libmemchr-*,libaddr2line-*,libgimli-*,libcfg_if-*,librustc_demangle-*,libstd_detect-*,libhashbrown-*,librustc_std_workspace_alloc-*,libminiz_oxide-*,libadler2-*,libunwind-*,liblibc-*,librustc_std_workspace_core-*,liballoc-*,libcore-*,libcompiler_builtins-*}.rlib" "-lSystem" "-lc" "-lm" "-arch" "arm64" "-mmacosx-version-min=14.0.0" "-o" "/nix/var/nix/builds/nix-90209-1124066261/plannotator terminal empty ü-9707/fake herdr/herdr" "-Wl,-dead_strip" "-nodefaultlibs"532 = note: some arguments are omitted. use `--verbose` to show all linker arguments533 = note: clang: error: no such file or directory: '$/nix/var/nix/builds/nix-90209-1124066261/plannotator terminal empty 303274-9707/fake herdr/rustcRLNBbA/symbols.o'534 clang: error: no such file or directory: '$/nix/var/nix/builds/nix-90209-1124066261/plannotator terminal empty 303274-9707/fake herdr/herdr.fake_herdr.1f3d8391611ad6f0-cgu.0.rcgu.o'535 clang: error: no such file or directory: '$/nix/var/nix/builds/nix-90209-1124066261/plannotator terminal empty 303274-9707/fake herdr/herdr.alxm6t0z2y2syuksm1amaasmz.rcgu.o'536 537538error: aborting due to 1 previous error539540541542543failures:544 a_failed_read_reports_herdrs_error_without_opening_a_review545 a_pane_with_nothing_on_it_fails_without_opening_a_review546 an_action_without_a_focused_pane_reads_nothing547 print_shows_the_focused_panes_cleaned_output_as_one_code_block548 the_review_pane_opens_on_the_output_and_sends_to_the_agent_that_produced_it549550test result: FAILED. 1 passed; 5 failed; 0 ignored; 0 measured; 0 filtered out; finished in 0.15s551552error: test failed, to rerun pass `-p plannotator-tui --test terminal`