aven-0.1.44
checks.aarch64-darwin.pkgs-aven
· build #5753
· raw
1Using versionCheckHook
unpackPhase
2unpacking source archive /nix/store/fb1pk9lapdyjdc0rgq65v396rs1j7d3x-source3source root is source4Executing cargoSetupPostUnpackHook5Finished cargoSetupPostUnpackHookpatchPhase
6applying patch /nix/store/ly5lhdxax9l9307l5pibhip820xznj5b-daemon-status-unknown-without-gui-domain.patch7patching file src/daemon/service.rs8Executing cargoSetupPostPatchHook9Validating consistency between /nix/var/nix/builds/nix-37931-932002788/aven/Cargo.lock and /nix/var/nix/builds/nix-37931-932002788/aven-0.1.44-vendor/Cargo.lock10Finished cargoSetupPostPatchHookbuildPhase
11Executing cargoBuildHook12cargoBuildHook flags: -j 10 --target aarch64-apple-darwin --offline --profile release --package aven13 Compiling libc v0.2.18614 Compiling proc-macro2 v1.0.10615 Compiling unicode-ident v1.0.2416 Compiling quote v1.0.4617 Compiling shlex v2.0.118 Compiling find-msvc-tools v0.1.919 Compiling pkg-config v0.3.3320 Compiling cfg-if v1.0.421 Compiling log v0.4.3322 Compiling serde v1.0.22823 Compiling serde_core v1.0.22824 Compiling pin-project-lite v0.2.1725 Compiling bitflags v2.13.126 Compiling icu_normalizer_data v2.2.027 Compiling itoa v1.0.1828 Compiling futures-core v0.3.3329 Compiling icu_properties_data v2.2.030 Compiling version_check v0.9.531 Compiling smallvec v1.15.232 Compiling bytes v1.12.133 Compiling stable_deref_trait v1.2.134 Compiling once_cell v1.21.435 Compiling generic-array v0.14.936 Compiling parking_lot_core v0.9.1237 Compiling crossbeam-utils v0.8.2238 Compiling autocfg v1.5.139 Compiling thiserror v2.0.1840 Compiling equivalent v1.0.241 Compiling memchr v2.8.342 Compiling allocator-api2 v0.2.2143 Compiling futures-sink v0.3.3344 Compiling foldhash v0.2.045 Compiling tracing-core v0.1.3646 Compiling typenum v1.20.147 Compiling litemap v0.8.248 Compiling hashbrown v0.17.149 Compiling writeable v0.6.350 Compiling syn v2.0.11951 Compiling jobserver v0.1.3552 Compiling errno v0.3.1453 Compiling mio v1.2.254 Compiling signal-hook-registry v1.4.855 Compiling socket2 v0.6.556 Compiling heck v0.5.057 Compiling percent-encoding v2.3.258 Compiling cc v1.3.059 Compiling futures-task v0.3.3360 Compiling vcpkg v0.2.1561 Compiling zmij v1.0.2362 Compiling slab v0.4.1263 Compiling dunce v1.0.564 Compiling fs_extra v1.3.065 Compiling scopeguard v1.2.066 Compiling utf8_iter v1.0.467 Compiling futures-io v0.3.3368 Compiling lock_api v0.4.1469 Compiling futures-util v0.3.3370 Compiling hashbrown v0.16.171 Compiling cmake v0.1.5872 Compiling zstd-sys v2.0.16+zstd.1.5.773 Compiling aws-lc-sys v0.45.074 Compiling crc32fast v1.5.075 Compiling simd-adler32 v0.3.1076 Compiling num-traits v0.2.1977 Compiling http v1.4.278 Compiling adler2 v2.0.179 Compiling synstructure v0.13.280 Compiling http-body v1.1.081 Compiling miniz_oxide v0.8.982 Compiling form_urlencoded v1.2.283 Compiling zstd-safe v7.2.484 Compiling aws-lc-rs v1.18.185 Compiling rustix v1.1.486 Compiling ryu v1.0.2387 Compiling rustversion v1.0.2388 Compiling zerofrom-derive v0.1.789 Compiling yoke-derive v0.8.290 Compiling zerovec-derive v0.11.391 Compiling displaydoc v0.2.692 Compiling serde_derive v1.0.22893 Compiling tracing-attributes v0.1.3194 Compiling tokio-macros v2.7.195 Compiling thiserror-impl v2.0.1896 Compiling core-foundation-sys v0.8.797 Compiling tokio v1.52.398 Compiling zerofrom v0.1.899 Compiling tracing v0.1.44100 Compiling parking_lot v0.12.5101 Compiling yoke v0.8.3102 Compiling flate2 v1.1.9103 Compiling block-buffer v0.10.4104 Compiling crypto-common v0.1.6105 Compiling futures-channel v0.3.33106 Compiling tower-service v0.3.3107 Compiling zeroize v1.9.0108 Compiling ident_case v1.0.1109 Compiling base64 v0.22.1110 Compiling zerovec v0.11.6111 Compiling zerotrie v0.2.4112 Compiling strsim v0.11.1113 Compiling unicode-width v0.2.2114 Compiling alloc-no-stdlib v2.0.4115 Compiling alloc-stdlib v0.2.4116 Compiling either v1.16.0117 Compiling darling_core v0.23.0118 Compiling tinystr v0.8.3119 Compiling potential_utf v0.1.5120 Compiling icu_locale_core v2.2.0121 Compiling icu_collections v2.2.0122 Compiling icu_provider v2.2.0123 Compiling icu_properties v2.2.0124 Compiling icu_normalizer v2.2.0125 Compiling idna_adapter v1.2.2126 Compiling digest v0.10.7127 Compiling idna v1.1.0128 Compiling concurrent-queue v2.5.0129 Compiling libsqlite3-sys v0.37.0130 Compiling cpufeatures v0.2.17131 Compiling httparse v1.10.1132 Compiling parking v2.2.1133 Compiling crc-catalog v2.5.0134 Compiling crc v3.4.0135 Compiling event-listener v5.4.1136 Compiling indexmap v2.14.0137 Compiling castaway v0.2.4138 Compiling sha2 v0.10.9139 Compiling url v2.5.8140 Compiling tokio-stream v0.1.18141 Compiling futures-intrusive v0.5.0142 Compiling darling_macro v0.23.0143 Compiling hashlink v0.11.1144 Compiling itertools v0.14.0145 Compiling brotli-decompressor v5.0.3146 Compiling rustls-pki-types v1.15.0147 Compiling strum_macros v0.28.0148 Compiling crossbeam-queue v0.3.13149 Compiling spin v0.9.9150 Compiling tower-layer v0.3.3151 Compiling static_assertions v1.1.0152 Compiling rustls v0.23.45153 Compiling num-conv v0.2.2154 Compiling signal-hook v0.3.18155 Compiling unicode-segmentation v1.13.3156 Compiling getrandom v0.4.3157 Compiling objc2 v0.6.4158 Compiling try-lock v0.2.5159 Compiling serde_json v1.0.150160 Compiling time-core v0.1.9161 Compiling instability v0.3.12162 Compiling untrusted v0.9.0163 Compiling time-macros v0.2.31164 Compiling convert_case v0.10.0165 Compiling want v0.3.1166 Compiling strum v0.28.0167 Compiling unicode-truncate v2.0.1168 Compiling sqlx-core v0.9.0169 Compiling compact_str v0.9.1170 Compiling brotli v8.0.4171 Compiling flume v0.12.0172 Compiling atoi v2.0.0173 Compiling darling v0.23.0174 Compiling futures-executor v0.3.33175 Compiling kasuari v0.4.12176 Compiling http-body-util v0.1.4177 Compiling libdeflate-sys v1.25.2178 Compiling lru v0.18.1179 Compiling hybrid-array v0.4.13180 Compiling num_threads v0.1.7181 Compiling sync_wrapper v1.0.2182 Compiling critical-section v1.2.0183 Compiling deranged v0.5.8184 Compiling radium v0.7.0185 Compiling objc2-encode v4.1.0186 Compiling compression-core v0.4.32187 Compiling atomic-waker v1.1.2188 Compiling httpdate v1.0.3189 Compiling subtle v2.6.1190 Compiling powerfmt v0.2.0191 Compiling indoc v2.0.7192 Compiling hyper v1.10.1193 Compiling time v0.3.53194 Compiling ratatui-core v0.1.2195 Compiling sqlx-sqlite v0.9.0196 Compiling derive_more-impl v2.1.1197 Compiling siphasher v1.0.3198 Compiling dotenvy v0.15.7199 Compiling utf8parse v0.2.2200 Compiling hex v0.4.3201 Compiling bytemuck v1.25.1202 Compiling ipnet v2.12.0203 Compiling tap v1.0.1204 Compiling sqlx-macros-core v0.9.0205 Compiling anstyle-parse v1.0.0206 Compiling wyz v0.5.1207 Compiling hyper-util v0.1.20208 Compiling phf_shared v0.12.1209 Compiling derive_more v2.1.1210 Compiling signal-hook-mio v0.2.5211 Compiling block-buffer v0.12.1212 Compiling crypto-common v0.2.2213 Compiling tower v0.5.3214 Compiling tokio-util v0.7.18215 Compiling iana-time-zone v0.1.65216 Compiling core-foundation v0.10.1217 Compiling security-framework-sys v2.17.0218 Compiling fdeflate v0.3.7219 Compiling line-clipping v0.3.7220 Compiling chrono-tz v0.10.4221 Compiling zune-core v0.5.1222 Compiling anstyle-query v1.1.5223 Compiling regex-syntax v0.8.11224 Compiling is_terminal_polyfill v1.70.2225 Compiling weezl v0.1.12226 Compiling byteorder-lite v0.1.0227 Compiling anyhow v1.0.103228 Compiling pxfm v0.1.30229 Compiling color_quant v1.1.0230 Compiling const-oid v0.10.2231 Compiling colorchoice v1.0.5232 Compiling quick-error v2.0.1233 Compiling funty v2.0.0234 Compiling anstyle v1.0.14235 Compiling image-webp v0.2.4236 Compiling anstream v1.0.0237 Compiling regex-automata v0.4.16238 Compiling bitvec v1.1.1239 Compiling digest v0.11.3240 Compiling gif v0.14.2241 Compiling moxcms v0.7.11242 Compiling zune-jpeg v0.5.15243 Compiling png v0.18.1244 Compiling ratatui-widgets v0.3.2245 Compiling security-framework v3.7.0246 Compiling libdeflater v1.25.2247 Compiling chrono v0.4.45248 Compiling sqlx-macros v0.9.0249 Compiling crossterm v0.29.0 (https://github.com/raine/crossterm?rev=f99eeae405e28fa8cb353a6c6e36c493e72891bd#f99eeae4)250 Compiling phf v0.12.1251 Compiling rgb v0.8.53252 Compiling zstd v0.13.3253 Compiling block2 v0.6.2254 Compiling compression-codecs v0.4.38255 Compiling objc2-core-foundation v0.3.2256 Compiling xattr v1.6.1257 Compiling async-compression v0.4.42258 Compiling mac-notification-sys v0.6.15259 Compiling cpufeatures v0.3.0260 Compiling filetime v0.2.29261 Compiling lazy_static v1.5.0262 Compiling option-ext v0.2.0263 Compiling pulldown-cmark v0.13.4264 Compiling mime v0.3.17265 Compiling clap_lex v1.1.0266 Compiling aven-core v0.1.32 (/nix/var/nix/builds/nix-37931-932002788/aven/crates/aven-core)267 Compiling fastrand v2.4.1268 Compiling rustc-hash v2.1.3269 Compiling oxipng v10.1.1270 Compiling tempfile v3.27.0271 Compiling clap_builder v4.6.2272 Compiling axum-core v0.5.6273 Compiling dirs-sys v0.5.0274 Compiling sharded-slab v0.1.7275 Compiling objc2-foundation v0.3.2276 Compiling tar v0.4.46277 Compiling sha2 v0.11.0278 Compiling tower-http v0.6.11279 Compiling ratatui-crossterm v0.1.2280 Compiling image v0.25.9281 Compiling ratatui-macros v0.7.2282 Compiling matchers v0.2.0283 Compiling uuid v1.24.0284 Compiling getopts v0.2.24285 Compiling serde_urlencoded v0.7.1286 Compiling clap_derive v4.6.1287 Compiling serde_path_to_error v0.1.20288 Compiling tracing-log v0.2.0289 Compiling thread_local v1.1.10290 Compiling pulldown-cmark-escape v0.11.0291 Compiling unsafe-libyaml v0.2.11292 Compiling nu-ansi-term v0.50.3293 Compiling matchit v0.8.4294 Compiling unicase v2.9.0295 Compiling serde_yaml v0.9.34+deprecated296 Compiling axum v0.8.9297 Compiling tracing-subscriber v0.3.23298 Compiling clap v4.6.2299 Compiling ratatui v0.30.2300 Compiling dirs v6.0.0301 Compiling tower-http v0.7.0302 Compiling semver v1.0.28303 Compiling similar v3.1.1304 Compiling qrcode v0.14.1305 Compiling sqlx v0.9.0306 Compiling rustls-webpki v0.103.15307 Compiling tokio-rustls v0.26.4308 Compiling rustls-platform-verifier v0.7.0309 Compiling hyper-rustls v0.27.9310 Compiling reqwest v0.13.4311 Compiling aven v0.1.44 (/nix/var/nix/builds/nix-37931-932002788/aven)312 Finished `release` profile [optimized] target(s) in 2m 22s313Executing cargoInstallPostBuildHook314Finished cargoInstallPostBuildHook315Finished cargoBuildHook316buildPhase completed in 2 minutes 23 secondscheckPhase
317Executing cargoCheckHook318cargoCheckHook flags: -j 10 --target aarch64-apple-darwin --offline -- --skip=local_calendar_dates_use_offsets_across_daylight_saving_boundaries --test-threads=1 --skip=tui::app::tests::custom_commands319 Compiling libc v0.2.186320 Compiling proc-macro2 v1.0.106321 Compiling unicode-ident v1.0.24322 Compiling quote v1.0.46323 Compiling find-msvc-tools v0.1.9324 Compiling shlex v2.0.1325 Compiling pkg-config v0.3.33326 Compiling cfg-if v1.0.4327 Compiling log v0.4.33328 Compiling serde v1.0.228329 Compiling pin-project-lite v0.2.17330 Compiling serde_core v1.0.228331 Compiling bitflags v2.13.1332 Compiling futures-core v0.3.33333 Compiling itoa v1.0.18334 Compiling icu_normalizer_data v2.2.0335 Compiling icu_properties_data v2.2.0336 Compiling bytes v1.12.1337 Compiling version_check v0.9.5338 Compiling smallvec v1.15.2339 Compiling parking_lot_core v0.9.12340 Compiling stable_deref_trait v1.2.1341 Compiling once_cell v1.21.4342 Compiling thiserror v2.0.18343 Compiling generic-array v0.14.9344 Compiling crossbeam-utils v0.8.22345 Compiling autocfg v1.5.1346 Compiling foldhash v0.2.0347 Compiling memchr v2.8.3348 Compiling equivalent v1.0.2349 Compiling allocator-api2 v0.2.21350 Compiling futures-sink v0.3.33351 Compiling tracing-core v0.1.36352 Compiling typenum v1.20.1353 Compiling litemap v0.8.2354 Compiling hashbrown v0.17.1355 Compiling writeable v0.6.3356 Compiling syn v2.0.119357 Compiling jobserver v0.1.35358 Compiling errno v0.3.14359 Compiling mio v1.2.2360 Compiling socket2 v0.6.5361 Compiling signal-hook-registry v1.4.8362 Compiling percent-encoding v2.3.2363 Compiling cc v1.3.0364 Compiling heck v0.5.0365 Compiling utf8_iter v1.0.4366 Compiling dunce v1.0.5367 Compiling futures-io v0.3.33368 Compiling fs_extra v1.3.0369 Compiling slab v0.4.12370 Compiling scopeguard v1.2.0371 Compiling futures-task v0.3.33372 Compiling vcpkg v0.2.15373 Compiling zmij v1.0.23374 Compiling lock_api v0.4.14375 Compiling hashbrown v0.16.1376 Compiling futures-util v0.3.33377 Compiling cmake v0.1.58378 Compiling crc32fast v1.5.0379 Compiling simd-adler32 v0.3.10380 Compiling num-traits v0.2.19381 Compiling http v1.4.2382 Compiling adler2 v2.0.1383 Compiling zstd-sys v2.0.16+zstd.1.5.7384 Compiling aws-lc-sys v0.45.0385 Compiling miniz_oxide v0.8.9386 Compiling http-body v1.1.0387 Compiling form_urlencoded v1.2.2388 Compiling rustix v1.1.4389 Compiling ryu v1.0.23390 Compiling aws-lc-rs v1.18.1391 Compiling core-foundation-sys v0.8.7392 Compiling rustversion v1.0.23393 Compiling zstd-safe v7.2.4394 Compiling synstructure v0.13.2395 Compiling parking_lot v0.12.5396 Compiling flate2 v1.1.9397 Compiling crypto-common v0.1.6398 Compiling block-buffer v0.10.4399 Compiling futures-channel v0.3.33400 Compiling alloc-no-stdlib v2.0.4401 Compiling strsim v0.11.1402 Compiling zeroize v1.9.0403 Compiling tower-service v0.3.3404 Compiling unicode-width v0.2.2405 Compiling base64 v0.22.1406 Compiling ident_case v1.0.1407 Compiling darling_core v0.23.0408 Compiling alloc-stdlib v0.2.4409 Compiling tokio v1.52.3410 Compiling digest v0.10.7411 Compiling concurrent-queue v2.5.0412 Compiling libsqlite3-sys v0.37.0413 Compiling cpufeatures v0.2.17414 Compiling httparse v1.10.1415 Compiling crc-catalog v2.5.0416 Compiling parking v2.2.1417 Compiling event-listener v5.4.1418 Compiling zerofrom-derive v0.1.7419 Compiling yoke-derive v0.8.2420 Compiling zerovec-derive v0.11.3421 Compiling displaydoc v0.2.6422 Compiling serde_derive v1.0.228423 Compiling tracing-attributes v0.1.31424 Compiling tokio-macros v2.7.1425 Compiling thiserror-impl v2.0.18426 Compiling indexmap v2.14.0427 Compiling zerofrom v0.1.8428 Compiling darling_macro v0.23.0429 Compiling yoke v0.8.3430 Compiling zerovec v0.11.6431 Compiling zerotrie v0.2.4432 Compiling tracing v0.1.44433 Compiling tinystr v0.8.3434 Compiling icu_locale_core v2.2.0435 Compiling potential_utf v0.1.5436 Compiling icu_collections v2.2.0437 Compiling tokio-stream v0.1.18438 Compiling icu_provider v2.2.0439 Compiling icu_properties v2.2.0440 Compiling icu_normalizer v2.2.0441 Compiling strum_macros v0.28.0442 Compiling crc v3.4.0443 Compiling castaway v0.2.4444 Compiling either v1.16.0445 Compiling sha2 v0.10.9446 Compiling idna_adapter v1.2.2447 Compiling itertools v0.14.0448 Compiling idna v1.1.0449 Compiling futures-intrusive v0.5.0450 Compiling url v2.5.8451 Compiling hashlink v0.11.1452 Compiling brotli-decompressor v5.0.3453 Compiling rustls-pki-types v1.15.0454 Compiling crossbeam-queue v0.3.13455 Compiling spin v0.9.9456 Compiling unicode-segmentation v1.13.3457 Compiling serde_json v1.0.150458 Compiling num-conv v0.2.2459 Compiling time-core v0.1.9460 Compiling signal-hook v0.3.18461 Compiling rustls v0.23.45462 Compiling instability v0.3.12463 Compiling objc2 v0.6.4464 Compiling untrusted v0.9.0465 Compiling static_assertions v1.1.0466 Compiling try-lock v0.2.5467 Compiling getrandom v0.4.3468 Compiling tower-layer v0.3.3469 Compiling want v0.3.1470 Compiling compact_str v0.9.1471 Compiling convert_case v0.10.0472 Compiling time-macros v0.2.31473 Compiling unicode-truncate v2.0.1474 Compiling sqlx-core v0.9.0475 Compiling brotli v8.0.4476 Compiling flume v0.12.0477 Compiling strum v0.28.0478 Compiling atoi v2.0.0479 Compiling kasuari v0.4.12480 Compiling darling v0.23.0481 Compiling futures-executor v0.3.33482 Compiling http-body-util v0.1.4483 Compiling libdeflate-sys v1.25.2484 Compiling lru v0.18.1485 Compiling hybrid-array v0.4.13486 Compiling num_threads v0.1.7487 Compiling sync_wrapper v1.0.2488 Compiling powerfmt v0.2.0489 Compiling critical-section v1.2.0490 Compiling atomic-waker v1.1.2491 Compiling indoc v2.0.7492 Compiling objc2-encode v4.1.0493 Compiling compression-core v0.4.32494 Compiling deranged v0.5.8495 Compiling httpdate v1.0.3496 Compiling radium v0.7.0497 Compiling subtle v2.6.1498 Compiling hyper v1.10.1499 Compiling sqlx-sqlite v0.9.0500 Compiling time v0.3.53501 Compiling ratatui-core v0.1.2502 Compiling derive_more-impl v2.1.1503 Compiling bytemuck v1.25.1504 Compiling hex v0.4.3505 Compiling ipnet v2.12.0506 Compiling utf8parse v0.2.2507 Compiling dotenvy v0.15.7508 Compiling siphasher v1.0.3509 Compiling tap v1.0.1510 Compiling phf_shared v0.12.1511 Compiling sqlx-macros-core v0.9.0512 Compiling wyz v0.5.1513 Compiling hyper-util v0.1.20514 Compiling anstyle-parse v1.0.0515 Compiling derive_more v2.1.1516 Compiling signal-hook-mio v0.2.5517 Compiling block-buffer v0.12.1518 Compiling crypto-common v0.2.2519 Compiling tower v0.5.3520 Compiling tokio-util v0.7.18521 Compiling core-foundation v0.10.1522 Compiling iana-time-zone v0.1.65523 Compiling security-framework-sys v2.17.0524 Compiling fdeflate v0.3.7525 Compiling line-clipping v0.3.7526 Compiling byteorder-lite v0.1.0527 Compiling regex-syntax v0.8.11528 Compiling anstyle-query v1.1.5529 Compiling const-oid v0.10.2530 Compiling colorchoice v1.0.5531 Compiling anyhow v1.0.103532 Compiling chrono-tz v0.10.4533 Compiling funty v2.0.0534 Compiling is_terminal_polyfill v1.70.2535 Compiling anstyle v1.0.14536 Compiling weezl v0.1.12537 Compiling color_quant v1.1.0538 Compiling zune-core v0.5.1539 Compiling quick-error v2.0.1540 Compiling pxfm v0.1.30541 Compiling image-webp v0.2.4542 Compiling zune-jpeg v0.5.15543 Compiling gif v0.14.2544 Compiling zstd v0.13.3545 Compiling bitvec v1.1.1546 Compiling compression-codecs v0.4.38547 Compiling regex-automata v0.4.16548 Compiling async-compression v0.4.42549 Compiling anstream v1.0.0550 Compiling digest v0.11.3551 Compiling libdeflater v1.25.2552 Compiling png v0.18.1553 Compiling ratatui-widgets v0.3.2554 Compiling security-framework v3.7.0555 Compiling sqlx-macros v0.9.0556 Compiling moxcms v0.7.11557 Compiling chrono v0.4.45558 Compiling crossterm v0.29.0 (https://github.com/raine/crossterm?rev=f99eeae405e28fa8cb353a6c6e36c493e72891bd#f99eeae4)559 Compiling phf v0.12.1560 Compiling rgb v0.8.53561 Compiling block2 v0.6.2562 Compiling objc2-core-foundation v0.3.2563 Compiling xattr v1.6.1564 Compiling mac-notification-sys v0.6.15565 Compiling cpufeatures v0.3.0566 Compiling filetime v0.2.29567 Compiling aven-core v0.1.32 (/nix/var/nix/builds/nix-37931-932002788/aven/crates/aven-core)568 Compiling mime v0.3.17569 Compiling pulldown-cmark v0.13.4570 Compiling option-ext v0.2.0571 Compiling lazy_static v1.5.0572 Compiling rustc-hash v2.1.3573 Compiling fastrand v2.4.1574 Compiling clap_lex v1.1.0575 Compiling oxipng v10.1.1576 Compiling sharded-slab v0.1.7577 Compiling tempfile v3.27.0578 Compiling objc2-foundation v0.3.2579 Compiling clap_builder v4.6.2580 Compiling axum-core v0.5.6581 Compiling dirs-sys v0.5.0582 Compiling tar v0.4.46583 Compiling ratatui-crossterm v0.1.2584 Compiling sha2 v0.11.0585 Compiling ratatui-macros v0.7.2586 Compiling sqlx v0.9.0587 Compiling matchers v0.2.0588 Compiling tower-http v0.6.11589 Compiling uuid v1.24.0590 Compiling serde_urlencoded v0.7.1591 Compiling clap_derive v4.6.1592 Compiling getopts v0.2.24593 Compiling serde_path_to_error v0.1.20594 Compiling tracing-log v0.2.0595 Compiling thread_local v1.1.10596 Compiling pulldown-cmark-escape v0.11.0597 Compiling nu-ansi-term v0.50.3598 Compiling unicase v2.9.0599 Compiling unsafe-libyaml v0.2.11600 Compiling matchit v0.8.4601 Compiling tracing-subscriber v0.3.23602 Compiling axum v0.8.9603 Compiling image v0.25.9604 Compiling clap v4.6.2605 Compiling serde_yaml v0.9.34+deprecated606 Compiling ratatui v0.30.2607 Compiling dirs v6.0.0608 Compiling tower-http v0.7.0609 Compiling semver v1.0.28610 Compiling similar v3.1.1611 Compiling qrcode v0.14.1612 Compiling rustls-webpki v0.103.15613 Compiling tokio-rustls v0.26.4614 Compiling rustls-platform-verifier v0.7.0615 Compiling hyper-rustls v0.27.9616 Compiling reqwest v0.13.4617 Compiling aven v0.1.44 (/nix/var/nix/builds/nix-37931-932002788/aven)618 Finished `test` profile [unoptimized + debuginfo] target(s) in 1m 58s619 Running unittests src/lib.rs (target/aarch64-apple-darwin/debug/deps/aven-c24ae597d3603916)620621running 1919 tests622test attachments::export::tests::selects_safe_image_extensions ... ok623test attachments::preview::tests::bounds_preview_dimensions ... ok624test attachments::preview::tests::creates_repeatable_disposable_preview ... ok625test attachments::preview::tests::materialization_enforces_preview_cache_quota ... ok626test attachments::preview::tests::missing_source_fails_without_creating_cache_entry ... ok627test cli::help::tests::help_rows_align_to_each_section_longest_command ... ok628test cli::tests::application_update_and_task_edit_are_distinct_commands ... ok629test cli::tests::complex_commands_keep_examples_and_safety_guidance ... ok630test cli::tests::conflict_resolve_parses_use_variant ... ok631test cli::tests::every_visible_command_renders_short_and_long_help ... ok632test cli::tests::internal_workspace_ids_are_validated_by_clap ... ok633test cli::tests::label_and_project_lists_parse_command_specific_arguments ... ok634test cli::tests::omitted_command_is_accepted_for_default_tui_launch ... ok635test cli::tests::result_limits_preserve_defaults_and_validate_explicit_values ... ok636test cli::tests::sync_existing_forms_parse ... ok637test cli::tests::sync_pair_parses_with_optional_server_positions ... ok638test cli::tests::top_level_help_sections_match_visible_commands ... ok639test cli::tests::tui_launch_arguments_compose_browse_state ... ok640test cli::tests::tui_launch_parses_all_typed_values ... ok641test cli::tests::tui_launch_parses_task_and_optional_project_value ... ok642test cli::tests::tui_launch_rejects_conflicting_targets_and_modes ... ok643test cli::tests::visible_command_tree_has_help_descriptions ... ok644test command_metadata::tests::demo_uses_tui_metadata ... ok645test commands::demo::tests::demo_directory_is_removed_after_session ... ok646test commands::demo::tests::demo_starts_fresh_each_time ... ok647test commands::demo::tests::invalid_relationship_key_fails_seed ... ok648test commands::demo::tests::seed_demo_creates_the_curated_dataset ... ok649test commands::demo::tests::seed_demo_preserves_relationships_and_populates_date_views ... ok650test commands::demo_data::tests::demo_dataset_has_the_intended_shape ... ok651test commands::demo_data::tests::demo_dataset_populates_current_tui_surfaces ... ok652test commands::pairing::tests::copy_confirmation_uses_bold_default_foreground_only_when_styled ... ok653test commands::pairing::tests::output_options_only_measure_and_style_real_terminals ... ok654test commands::pairing::tests::terminal_render_honors_width_and_style_modes ... ok655test commands::recurrence::tests::parses_the_fixed_rule_grammar ... ok656test config::custom_commands::tests::custom_tui_command_static_execution_settings_deserialize_with_compatible_defaults ... ok657test config::custom_commands::tests::custom_tui_command_success_policies_deserialize ... ok658test config::custom_commands::tests::custom_tui_command_target_policies_and_legacy_requirements_are_compatible ... ok659test config::custom_commands::tests::custom_tui_commands_deserialize_and_validate ... ok660test config::custom_commands::tests::custom_tui_commands_reject_blank_fields_and_non_stay_background_policies ... ok661test config::custom_commands::tests::custom_tui_commands_reject_invalid_environment_without_exposing_values ... ok662test config::custom_commands::tests::custom_tui_commands_reject_invalid_names_and_collisions ... ok663test config::custom_commands::tests::custom_tui_commands_reject_target_with_legacy_requires ... ok664test config::custom_commands::tests::custom_tui_commands_reject_unknown_fields_with_the_typo_location ... ok665test config::custom_commands::tests::custom_tui_commands_serialize_target_policy ... ok666test config::custom_commands::tests::custom_tui_commands_validate_contextual_keybindings ... ok667test config::custom_commands::tests::custom_tui_commands_validate_timeout_bounds ... ok668test config::paths::tests::database_flag_overrides_debug_environment_path ... ok669test config::paths::tests::debug_database_resolution_prefers_dev_environment_path ... ok670test config::paths::tests::debug_database_resolution_requires_an_explicit_path ... ok671test config::paths::tests::debug_database_resolution_uses_dev_environment_path ... ok672test config::paths::tests::release_database_resolution_ignores_dev_environment_path ... ok673test config::paths::tests::resolves_blob_dir_from_db_path_and_config ... ok674test config::paths::tests::sync_server_resolution_uses_flag_environment_then_config ... ok675test config::paths::tests::tilde_paths_expand_from_home ... ok676test config::tests::disabled_sync_reports_actionable_error ... ok677test config::tests::effective_sync_predicates_distinguish_opt_in_and_override ... ok678test config::tests::generated_client_config_omits_server_attachment_settings ... ok679test config::tests::generated_config_includes_sync_opt_in_without_inactive_override ... ok680test config::tests::local_image_optimization_defaults_to_off ... ok681test config::tests::local_inline_images_defaults_to_auto ... ok682test config::tests::project_override_workspace_ids_are_validated ... ok683test config::tests::runtime_disable_override_is_not_serialized ... ok684test config::tests::server_attachment_settings_remain_loadable_and_configurable ... ok685test config::tests::sync_disabled_flag_ignores_other_values ... ok686test config::tests::sync_disabled_flag_recognizes_true_values ... ok687test config::tests::sync_without_disable_override_is_allowed ... ok688test config::tests::update_automatic_checks_parse_from_config ... ok689test config::tests::update_check_environment_disable_takes_precedence ... ok690test config::tui::tests::column_config_rejects_duplicate_statuses ... ok691test config::tui::tests::column_config_rejects_empty_columns_and_names ... ok692test config::tui::tests::column_config_rejects_missing_statuses ... ok693test config::tui::tests::column_config_rejects_unknown_statuses ... ok694test config::tui::tests::compact_status_defaults_off_and_loads_under_the_table_settings ... ok695test config::tui::tests::custom_columns_load_in_configured_order ... ok696test config::tui::tests::default_columns_cover_every_status_once ... ok697test config::tui::tests::default_columns_round_trip ... ok698test config::tui::tests::due_column_is_opt_in_and_independent_of_the_time_column ... ok699test config::tui::tests::empty_config_uses_default_columns ... ok700test config::tui::tests::sidebar_views_default_to_existing_order ... ok701test config::tui::tests::sidebar_views_load_in_configured_order_and_support_empty_lists ... ok702test config::tui::tests::sidebar_views_reject_duplicates ... ok703test config::tui::tests::sidebar_views_reject_unknown_names ... ok704test config::tui::tests::table_columns_default_and_round_trip ... ok705test config::tui::tests::table_columns_reject_empty_duplicate_and_unknown_columns ... ok706test config::tui::tests::table_columns_reject_legacy_column_order_instead_of_ignoring_it ... ok707test config_edit::tests::scalar_edit_adds_missing_sections ... ok708test config_edit::tests::scalar_edit_preserves_comments_unrelated_settings_and_indentation ... ok709test config_edit::tests::scalar_edit_rejects_inline_mappings ... ok710test config_edit::tests::unsupported_managed_entries_fail_closed_for_all_path_edits ... ok711test daemon::service::tests::escapes_xml_text ... ok712test daemon::service::tests::extracts_program_from_plist_text ... ok713test daemon::service::tests::fresh_bootstrap_status_five_fails_without_retrying ... ok714test daemon::service::tests::program_from_plist_text_unescapes_xml ... ok715test daemon::service::tests::reload_bootstraps_an_absent_service_without_waiting ... ok716test daemon::service::tests::reload_bounds_status_five_retries ... ok717test daemon::service::tests::reload_bounds_the_bootout_wait ... ok718test daemon::service::tests::reload_retries_status_five_after_bootout ... ok719test daemon::service::tests::reload_waits_for_bootout_to_release_the_service ... ok720test daemon::service::tests::renders_daemon_plist ... ok721test daemon::service::tests::restart_uses_kickstart ... ok722test daemon::service::tests::service_runtime_distinguishes_running_loaded_and_absent ... ok723test daemon::service::tests::stable_program_path_prefers_matching_installed_path ... ok724test daemon::tests::binary_fingerprint_changes_when_file_changes ... ok725test daemon::tests::wake_if_enabled_sends_to_configured_address ... ok726test daemon::tests::wake_if_enabled_skips_invalid_address ... ok727test daemon::tests::wake_if_enabled_skips_when_sync_is_disabled ... ok728test due::tests::classifies_calendar_deadlines ... ok729test due::tests::scores_only_due_week_and_late_states ... ok730test logging::tests::formats_panic_location_with_line_and_column ... ok731test logging::tests::long_running_modes_use_stderr ... ok732test notification::tests::current_process_is_running ... ok733test notification::tests::exited_tui_sends_task_notification ... ok734test notification::tests::running_tui_suppresses_task_notification ... ok735test pairing::tests::pairing_errors_have_static_secret_safe_diagnostics ... ok736test pairing::tests::presentation_debug_omits_secrets_paths_and_qr_rows ... ok737test pairing::tests::qr_capacity_has_one_actionable_error ... ok738test pairing::tests::qr_rows_are_deterministic_and_include_the_quiet_zone ... ok739test pairing::tests::resolver_uses_precedence_and_classifies_blank_selected_inputs ... ok740test projects::tests::managed_path_mapping_drives_project_inference_and_can_be_removed ... ok741test projects::tests::override_precedence_uses_cwd_then_length_then_workspace_scope ... ok742test recurrence_input::tests::every_natural_label_parses_to_the_same_rule ... ok743test recurrence_input::tests::formats_rules_in_natural_language ... ok744test recurrence_input::tests::invalid_natural_rule_has_accessible_guidance ... ok745test recurrence_input::tests::parses_supported_natural_rule_variants ... ok746test routing::tests::explicit_workspace_bypasses_invalid_cwd ... ok747test routing::tests::snapshot_retains_loaded_config_cwd_and_discovered_git_root ... ok748test schedule_input::tests::formats_structured_schedules_as_editable_text ... ok749test schedule_input::tests::parses_one_off_and_recurring_schedules ... ok750test status::tests::compatibility_guidance_preserves_status_precedence ... ok751test status::tests::daemon_states_cover_healthy_missing_mismatched_and_unsupported ... ok752test status::tests::daemon_states_cover_stopped_and_invalid_configuration ... ok753test status::tests::server_identity_and_errors_withhold_secrets ... ok754test sync::client::render::tests::human_result_is_concise_when_up_to_date ... ok755test sync::client::render::tests::human_result_reports_transfers_and_remaining_work ... ok756test sync::client::render::tests::terminal_result_uses_color ... ok757test sync::client::tests::non_retryable_status_is_sent_once_and_records_a_safe_error ... ok758test sync::client::tests::request_timeout_is_a_transient_transport_failure ... ok759test sync::client::tests::retryable_status_replays_the_same_request ... ok760test sync::coordination::tests::lock_contends_and_releases ... ok761test sync::server::tests::bind_policy_enforces_guardrails ... ok762test sync::server::tests::classifies_bind_scope ... ok763test task_intake::tests::aborting_task_intake_terminates_command ... ok764test task_intake::tests::extracts_fenced_json ... ok765test task_render::tests::attachment_placeholders_describe_attachment_states ... ok766test task_render::tests::authored_markdown_closes_unfinished_fences ... ok767test task_render::tests::authored_markdown_stays_within_generated_heading_hierarchy ... ok768test task_render::tests::human_file_size_uses_binary_units ... ok769test task_render::tests::markdown_code_uses_safe_delimiters ... ok770test tests::encodes_80_bit_ids_as_16_chars ... ok771test tests::normalizes_project_keys ... ok772test time_input::tests::accepts_common_weekday_abbreviations ... ok773test time_input::tests::due_input_clears_and_rejects_timed_or_invalid_dates ... ok774test time_input::tests::next_weekday_is_strictly_after_today ... ok775test time_input::tests::now_clears_availability ... ok776test time_input::tests::parses_compact_offsets_next_week_and_calendar_months ... ok777test time_input::tests::parses_due_calendar_expressions_without_timezones ... ok778test time_input::tests::parses_epoch_seconds_to_canonical_utc ... ok779test time_input::tests::parses_iso_date_as_start_of_supplied_local_day ... ok780test time_input::tests::parses_local_times_on_calendar_expressions ... ok781test time_input::tests::parses_relative_calendar_dates_with_fixed_clock_and_timezone ... ok782test time_input::tests::parses_timestamp_without_z_as_utc ... ok783test time_input::tests::presents_parser_guidance_without_internal_error_details ... ok784test time_input::tests::rejects_ambiguous_or_unsupported_expressions_with_guidance ... ok785test time_input::tests::validates_only_canonical_values ... ok786test tui::app::tests::attachment_paste::add_task_attachment_only_dismissal_confirms_and_discards_draft ... ok787test tui::app::tests::attachment_paste::add_task_paste_image_path_attaches_to_created_task_once ... ok788test tui::app::tests::attachment_paste::add_task_removing_draft_image_preserves_fields_without_database_or_sync_changes ... ok789test tui::app::tests::attachment_paste::attachment_preview_remove_can_be_cancelled ... ok790test tui::app::tests::attachment_paste::attachment_shutdown_finishes_commit_and_clears_pending_state ... ok791test tui::app::tests::attachment_paste::background_database_failure_cleans_staged_content ... ok792test tui::app::tests::attachment_paste::concurrent_pastes_keep_paste_order ... ok793test tui::app::tests::attachment_paste::detail_paste_failure_stays_visible_without_metadata ... ok794test tui::app::tests::attachment_paste::detail_paste_image_path_attaches_to_selected_task ... ok795test tui::app::tests::attachment_paste::detail_paste_image_path_ignores_existing_image ... ok796test tui::app::tests::attachment_paste::detail_paste_image_path_obeys_optimization_config ... ok797test tui::app::tests::attachment_paste::detail_paste_keeps_target_across_refresh_and_task_switch ... ok798test tui::app::tests::attachment_paste::detail_paste_optimizes_asynchronously_when_enabled ... ok799test tui::app::tests::attachment_paste::failed_attachment_task_submission_preserves_composer_for_retry ... ok800test tui::app::tests::attachment_paste::failed_epic_child_attachment_submission_retains_owned_origin_for_retry ... ok801test tui::app::tests::attachment_paste::focused_attachment_reports_task_commands_as_unavailable ... ok802test tui::app::tests::attachment_paste::focused_detail_image_can_be_removed_after_confirmation ... ok803test tui::app::tests::attachment_paste::natural_add_epic_child_uses_authoring_origin ... ok804test tui::app::tests::attachment_paste::natural_add_paste_image_path_carries_attachment_into_created_task ... ok805test tui::app::tests::attachment_paste::removing_focused_attachment_selects_the_next_attachment ... ok806test tui::app::tests::attachment_paste::rolled_back_attachment_task_is_retained_for_retry ... ok807test tui::app::tests::attachment_save::attachment_save_can_be_cancelled ... ok808test tui::app::tests::attachment_save::attachment_save_defaults_to_safe_metadata_filename ... ok809test tui::app::tests::attachment_save::attachment_save_refuses_destination_collision ... ok810test tui::app::tests::attachment_save::attachment_save_reports_destination_errors_for_retry ... ok811test tui::app::tests::attachment_save::attachment_save_reports_missing_blob ... ok812test tui::app::tests::attachment_save::attachment_save_reports_write_errors_for_retry ... ok813test tui::app::tests::attachment_save::attachment_save_writes_bytes_and_reports_destination ... ok814test tui::app::tests::attachment_save::cold_attachment_save_rejects_missing_blob_before_destination_prompt ... ok815test tui::app::tests::attachment_save::colon_dispatch_opens_captured_attachment_panel ... ok816test tui::app::tests::attachment_save::command_palette_exposes_and_runs_attachment_save ... ok817test tui::app::tests::attachment_save::direct_attachment_save_resolution_requires_captured_bytes ... ok818test tui::app::tests::authoring::add_note_alias_requires_selected_task ... ok819test tui::app::tests::authoring::add_note_discard_confirmation_preserves_and_discards_draft ... ok820test tui::app::tests::authoring::add_note_flow_creates_note_for_selected_task ... ok821test tui::app::tests::authoring::add_note_rejects_multiple_marked_tasks ... ok822test tui::app::tests::authoring::add_note_requires_selected_task ... ok823test tui::app::tests::authoring::add_note_targets_one_marked_task_instead_of_cursor ... ok824test tui::app::tests::authoring::add_task_alias_creates_task_after_title ... ok825test tui::app::tests::authoring::add_task_arrow_keys_navigate_visible_fields ... ok826test tui::app::tests::authoring::add_task_blank_title_is_rejected ... ok827test tui::app::tests::authoring::add_task_caret_follows_wide_characters ... ok828test tui::app::tests::authoring::add_task_composer_creates_epic_container ... ok829test tui::app::tests::authoring::add_task_composer_preserves_ambiguous_availability ... ok830test tui::app::tests::authoring::add_task_composer_preserves_availability_and_due_date ... ok831test tui::app::tests::authoring::add_task_composer_sets_fuzzy_availability ... ok832test tui::app::tests::authoring::add_task_ctrl_a_moves_title_cursor_to_start ... ok833test tui::app::tests::authoring::add_task_ctrl_n_creates_task_in_background_in_full_tui ... ok834test tui::app::tests::authoring::add_task_ctrl_n_from_description_runs_in_background ... ok835test tui::app::tests::authoring::add_task_ctrl_u_clears_title_before_cursor ... ok836test tui::app::tests::authoring::add_task_ctrl_w_deletes_previous_title_word ... ok837test tui::app::tests::authoring::add_task_description_ctrl_e_moves_to_line_end ... ok838test tui::app::tests::authoring::add_task_description_ctrl_x_ctrl_e_opens_external_editor_and_returns_to_composer ... ok839test tui::app::tests::authoring::add_task_description_ctrl_x_non_editor_key_clears_prefix_and_edits_text ... ok840test tui::app::tests::authoring::add_task_description_flow_creates_task_with_description ... ok841test tui::app::tests::authoring::add_task_enter_opens_each_metadata_control ... ok842test tui::app::tests::authoring::add_task_every_four_weeks_uses_local_zone_and_recurring_default ... ok843test tui::app::tests::authoring::add_task_flow_cancels_at_title_step ... ok844test tui::app::tests::authoring::add_task_flow_configures_project_and_priority_from_title ... ok845test tui::app::tests::authoring::add_task_invalid_repeat_time_focuses_available_time ... ok846test tui::app::tests::authoring::add_task_label_draft_does_not_persist_before_task_creation ... ok847test tui::app::tests::authoring::add_task_labels_escape_returns_to_add_task_only_dialog ... ok848test tui::app::tests::authoring::add_task_labels_picker_sets_created_task_labels ... ok849test tui::app::tests::authoring::add_task_monthly_previews_and_persists_the_rule ... ok850test tui::app::tests::authoring::add_task_mouse_opens_metadata_and_focuses_text_fields ... ok851test tui::app::tests::authoring::add_task_natural_dialog_error_reopens_natural_dialog ... ok852test tui::app::tests::authoring::add_task_only_ctrl_n_exits_immediately ... ok853test tui::app::tests::authoring::add_task_only_natural_dialog_submit_exits_immediately ... ok854test tui::app::tests::authoring::add_task_only_natural_render_uses_popup_surface ... ok855test tui::app::tests::authoring::add_task_only_render_skips_normal_tui ... ok856test tui::app::tests::authoring::add_task_only_view_uses_popup_surface ... ok857test tui::app::tests::authoring::add_task_picker_escape_returns_to_add_task_only_dialog ... ok858test tui::app::tests::authoring::add_task_priority_hotkey_selects_direct_priority ... ok859test tui::app::tests::authoring::add_task_priority_picker_and_shortcut_share_status_derivation ... ok860test tui::app::tests::authoring::add_task_project_and_priority_return_to_description_step ... ok861test tui::app::tests::authoring::add_task_project_creation_cancel_restores_inference_selection ... ok862test tui::app::tests::authoring::add_task_project_creation_error_keeps_picker_filter_open ... ok863test tui::app::tests::authoring::add_task_project_picker_creates_and_selects_project ... ok864test tui::app::tests::authoring::add_task_recurring_preserves_each_explicit_open_status ... ok865test tui::app::tests::authoring::add_task_recurring_terminal_status_persists_nothing ... ok866test tui::app::tests::authoring::add_task_reports_title_caret_to_terminal_cursor ... ok867test tui::app::tests::authoring::add_task_schedule_enter_opens_structured_editor ... ok868test tui::app::tests::authoring::add_task_shortcut_opens_title_prompt ... ok869test tui::app::tests::authoring::add_task_start_view_keeps_main_surface ... ok870test tui::app::tests::authoring::add_task_status_hotkey_selects_direct_status ... ok871test tui::app::tests::authoring::add_task_status_picker_auto_restores_derived_status ... ok872test tui::app::tests::authoring::add_task_tab_opens_description_step ... ok873test tui::app::tests::authoring::add_task_template_preserves_frozen_schedule_identity ... ok874test tui::app::tests::authoring::add_task_title_scrolls_wide_characters_within_the_dialog ... ok875test tui::app::tests::authoring::add_task_uses_active_project_view ... ok876test tui::app::tests::authoring::automatic_refresh_preserves_visible_deleted_task_until_user_refresh ... ok877test tui::app::tests::authoring::automatic_refresh_surfaces_task_when_availability_arrives ... ok878test tui::app::tests::authoring::canceling_authoring_aborts_pending_task_intake ... ok879test tui::app::tests::authoring::cancelling_schedule_editor_restores_compact_composer_height ... ok880test tui::app::tests::authoring::create_more_precommit_failure_preserves_the_exact_draft ... ok881test tui::app::tests::authoring::create_more_preserves_derived_status_semantics ... ok882test tui::app::tests::authoring::create_more_refresh_failure_resets_committed_draft_without_duplication ... ok883test tui::app::tests::authoring::create_more_reopens_blank_composer_with_retained_defaults ... ok884test tui::app::tests::authoring::ctrl_g_creates_and_reopens_the_composer ... ok885test tui::app::tests::authoring::direct_task_start_opens_selected_detail_without_history ... ok886test tui::app::tests::authoring::direct_task_start_rejects_a_missing_loaded_target ... ok887test tui::app::tests::authoring::edit_epic_picker_keeps_container_with_children ... ok888test tui::app::tests::authoring::edit_epic_picker_toggles_container_state ... ok889test tui::app::tests::authoring::finished_attachment_task_intake_closes_composer ... ok890test tui::app::tests::authoring::finished_task_intake_poll_requests_redraw ... ok891test tui::app::tests::authoring::idle_poll_timeout_uses_refresh_deadline ... ok892test tui::app::tests::authoring::loading_poll_timeout_uses_spinner_cadence ... ok893test tui::app::tests::authoring::non_task_recent_action_reports_missing_task_identity ... ok894test tui::app::tests::authoring::recent_action_detail_returns_to_the_selected_action ... ok895test tui::app::tests::authoring::recent_action_opens_its_task_detail ... ok896test tui::app::tests::authoring::recent_actions_mouse_click_selects_row ... ok897test tui::app::tests::authoring::recent_actions_start_selects_the_first_action ... ok898test tui::app::tests::authoring::recurrence_due_control_cycles_each_policy ... ok899test tui::app::tests::authoring::recurring_creation_inherits_metadata_and_committed_refresh_failure_closes_draft ... ok900test tui::app::tests::authoring::recurring_creation_without_inferred_project_preserves_the_draft ... ok901test tui::app::tests::authoring::refresh_attempt_schedules_next_deadline ... ok902test tui::app::tests::authoring::refresh_preserves_recent_action_selection ... ok903test tui::app::tests::authoring::successful_mutation_adds_undo_toast_action ... ok904test tui::app::tests::authoring::toast_expiry_clears_message_once ... ok905test tui::app::tests::authoring::unavailable_recent_action_task_reports_feedback ... ok906test tui::app::tests::authoring::unfinished_task_intake_poll_does_not_request_redraw ... ok907test tui::app::tests::command_and_config_overlays::batch_editing::begin_delete_task_confirms_marked_tasks_when_tasks_are_marked ... ok908test tui::app::tests::command_and_config_overlays::batch_editing::cancelling_priority_footer_preserves_existing_values ... ok909test tui::app::tests::command_and_config_overlays::batch_editing::clearing_marked_due_dates_requires_confirmation ... ok910test tui::app::tests::command_and_config_overlays::batch_editing::command_palette_captures_bulk_scope_and_single_target_limits ... ok911test tui::app::tests::command_and_config_overlays::batch_editing::edit_labels_shortcut_uses_one_mark_as_single_task_scope ... ok912test tui::app::tests::command_and_config_overlays::batch_editing::edit_labels_shortcut_uses_selected_task_without_marks ... ok913test tui::app::tests::command_and_config_overlays::batch_editing::empty_project_retry_keeps_captured_targets ... ok914test tui::app::tests::command_and_config_overlays::batch_editing::mixed_marked_due_dates_keep_then_set_and_undo_as_one_batch ... ok915test tui::app::tests::command_and_config_overlays::batch_editing::priority_footer_applies_only_to_captured_marked_tasks ... ok916test tui::app::tests::command_and_config_overlays::batch_editing::priority_footer_failure_restores_captured_selector_for_retry ... ok917test tui::app::tests::command_and_config_overlays::batch_editing::priority_footer_handles_mixed_existing_priorities ... ok918test tui::app::tests::command_and_config_overlays::batch_editing::priority_shortcut_uses_footer_chooser_for_marked_tasks ... ok919test tui::app::tests::command_and_config_overlays::batch_editing::project_edit_keeps_captured_targets_and_anchor_across_refresh ... ok920test tui::app::tests::command_and_config_overlays::batch_editing::project_edit_records_moved_task_for_detail_recall ... ok921test tui::app::tests::command_and_config_overlays::batch_editing::status_shortcut_uses_footer_chooser_for_marked_tasks_with_undo ... ok922test tui::app::tests::command_and_config_overlays::batch_editing::status_shortcut_uses_footer_chooser_for_unmarked_task ... ok923test tui::app::tests::command_and_config_overlays::batch_editing::submit_edit_labels_multi_updates_only_marked_tasks ... ok924test tui::app::tests::command_and_config_overlays::batch_editing::submit_edit_project_updates_only_marked_tasks ... ok925test tui::app::tests::command_and_config_overlays::batch_editing::update_deleted_updates_only_marked_tasks ... ok926test tui::app::tests::command_and_config_overlays::command_palette::captured_delete_prompt_and_intent_keep_the_same_task_after_cursor_change ... ok927test tui::app::tests::command_and_config_overlays::command_palette::captured_sidebar_project_is_selected_for_rename_picker ... ok928test tui::app::tests::command_and_config_overlays::command_palette::colon_dispatch_opens_contextual_panel_for_marked_tasks ... ok929test tui::app::tests::command_and_config_overlays::command_palette::colon_dispatch_opens_contextual_panel_for_parent_detail ... ok930test tui::app::tests::command_and_config_overlays::command_palette::colon_dispatch_opens_contextual_panel_for_selected_task ... ok931test tui::app::tests::command_and_config_overlays::command_palette::colon_dispatch_opens_contextual_panels_for_sidebar_targets ... ok932test tui::app::tests::command_and_config_overlays::command_palette::command_overlay_arrow_selection_wraps ... ok933test tui::app::tests::command_and_config_overlays::command_palette::command_overlay_arrows_browse_and_enter_runs_selection ... ok934test tui::app::tests::command_and_config_overlays::command_palette::command_overlay_edit_resets_completion_cycle ... ok935test tui::app::tests::command_and_config_overlays::command_palette::command_overlay_executes_unique_lookup_and_keeps_overlay_on_errors ... ok936test tui::app::tests::command_and_config_overlays::command_palette::command_overlay_tab_completes_unique_suffix_alias ... ok937test tui::app::tests::command_and_config_overlays::command_palette::command_overlay_tab_cycles_ambiguous_matches ... ok938test tui::app::tests::command_and_config_overlays::command_palette::command_overlay_tab_cycles_from_exact_alias_match ... ok939test tui::app::tests::command_and_config_overlays::command_palette::command_overlay_tab_cycles_from_exact_command_match ... ok940test tui::app::tests::command_and_config_overlays::command_palette::command_overlay_tab_cycles_without_a_filter ... ok941test tui::app::tests::command_and_config_overlays::command_palette::command_overlay_tab_selects_first_partial_command_match ... ok942test tui::app::tests::command_and_config_overlays::command_palette::command_palette_opens_blocker_from_list_and_parent_detail ... ok943test tui::app::tests::command_and_config_overlays::command_palette::command_palette_selects_upcoming_view ... ok944test tui::app::tests::command_and_config_overlays::command_palette::command_panel_clears_stale_captured_marks_without_hydration ... ok945test tui::app::tests::command_and_config_overlays::command_palette::command_panel_keeps_captured_task_across_refresh_and_cursor_change ... ok946test tui::app::tests::command_and_config_overlays::command_palette::command_panel_rejects_missing_required_task_target ... ok947test tui::app::tests::command_and_config_overlays::command_palette::command_panel_rejects_stale_captured_task_without_cursor_fallback ... ok948test tui::app::tests::command_and_config_overlays::command_palette::command_project_picker_keeps_captured_marks_after_cursor_change ... ok949test tui::app::tests::command_and_config_overlays::command_palette::detail_command_overlay_can_complete_and_run_navigation_commands ... ok950test tui::app::tests::command_and_config_overlays::command_palette::detail_command_overlay_routes_supported_focused_task_actions ... ok951test tui::app::tests::command_and_config_overlays::command_palette::detail_command_panel_disables_list_only_filter_and_mark_commands ... ok952test tui::app::tests::command_and_config_overlays::command_palette::detail_exit_command_runs_through_key_dispatch ... ok953test tui::app::tests::command_and_config_overlays::command_palette::detail_scope_picker_exits_detail_before_retargeting ... ok954test tui::app::tests::command_and_config_overlays::command_palette::detail_workspace_picker_exits_detail_before_retargeting ... ok955test tui::app::tests::command_and_config_overlays::command_palette::every_ready_first_page_candidate_resolves_a_captured_target ... ok956test tui::app::tests::command_and_config_overlays::command_palette::exact_status_alias_opens_status_picker ... ok957test tui::app::tests::command_and_config_overlays::command_palette::layout_command_changes_presentation_without_changing_the_query ... ok958test tui::app::tests::command_and_config_overlays::command_palette::unavailable_typed_commands_keep_contextual_reasons_through_key_dispatch ... ok959test tui::app::tests::command_and_config_overlays::configuration::command_panel_runs_config_show ... ok960test tui::app::tests::command_and_config_overlays::configuration::command_panel_runs_database_stats ... ok961test tui::app::tests::command_and_config_overlays::configuration::command_panel_runs_workspace_switch ... ok962test tui::app::tests::command_and_config_overlays::configuration::config_info_opens_text_panel ... ok963test tui::app::tests::command_and_config_overlays::configuration::config_init_cancel_does_not_set_success_message ... ok964test tui::app::tests::command_and_config_overlays::configuration::config_init_requires_confirmation ... ok965test tui::app::tests::command_and_config_overlays::configuration::config_paths_opens_text_panel ... ok966test tui::app::tests::command_and_config_overlays::configuration::config_status_opens_sync_status ... ok967test tui::app::tests::command_and_config_overlays::configuration::database_stats_opens_text_panel ... ok968test tui::app::tests::command_and_config_overlays::configuration::help_key_opens_help_overlay ... ok969test tui::app::tests::command_and_config_overlays::configuration::sync_status_actions_keep_the_card_when_no_navigation_occurs ... ok970test tui::app::tests::command_and_config_overlays::configuration::sync_status_conflict_action_opens_conflicts_view ... ok971test tui::app::tests::command_and_config_overlays::configuration::toggle_help_closes_active_help_overlay ... ok972test tui::app::tests::command_and_config_overlays::pairing::command_panel_activates_safe_shared_pairing_presentation ... ok973test tui::app::tests::command_and_config_overlays::pairing::detail_surface_reports_pairing_as_list_only ... ok974test tui::app::tests::command_and_config_overlays::pairing::escape_closes_the_pairing_overlay ... ok975test tui::app::tests::command_and_config_overlays::pairing::invalid_and_loopback_servers_map_shared_secret_safe_errors ... ok976test tui::app::tests::command_and_config_overlays::pairing::missing_pairing_inputs_have_safe_disabled_reasons ... ok977test tui::app::tests::command_and_config_overlays::pairing::outside_click_clears_the_pairing_overlay ... ok978test tui::app::tests::command_and_config_overlays::pairing::oversized_invitation_maps_shared_capacity_error_safely ... ok979test tui::app::tests::command_and_config_overlays::search::search_overlay_allows_j_and_k_text_input ... ok980test tui::app::tests::command_and_config_overlays::search::search_overlay_cancel_aborts_active_preview ... ok981test tui::app::tests::command_and_config_overlays::search::search_overlay_ctrl_n_and_ctrl_p_select_results ... ok982test tui::app::tests::command_and_config_overlays::search::search_overlay_enter_does_not_open_stale_selected_detail ... ok983test tui::app::tests::command_and_config_overlays::search::search_overlay_enter_opens_selected_task_detail ... ok984test tui::app::tests::command_and_config_overlays::search::search_overlay_ignores_stale_preview_results ... ok985test tui::app::tests::command_and_config_overlays::search::search_overlay_keeps_input_immediate_while_preview_runs ... ok986test tui::app::tests::command_and_config_overlays::search::search_overlay_keeps_stale_results_when_input_changes ... ok987test tui::app::tests::command_and_config_overlays::search::search_overlay_marks_first_preview_as_stale_while_running ... ok988test tui::app::tests::command_and_config_overlays::search::search_overlay_paste_keeps_input_immediate_while_preview_runs ... ok989test tui::app::tests::command_and_config_overlays::search::search_overlay_refreshes_results_after_paste ... ok990test tui::app::tests::command_and_config_overlays::search::search_overlay_runs_latest_preview_after_input_changes ... ok991test tui::app::tests::command_and_config_overlays::search::search_overlay_shows_live_results_and_navigation ... ok992test tui::app::tests::command_and_config_overlays::search::search_overlay_tab_opens_results_list ... ok993test tui::app::tests::command_and_config_overlays::search::search_overlay_tab_submits_current_input_when_preview_lags ... ok994test tui::app::tests::command_and_config_overlays::search::search_overlay_whitespace_paste_clears_results ... ok995test tui::app::tests::command_and_config_overlays::search::search_replaces_existing_overlay ... ok996test tui::app::tests::configuration::constructor_applies_supplied_configuration_to_every_owner ... ok997test tui::app::tests::conflicts::accept_local_conflict_resolves_after_confirmation ... ok998test tui::app::tests::conflicts::accept_remote_conflict_resolves_after_confirmation ... ok999test tui::app::tests::conflicts::cancel_discards_conflict_intent ... ok1000test tui::app::tests::conflicts::changed_manual_description_conflict_merge_requires_discard_confirmation ... ok1001test tui::app::tests::conflicts::clean_manual_description_conflict_merge_cancels_without_confirmation ... ok1002test tui::app::tests::conflicts::conflict_list_shortcut_applies_conflicts_view ... ok1003test tui::app::tests::conflicts::conflict_next_selects_next_conflicted_task ... ok1004test tui::app::tests::conflicts::conflict_resolution_without_selected_task_reports_message ... ok1005test tui::app::tests::conflicts::conflict_show_opens_text_panel_and_esc_closes ... ok1006test tui::app::tests::conflicts::manual_conflict_merge_resolves_with_submitted_value ... ok1007test tui::app::tests::conflicts::manual_conflict_retry_preserves_submitted_text_after_error ... ok1008test tui::app::tests::delete_and_restore::add_project_path_picker_defaults_to_current_directory ... ok1009test tui::app::tests::delete_and_restore::cancel_delete_task_leaves_task_unchanged ... ok1010test tui::app::tests::delete_and_restore::command_project_picker_uses_captured_sidebar_project_after_focus_change ... ok1011test tui::app::tests::delete_and_restore::confirm_delete_task_soft_deletes_selected_task ... ok1012test tui::app::tests::delete_and_restore::delete_project_cancel_discards_intent ... ok1013test tui::app::tests::delete_and_restore::delete_project_confirmation_removes_selected_project ... ok1014test tui::app::tests::delete_and_restore::delete_project_opens_project_picker_from_task_focus ... ok1015test tui::app::tests::delete_and_restore::delete_project_picker_preselects_sidebar_project ... ok1016test tui::app::tests::delete_and_restore::delete_task_from_detail_returns_to_detail ... ok1017test tui::app::tests::delete_and_restore::delete_task_opens_confirmation_with_task_context ... ok1018test tui::app::tests::delete_and_restore::invalid_project_path_keeps_input_for_retry ... ok1019test tui::app::tests::delete_and_restore::project_path_picker_preselects_sidebar_project ... ok1020test tui::app::tests::delete_and_restore::remove_project_path_requires_confirmation ... ok1021test tui::app::tests::delete_and_restore::rename_project_cancel_returns_to_browse ... ok1022test tui::app::tests::delete_and_restore::rename_project_opens_project_picker_from_task_focus ... ok1023test tui::app::tests::delete_and_restore::rename_project_submission_updates_selected_project ... ok1024test tui::app::tests::detail_mode::attachments::attachment_preview_refresh_preserves_owning_task_across_query_change ... ok1025test tui::app::tests::detail_mode::attachments::changing_detail_task_clears_image_focus ... ok1026test tui::app::tests::detail_mode::attachments::detail_child_focus_order_includes_images_and_enter_opens_preview ... ok1027test tui::app::tests::detail_mode::attachments::detail_image_click_opens_preview_while_payload_is_loading ... ok1028test tui::app::tests::detail_mode::attachments::detail_image_escape_returns_and_preserves_focus ... ok1029test tui::app::tests::detail_mode::attachments::detail_keyboard_scroll_includes_framed_preview_rows ... ok1030test tui::app::tests::detail_mode::attachments::detail_tab_focuses_locally_available_images_independent_of_preview_state ... ok1031test tui::app::tests::detail_mode::attachments::dropped_external_export_releases_read_lease ... ok1032test tui::app::tests::detail_mode::attachments::duplicate_hash_click_requires_the_visible_attachment_identity ... ok1033test tui::app::tests::detail_mode::attachments::external_viewer_notification_keeps_inline_previews_enabled ... ok1034test tui::app::tests::detail_mode::attachments::external_viewer_reports_unavailable_bytes_and_launch_failures ... ok1035test tui::app::tests::detail_mode::attachments::full_screen_attachment_preview_switches_between_images ... ok1036test tui::app::tests::detail_mode::attachments::full_screen_preview_opens_current_image_externally ... ok1037test tui::app::tests::detail_mode::attachments::invalidated_image_focus_is_cleared_without_closing_detail ... ok1038test tui::app::tests::detail_mode::attachments::successful_external_export_holds_temp_file_until_app_cleanup ... ok1039test tui::app::tests::detail_mode::attachments::unsupported_terminal_enter_and_mouse_use_external_viewer ... ok1040test tui::app::tests::detail_mode::attachments::unsupported_terminal_focus_opens_highlighted_image_externally ... ok1041test tui::app::tests::detail_mode::editing::add_note_blank_body_from_detail_returns_to_detail ... ok1042test tui::app::tests::detail_mode::editing::add_note_from_detail_returns_to_detail ... ok1043test tui::app::tests::detail_mode::editing::availability_editor_keeps_invalid_input_open ... ok1044test tui::app::tests::detail_mode::editing::availability_editor_sets_task_from_task_list ... ok1045test tui::app::tests::detail_mode::editing::cancel_add_note_from_detail_returns_to_detail ... ok1046test tui::app::tests::detail_mode::editing::cancel_edit_title_from_detail_returns_to_detail ... ok1047test tui::app::tests::detail_mode::editing::committed_title_edit_refresh_failure_does_not_reopen_editor ... ok1048test tui::app::tests::detail_mode::editing::conflict_navigation_closes_detail_with_non_default_session_state ... ok1049test tui::app::tests::detail_mode::editing::detail_availability_editor_reschedules_and_clears_task ... ok1050test tui::app::tests::detail_mode::editing::detail_availability_mouse_click_opens_established_editor_for_unset_date ... ok1051test tui::app::tests::detail_mode::editing::detail_bare_status_and_priority_shortcuts_keep_detail ... ok1052test tui::app::tests::detail_mode::editing::detail_closes_when_status_change_removes_task_from_query ... ok1053test tui::app::tests::detail_mode::editing::detail_conflict_shortcut_opens_confirmation ... ok1054test tui::app::tests::detail_mode::editing::detail_copy_clicks_copy_displayed_values_and_show_toasts ... ok1055test tui::app::tests::detail_mode::editing::detail_delete_confirmation_names_selected_task_when_tasks_are_marked ... ok1056test tui::app::tests::detail_mode::editing::detail_done_shortcut_keeps_detail_and_sets_message ... ok1057test tui::app::tests::detail_mode::editing::detail_due_mouse_click_opens_established_editor_for_unset_date ... ok1058test tui::app::tests::detail_mode::editing::detail_edit_chords_open_advertised_editors ... ok1059test tui::app::tests::detail_mode::editing::detail_labels_mouse_click_opens_established_combobox_for_unset_labels ... ok1060test tui::app::tests::detail_mode::editing::detail_mutation_targets_selected_task_when_tasks_are_marked ... ok1061test tui::app::tests::detail_mode::editing::detail_prefix_hints_render_above_detail_overlay ... ok1062test tui::app::tests::detail_mode::editing::detail_priority_mouse_click_opens_menu_and_returns_to_detail ... ok1063test tui::app::tests::detail_mode::editing::detail_project_mouse_click_opens_established_picker ... ok1064test tui::app::tests::detail_mode::editing::detail_restore_shortcut_restores_deleted_task ... ok1065test tui::app::tests::detail_mode::editing::detail_shortcuts_do_not_leave_detail_before_opening_overlay ... ok1066test tui::app::tests::detail_mode::editing::detail_single_key_edit_shortcuts_still_work ... ok1067test tui::app::tests::detail_mode::editing::detail_status_menu_empty_click_returns_to_detail_without_selecting_task ... ok1068test tui::app::tests::detail_mode::editing::detail_status_mouse_click_opens_menu_and_returns_to_detail ... ok1069test tui::app::tests::detail_mode::editing::detail_status_picker_done_refreshes_content_and_metadata ... ok1070test tui::app::tests::detail_mode::editing::detail_toast_renders_above_detail_overlay ... ok1071test tui::app::tests::detail_mode::editing::detail_undo_after_status_menu_keeps_task_identity ... ok1072test tui::app::tests::detail_mode::editing::detail_undo_shortcut_reverts_last_mutation ... ok1073test tui::app::tests::detail_mode::editing::due_editor_sets_clears_and_undoes_deadline ... ok1074test tui::app::tests::detail_mode::editing::edit_title_from_detail_renders_inline_cursor ... ok1075test tui::app::tests::detail_mode::editing::ignored_keys_stay_in_detail ... ok1076test tui::app::tests::detail_mode::editing::invalid_detail_prefix_stays_in_detail ... ok1077test tui::app::tests::detail_mode::editing::leaving_detail_reconciles_deferred_task_with_active_view ... ok1078test tui::app::tests::detail_mode::editing::populated_add_note_from_detail_returns_after_confirmed_discard ... ok1079test tui::app::tests::detail_mode::editing::queue_status_change_preserves_viewport_row_and_recalls_changed_task ... ok1080test tui::app::tests::detail_mode::editing::recalling_filtered_status_change_returns_from_detail_to_queue_anchor ... ok1081test tui::app::tests::detail_mode::editing::submit_edit_title_from_detail_returns_to_detail ... ok1082test tui::app::tests::detail_mode::editing::task_list_availability_editor_clears_with_empty_input ... ok1083test tui::app::tests::detail_mode::history_navigation::detail_back_and_forward_round_trip_linked_task_state ... ok1084test tui::app::tests::detail_mode::history_navigation::detail_back_attachment_preview_escape_precedes_history ... ok1085test tui::app::tests::detail_mode::history_navigation::detail_back_cycle_unwinds_one_frame_per_escape ... ok1086test tui::app::tests::detail_mode::history_navigation::detail_back_escape_leaves_focus_before_popping_history ... ok1087test tui::app::tests::detail_mode::history_navigation::detail_back_escape_restores_parent_scroll_and_child_focus ... ok1088test tui::app::tests::detail_mode::history_navigation::detail_back_exhausted_unavailable_history_closes_detail ... ok1089test tui::app::tests::detail_mode::history_navigation::detail_back_q_closes_session_and_enter_keeps_root_open ... ok1090test tui::app::tests::detail_mode::history_navigation::detail_back_q_prevents_history_leaking_into_later_session ... ok1091test tui::app::tests::detail_mode::history_navigation::detail_back_refresh_preserves_usable_parent_history ... ok1092test tui::app::tests::detail_mode::history_navigation::detail_back_returns_from_epic_child_to_parent_detail ... ok1093test tui::app::tests::detail_mode::history_navigation::detail_back_root_escape_closes_direct_detail ... ok1094test tui::app::tests::detail_mode::history_navigation::detail_back_shortcut_works_while_attachment_is_focused ... ok1095test tui::app::tests::detail_mode::history_navigation::detail_back_skips_unavailable_history_entries ... ok1096test tui::app::tests::detail_mode::history_navigation::empty_detail_forward_keeps_detail_open ... ok1097test tui::app::tests::detail_mode::history_navigation::fresh_linked_navigation_after_back_clears_detail_forward_history ... ok1098test tui::app::tests::detail_mode::interaction::arrows_scroll_prefix_hint_overlay ... ok1099test tui::app::tests::detail_mode::interaction::back_shortcut_closes_detail_overlay ... ok1100test tui::app::tests::detail_mode::interaction::canceling_dirty_note_edit_preserves_persisted_body ... ok1101test tui::app::tests::detail_mode::interaction::clicking_detail_markdown_link_opens_browser ... ok1102test tui::app::tests::detail_mode::interaction::closing_detail_help_returns_to_detail_overlay ... ok1103test tui::app::tests::detail_mode::interaction::detail_drag_selects_rendered_text_and_coexists_with_scrolling ... ok1104test tui::app::tests::detail_mode::interaction::detail_mouse_wheel_clamps_detail_offset ... ok1105test tui::app::tests::detail_mode::interaction::detail_mouse_wheel_scrolls_conflict_text_panel ... ok1106test tui::app::tests::detail_mode::interaction::detail_mouse_wheel_updates_detail_offset ... ok1107test tui::app::tests::detail_mode::interaction::detail_routes_global_overlays_and_refresh ... ok1108test tui::app::tests::detail_mode::interaction::detail_scroll_keys_update_detail_offset ... ok1109test tui::app::tests::detail_mode::interaction::detail_scroll_resists_down_input_at_bottom ... ok1110test tui::app::tests::detail_mode::interaction::detail_tab_jumps_to_notes_below_viewport ... ok1111test tui::app::tests::detail_mode::interaction::detail_tab_remains_unchanged_when_notes_are_visible ... ok1112test tui::app::tests::detail_mode::interaction::focused_disclosure_reports_task_commands_as_unavailable ... ok1113test tui::app::tests::detail_mode::interaction::focused_note_delete_requires_confirmation_and_honors_cancellation ... ok1114test tui::app::tests::detail_mode::interaction::focused_note_edit_preserves_note_identity ... ok1115test tui::app::tests::detail_mode::interaction::gist_creation_failure_replaces_loading_notification ... ok1116test tui::app::tests::detail_mode::interaction::help_key_opens_detail_help_from_detail_overlay ... ok1117test tui::app::tests::detail_mode::interaction::modal_overlay_pointer_move_clears_stale_detail_hover ... ok1118test tui::app::tests::detail_mode::interaction::mouse_wheel_clamps_help_overlay ... ok1119test tui::app::tests::detail_mode::interaction::mouse_wheel_scrolls_detail_help_overlay ... ok1120test tui::app::tests::detail_mode::interaction::mouse_wheel_scrolls_help_overlay ... ok1121test tui::app::tests::detail_mode::interaction::mouse_wheel_scrolls_prefix_hint_overlay ... ok1122test tui::app::tests::detail_mode::interaction::q_closes_detail_overlay ... ok1123test tui::app::tests::detail_mode::interaction::rendered_disclosure_rebuilds_focus_and_scroll_from_expanded_document ... ok1124test tui::app::tests::detail_mode::interaction::second_help_key_returns_from_detail_help_to_detail_overlay ... ok1125test tui::app::tests::detail_mode::interaction::stable_frame_mouse_movement_reuses_detail_document ... ok1126test tui::app::tests::detail_mode::interaction::task_gist_shortcut_requires_publication_confirmation ... ok1127test tui::app::tests::detail_mode::navigation::deleted_linked_task_navigates_in_source_list_and_returns_to_parent ... ok1128test tui::app::tests::detail_mode::navigation::detail_lifecycle_preserves_parent_state_and_reopens_cleanly ... ok1129test tui::app::tests::detail_mode::navigation::detail_next_and_previous_task_stay_in_detail ... ok1130test tui::app::tests::detail_mode::navigation::detail_sibling_navigation_rebinds_when_the_summary_task_disappears ... ok1131test tui::app::tests::detail_mode::navigation::detail_tab_focuses_epic_children_and_j_k_selects_and_opens ... ok1132test tui::app::tests::detail_mode::navigation::focused_blocked_task_routes_status_picker_to_blocked_task ... ok1133test tui::app::tests::detail_mode::navigation::focused_blocker_routes_status_picker_to_blocker ... ok1134test tui::app::tests::detail_mode::navigation::focused_detail_missing_relationship_reports_unavailable_without_mutating_parent ... ok1135test tui::app::tests::detail_mode::navigation::focused_detail_policy_matches_target_section ... ok1136test tui::app::tests::detail_mode::navigation::focused_epic_parent_routes_status_picker_to_parent ... ok1137test tui::app::tests::detail_mode::navigation::go_to_blocker_ignores_downstream_blocks ... ok1138test tui::app::tests::detail_mode::navigation::go_to_blocker_opens_one_blocker_and_back_restores_filtered_source ... ok1139test tui::app::tests::detail_mode::navigation::go_to_blocker_picker_cancels_or_opens_selected_upstream_blocker ... ok1140test tui::app::tests::detail_mode::navigation::go_to_blocker_reports_no_upstream_blockers ... ok1141test tui::app::tests::detail_mode::navigation::hidden_linked_task_navigates_previous_and_next_in_source_list ... ok1142test tui::app::tests::detail_mode::navigation::in_filter_linked_task_uses_its_source_list_position_for_siblings ... ok1143test tui::app::tests::detail_mode::navigation::linked_task_opens_outside_active_list_filter ... ok1144test tui::app::tests::detail_mode::navigation::missing_linked_task_keeps_current_detail_open ... ok1145test tui::app::tests::detail_mode::navigation::opening_detail_rebinds_after_the_summary_task_disappears ... ok1146test tui::app::tests::detail_mode::navigation::unavailable_detail_history_keeps_current_task_open ... ok1147test tui::app::tests::detail_mode::relationships::canceling_new_epic_child_authoring_preserves_list_origin ... ok1148test tui::app::tests::detail_mode::relationships::canceling_new_epic_child_authoring_returns_to_detail_origin ... ok1149test tui::app::tests::detail_mode::relationships::canceling_ordinary_task_promotion_keeps_task_ordinary ... ok1150test tui::app::tests::detail_mode::relationships::colon_dispatch_opens_captured_dependency_relationship_panel ... ok1151test tui::app::tests::detail_mode::relationships::colon_dispatch_opens_captured_epic_child_panel_and_confirms_unlink ... ok1152test tui::app::tests::detail_mode::relationships::command_panel_add_related_keeps_the_captured_parent_task ... ok1153test tui::app::tests::detail_mode::relationships::command_panel_ranks_and_unlinks_the_captured_related_task ... ok1154test tui::app::tests::detail_mode::relationships::command_panel_rejects_dependency_removal_for_epic_child ... ok1155test tui::app::tests::detail_mode::relationships::command_panel_rejects_epic_removal_for_dependency_relationship ... ok1156test tui::app::tests::detail_mode::relationships::command_panel_targets_the_captured_epic_child_and_keeps_the_parent_anchor ... ok1157test tui::app::tests::detail_mode::relationships::command_panel_unlinks_captured_relationship_a_after_focus_moves_to_b ... ok1158test tui::app::tests::detail_mode::relationships::epic_child_confirmation_uses_captured_target_after_focus_changes ... ok1159test tui::app::tests::detail_mode::relationships::epic_child_search_applies_result_limit_within_parent_project ... ok1160test tui::app::tests::detail_mode::relationships::epic_child_search_tab_cycles_results ... ok1161test tui::app::tests::detail_mode::relationships::epic_detail_add_child_search_hides_other_projects ... ok1162test tui::app::tests::detail_mode::relationships::epic_detail_add_child_shortcut_opens_contextual_search ... ok1163test tui::app::tests::detail_mode::relationships::focused_blocked_task_unlink_requires_confirmation ... ok1164test tui::app::tests::detail_mode::relationships::focused_blocker_status_picker_targets_blocker ... ok1165test tui::app::tests::detail_mode::relationships::focused_detail_child_back_shortcut_uses_detail_navigation ... ok1166test tui::app::tests::detail_mode::relationships::focused_detail_child_removes_and_undo_restores_relationship ... ok1167test tui::app::tests::detail_mode::relationships::focused_detail_child_return_shortcut_targets_recent_change ... ok1168test tui::app::tests::detail_mode::relationships::focused_detail_child_routes_actions_and_preserves_parent_detail ... ok1169test tui::app::tests::detail_mode::relationships::focused_epic_parent_unlink_requires_confirmation ... ok1170test tui::app::tests::detail_mode::relationships::focused_only_related_removal_reconciles_to_another_detail_target ... ok1171test tui::app::tests::detail_mode::relationships::focused_related_last_removal_focuses_previous_row ... ok1172test tui::app::tests::detail_mode::relationships::focused_related_middle_removal_focuses_next_row ... ok1173test tui::app::tests::detail_mode::relationships::focused_relationship_delete_and_unsupported_actions_are_explicit ... ok1174test tui::app::tests::detail_mode::relationships::ordinary_task_add_child_confirms_promotion_and_links_child ... ok1175test tui::app::tests::detail_mode::relationships::parent_detail_child_remove_command_requires_confirmation ... ok1176test tui::app::tests::detail_mode::relationships::removing_first_of_six_children_keeps_disclosure_and_hidden_child_keyboard_reachable ... ok1177test tui::app::tests::detail_mode::relationships::removing_last_of_six_children_keeps_disclosure_keyboard_reachable ... ok1178test tui::app::tests::detail_mode::relationships::removing_middle_of_six_children_keeps_disclosure_and_hidden_child_keyboard_reachable ... ok1179test tui::app::tests::detail_mode::relationships::right_navigation_toggles_selected_epic ... ok1180test tui::app::tests::detail_mode::relationships::stale_detail_child_focus_is_cleared_before_shortcuts ... ok1181test tui::app::tests::detail_mode::relationships::submitting_new_epic_child_from_linked_detail_returns_to_epic ... ok1182test tui::app::tests::detail_mode::relationships::submitting_new_epic_child_uses_owned_origin_and_focuses_child ... ok1183test tui::app::tests::filters_and_workspaces::back_and_forward_shortcuts_round_trip_navigation_state ... ok1184test tui::app::tests::filters_and_workspaces::back_restores_list_selection ... ok1185test tui::app::tests::filters_and_workspaces::back_shortcut_reports_empty_history ... ok1186test tui::app::tests::filters_and_workspaces::back_shortcut_restores_filter_and_project_navigation ... ok1187test tui::app::tests::filters_and_workspaces::clear_filters_shortcut_resets_default_view_without_notification ... ok1188test tui::app::tests::filters_and_workspaces::done_view_shortcut_keeps_project_scope ... ok1189test tui::app::tests::filters_and_workspaces::filter_shortcuts_apply_label_status_priority_and_deleted ... ok1190test tui::app::tests::filters_and_workspaces::forward_shortcut_reports_empty_history ... ok1191test tui::app::tests::filters_and_workspaces::fresh_navigation_after_back_clears_forward_history ... ok1192test tui::app::tests::filters_and_workspaces::go_conflicts_shortcut_sets_conflicts_view ... ok1193test tui::app::tests::filters_and_workspaces::header_click_ignores_capturing_overlay ... ok1194test tui::app::tests::filters_and_workspaces::header_click_opens_order_menu_and_selects_order ... ok1195test tui::app::tests::filters_and_workspaces::header_click_opens_scope_menu_and_selects_scope ... ok1196test tui::app::tests::filters_and_workspaces::header_click_opens_sync_status ... ok1197test tui::app::tests::filters_and_workspaces::header_click_opens_view_menu_and_selects_view ... ok1198test tui::app::tests::filters_and_workspaces::header_click_opens_workspace_menu_when_more_than_two_are_available ... ok1199test tui::app::tests::filters_and_workspaces::header_click_switches_directly_when_two_workspaces_are_available ... ok1200test tui::app::tests::filters_and_workspaces::header_home_click_closes_detail_overlay ... ok1201test tui::app::tests::filters_and_workspaces::header_home_click_closes_picker_and_preserves_detail_underlay ... ok1202test tui::app::tests::filters_and_workspaces::header_metric_click_still_selects_view_directly ... ok1203test tui::app::tests::filters_and_workspaces::modal_overlay_mouse_does_not_reach_detail_underlay ... ok1204test tui::app::tests::filters_and_workspaces::mouse_movement_without_hover_state_skips_redraw ... ok1205test tui::app::tests::filters_and_workspaces::mouse_wheel_ignored_for_small_terminal ... ok1206test tui::app::tests::filters_and_workspaces::mouse_wheel_ignored_in_sidebar_focus ... ok1207test tui::app::tests::filters_and_workspaces::mouse_wheel_ignored_with_detail_underlay ... ok1208test tui::app::tests::filters_and_workspaces::mouse_wheel_ignored_with_overlay ... ok1209test tui::app::tests::filters_and_workspaces::mouse_wheel_moves_task_selection_down_and_up ... ok1210test tui::app::tests::filters_and_workspaces::mouse_wheel_stops_at_task_list_edges ... ok1211test tui::app::tests::filters_and_workspaces::picker_row_click_submits_clicked_row ... ok1212test tui::app::tests::filters_and_workspaces::picker_row_click_toggles_multi_select_row ... ok1213test tui::app::tests::filters_and_workspaces::refresh_reports_invalid_project_scope_fallback ... ok1214test tui::app::tests::filters_and_workspaces::scope_project_escape_cancels_from_filter ... ok1215test tui::app::tests::filters_and_workspaces::scope_project_shortcut_opens_project_picker ... ok1216test tui::app::tests::filters_and_workspaces::switch_workspace_accepts_direct_filtering_and_arrow_navigation ... ok1217test tui::app::tests::filters_and_workspaces::switch_workspace_changes_active_workspace ... ok1218test tui::app::tests::filters_and_workspaces::switch_workspace_escape_cancels_from_filter ... ok1219test tui::app::tests::filters_and_workspaces::switch_workspace_no_match_warns_and_reopens_filter ... ok1220test tui::app::tests::filters_and_workspaces::switch_workspace_shortcut_opens_picker ... ok1221test tui::app::tests::filters_and_workspaces::text_panel_mouse_scrolls_and_closes_outside ... ok1222test tui::app::tests::filters_and_workspaces::upcoming_view_shortcut_selects_upcoming ... ok1223test tui::app::tests::filters_and_workspaces::workspace_administration_cancellation_reports_the_canceled_flow ... ok1224test tui::app::tests::filters_and_workspaces::workspace_creation_validates_input_and_keeps_active_workspace ... ok1225test tui::app::tests::filters_and_workspaces::workspace_rename_targets_picker_choice_and_preserves_errors ... ok1226test tui::app::tests::keyboard_dispatch::add_task_alias_executes_immediately ... ok1227test tui::app::tests::keyboard_dispatch::captured_sidebar_detail_uses_the_captured_row ... ok1228test tui::app::tests::keyboard_dispatch::command_panel_runs_sidebar_toggle ... ok1229test tui::app::tests::keyboard_dispatch::created_order_shortcut_defaults_to_descending ... ok1230test tui::app::tests::keyboard_dispatch::ctrl_c_quits_from_normal_mode ... ok1231test tui::app::tests::keyboard_dispatch::ctrl_c_quits_while_overlay_captures_input ... ok1232test tui::app::tests::keyboard_dispatch::due_order_shortcut_sets_sort ... ok1233test tui::app::tests::keyboard_dispatch::esc_cancels_prefix_before_overlay ... ok1234test tui::app::tests::keyboard_dispatch::esc_closes_every_overlay_variant ... ok1235test tui::app::tests::keyboard_dispatch::escape_clears_marks_after_detail_and_overlay_precedence ... ok1236test tui::app::tests::keyboard_dispatch::external_editor_dispatch_preserves_description_note_and_fallback_state ... ok1237test tui::app::tests::keyboard_dispatch::h_and_l_move_between_sidebar_and_tasks ... ok1238test tui::app::tests::keyboard_dispatch::h_reveals_sidebar ... ok1239test tui::app::tests::keyboard_dispatch::hidden_sidebar_allows_wide_task_click_at_left_edge ... ok1240test tui::app::tests::keyboard_dispatch::hidden_sidebar_is_not_rendered_in_wide_layout ... ok1241test tui::app::tests::keyboard_dispatch::implemented_commands_execute_their_flows ... ok1242test tui::app::tests::keyboard_dispatch::invalid_continuation_shows_message ... ok1243test tui::app::tests::keyboard_dispatch::mark_shortcuts_update_task_marks ... ok1244test tui::app::tests::keyboard_dispatch::normal_dispatch_ignores_modified_shortcuts ... ok1245test tui::app::tests::keyboard_dispatch::order_reverse_shortcut_toggles_direction ... ok1246test tui::app::tests::keyboard_dispatch::order_shortcut_sets_sort ... ok1247test tui::app::tests::keyboard_dispatch::prefix_is_inactive_while_overlay_captures_input ... ok1248test tui::app::tests::keyboard_dispatch::prefix_key_enters_prefix_mode ... ok1249test tui::app::tests::keyboard_dispatch::sidebar_detail_command_is_available_without_a_selected_task ... ok1250test tui::app::tests::keyboard_dispatch::sidebar_enter_selects_a_view_with_no_tasks_in_the_current_view ... ok1251test tui::app::tests::keyboard_dispatch::sidebar_enter_selects_the_highlighted_project_scope ... ok1252test tui::app::tests::keyboard_dispatch::sidebar_enter_selects_the_highlighted_view ... ok1253test tui::app::tests::keyboard_dispatch::sidebar_enter_selects_the_highlighted_workspace_scope ... ok1254test tui::app::tests::keyboard_dispatch::sidebar_selection_survives_focus_changes ... ok1255test tui::app::tests::keyboard_dispatch::sidebar_toggle_shortcut_expands_task_list_and_restores_sidebar_focus ... ok1256test tui::app::tests::keyboard_dispatch::tab_reveals_sidebar_when_task_list_is_expanded ... ok1257test tui::app::tests::keyboard_dispatch::valid_continuation_executes_and_clears ... ok1258test tui::app::tests::metadata::metadata_blank_save_is_disabled_and_explicit_remove_supports_undo ... ok1259test tui::app::tests::metadata::metadata_discard_uses_explicit_y_and_preserves_input_on_n_or_escape ... ok1260test tui::app::tests::metadata::metadata_external_editor_failure_moves_and_restores_complete_captured_state ... ok1261test tui::app::tests::metadata::metadata_heading_activation_and_committed_failure_preserve_detail ... ok1262test tui::app::tests::metadata::metadata_heading_focus_keeps_advertised_edit_shortcut_available ... ok1263test tui::app::tests::metadata::metadata_mouse_and_focus_use_narrow_rendered_geometry ... ok1264test tui::app::tests::metadata::metadata_multiline_paste_becomes_read_only_and_editor_action_keeps_exact_text ... ok1265test tui::app::tests::metadata::metadata_single_line_enter_saves_and_external_editor_preserves_draft_baseline ... ok1266test tui::app::tests::metadata::metadata_validation_keeps_exact_input_cursor_and_cancel_requires_confirmation ... ok1267test tui::app::tests::metadata::renamed_field_keeps_input_and_requires_confirmed_retry ... ok1268test tui::app::tests::navigation::clearing_filters_restores_applicable_historical_identity ... ok1269test tui::app::tests::navigation::collapsed_sidebar_survives_refresh_view_and_project_scope_changes ... ok1270test tui::app::tests::navigation::compatible_query_transitions_follow_selected_task_identity ... ok1271test tui::app::tests::navigation::failed_query_transition_preserves_selection_and_navigation ... ok1272test tui::app::tests::navigation::hidden_views_remain_accessible_through_header_shortcut_and_palette ... ok1273test tui::app::tests::navigation::sidebar_click_selects_project_scope_in_wide_layout ... ok1274test tui::app::tests::navigation::sidebar_click_selects_saved_view_in_narrow_overlay ... ok1275test tui::app::tests::navigation::sidebar_click_uses_scroll_offset_in_wide_layout ... ok1276test tui::app::tests::navigation::sidebar_configuration_orders_rows_and_keeps_selection_on_target ... ok1277test tui::app::tests::navigation::sidebar_header_indicators_render_at_right_with_whole_row_targets ... ok1278test tui::app::tests::navigation::sidebar_heading_command_keeps_captured_section_identity ... ok1279test tui::app::tests::navigation::sidebar_load_failure_warns_and_defaults_to_expanded ... ok1280test tui::app::tests::navigation::sidebar_sections_collapse_independently_and_headers_expand_with_mouse ... ok1281test tui::app::tests::navigation::sidebar_sections_restore_on_reopen_and_expansion_persists ... ok1282test tui::app::tests::navigation::sidebar_transition_keeps_refresh_selected_task ... ok1283test tui::app::tests::navigation::sidebar_write_failure_warns_and_keeps_runtime_choice ... ok1284test tui::app::tests::navigation::task_list_page_keys_move_by_visible_page_and_half_page ... ok1285test tui::app::tests::navigation::task_list_page_navigation_clamps_at_boundaries ... ok1286test tui::app::tests::onboarding::automatic_welcome_completes_once ... ok1287test tui::app::tests::onboarding::changelog_command_starts_loading_release_notes_from_github ... ok1288test tui::app::tests::onboarding::changelog_link_click_opens_documentation_in_browser ... ok1289test tui::app::tests::onboarding::changelog_reader_supports_less_style_paging_and_close ... ok1290test tui::app::tests::onboarding::forced_welcome_uses_automatic_intro ... ok1291test tui::app::tests::onboarding::hidden_welcome_ignores_actions_and_modifiers ... ok1292test tui::app::tests::onboarding::update_review_supports_action_focus_and_later ... ok1293test tui::app::tests::onboarding::welcome_actions_open_the_first_use_flows ... ok1294test tui::app::tests::onboarding::welcome_command_is_discoverable ... ok1295test tui::app::tests::onboarding::welcome_quit_completes_but_control_c_does_not ... ok1296test tui::app::tests::onboarding::welcome_replay_does_not_complete_automatic_onboarding ... ok1297test tui::app::tests::recurrence::recurrence_actions_do_not_create_projects_for_deleted_template_project ... ok1298test tui::app::tests::recurrence::recurrence_creation_in_recurring_view_reports_filtered_series_and_preserves_selection ... ok1299test tui::app::tests::recurrence::recurrence_creation_in_recurring_view_selects_created_series ... ok1300test tui::app::tests::recurrence::recurrence_detail_restoration_accepts_matching_series_selection ... ok1301test tui::app::tests::recurrence::recurrence_history_enter_opens_the_linked_archived_task ... ok1302test tui::app::tests::recurrence::recurrence_history_pagination_replaces_the_resident_page ... ok1303test tui::app::tests::recurrence::recurrence_overlay_retains_series_identity_across_selection_change ... ok1304test tui::app::tests::recurrence::recurrence_palette_disables_invalid_lifecycle_action_with_reason ... ok1305test tui::app::tests::recurrence::recurrence_palette_disables_skip_for_historical_task_without_live_projection ... ok1306test tui::app::tests::recurrence::recurrence_palette_skip_uses_live_projection_after_historical_navigation ... ok1307test tui::app::tests::recurrence::recurrence_pause_resume_journey_preserves_selection_and_occurrence ... ok1308test tui::app::tests::recurrence::recurrence_series_detail_keeps_status_and_stop_shortcuts_distinct ... ok1309test tui::app::tests::recurrence::recurrence_series_detail_restores_after_lifecycle_history_and_stop_round_trips ... ok1310test tui::app::tests::recurrence::recurrence_series_detail_return_survives_intermediate_back_navigation ... ok1311test tui::app::tests::recurrence::recurrence_stop_journey_persists_keep_skip_and_cancel ... ok1312test tui::app::tests::recurrence::recurrence_stop_rejects_invalid_picker_value ... ok1313test tui::app::tests::recurrence::recurrence_template_update_restores_series_identity_after_reordering ... ok1314test tui::app::tests::recurrence::recurring_lifecycle_filter_change_does_not_notify ... ok1315test tui::app::tests::recurrence::recurring_series_delete_guides_to_confirmed_stop ... ok1316test tui::app::tests::recurrence::recurring_series_detail_opens_hidden_occurrence_and_returns ... ok1317test tui::app::tests::recurrence::recurring_series_lifecycle_filter_reveals_stopped_series ... ok1318test tui::app::tests::recurrence::recurring_series_list_and_detail_use_compact_natural_language ... ok1319test tui::app::tests::recurrence::recurring_series_rows_copy_series_ref_and_edit_template ... ok1320test tui::app::tests::recurrence::recurring_series_rows_route_task_commands_to_series_feedback ... ok1321test tui::app::tests::sync::sync_now_completes_without_daemon ... ok1322test tui::app::tests::sync::sync_now_reports_unavailable_server ... ok1323test tui::app::tests::sync::sync_now_requires_configured_server ... ok1324test tui::app::tests::task_editing::add_label_shortcut_opens_prompt_and_creates_label ... ok1325test tui::app::tests::task_editing::add_note_blank_body_is_rejected ... ok1326test tui::app::tests::task_editing::add_project_shortcut_opens_prompt_and_creates_project ... ok1327test tui::app::tests::task_editing::changed_description_edit_requires_discard_confirmation ... ok1328test tui::app::tests::task_editing::clean_description_edit_cancels_without_confirmation ... ok1329test tui::app::tests::task_editing::copy_requires_selected_task ... ok1330test tui::app::tests::task_editing::copying_empty_task_description_shows_info ... ok1331test tui::app::tests::task_editing::copying_task_without_notes_shows_info ... ok1332test tui::app::tests::task_editing::detail_copy_hotkeys_copy_task_text_and_show_feedback ... ok1333test tui::app::tests::task_editing::done_alias_clamps_selection_when_last_row_is_done ... ok1334test tui::app::tests::task_editing::done_alias_keeps_selected_row_position ... ok1335test tui::app::tests::task_editing::done_and_cancel_aliases_update_selected_task ... ok1336test tui::app::tests::task_editing::edit_description_conflict_preserves_overlay ... ok1337test tui::app::tests::task_editing::edit_description_prefills_and_ctrl_s_updates ... ok1338test tui::app::tests::task_editing::edit_labels_picker_prefills_current_labels_and_removes_unselected ... ok1339test tui::app::tests::task_editing::edit_priority_picker_prefills_current_priority ... ok1340test tui::app::tests::task_editing::edit_project_creation_cancel_leaves_task_unchanged ... ok1341test tui::app::tests::task_editing::edit_project_creation_error_keeps_picker_filter_open ... ok1342test tui::app::tests::task_editing::edit_project_picker_creates_and_assigns_project ... ok1343test tui::app::tests::task_editing::edit_project_picker_excludes_project_inference ... ok1344test tui::app::tests::task_editing::edit_shortcuts_require_selected_task ... ok1345test tui::app::tests::task_editing::edit_title_shortcut_prefills_and_updates_title ... ok1346test tui::app::tests::task_editing::exact_priority_shortcut_updates_selected_task ... ok1347test tui::app::tests::task_editing::hidden_title_uses_visible_text_editor ... ok1348test tui::app::tests::task_editing::label_browser_renames_and_safely_deletes_used_labels ... ok1349test tui::app::tests::task_editing::marked_rows_disable_single_task_copy_actions ... ok1350test tui::app::tests::task_editing::multiple_marks_disable_title_editing ... ok1351test tui::app::tests::task_editing::no_selected_mutating_shortcuts_report_failure ... ok1352test tui::app::tests::task_editing::one_mark_edits_the_marked_title_and_preserves_cursor_selection ... ok1353test tui::app::tests::task_editing::status_picker_alias_updates_selected_task ... ok1354test tui::app::tests::task_editing::table_copy_hotkeys_copy_task_text_and_show_feedback ... ok1355test tui::app::tests::task_editing::table_copy_menu_copies_multiple_marked_refs_and_titles_in_visible_order ... ok1356test tui::app::tests::task_editing::table_copy_menu_copies_selected_refs_with_zero_marks ... ok1357test tui::app::tests::task_editing::table_copy_menu_uses_one_mark_before_selected_row ... ok1358test tui::app::tests::task_editing::undo_command_reverts_last_mutation ... ok1359test tui::app::tests::task_editing::undo_reports_nothing_to_undo ... ok1360test tui::app::tests::task_editing::undo_shortcut_keeps_selected_row_position ... ok1361test tui::app::tests::task_editing::undo_shortcut_reverts_last_mutation ... ok1362test tui::app::tests::task_row_mouse::bulk_footer_mouse_opens_actions_and_clears_marks ... ok1363test tui::app::tests::task_row_mouse::hidden_status_has_no_mouse_target_but_keyboard_picker_remains_available ... ok1364test tui::app::tests::task_row_mouse::recurrence_context_menu_matches_lifecycle ... ok1365test tui::app::tests::task_row_mouse::reordered_status_right_click_targets_clicked_task ... ok1366test tui::app::tests::task_row_mouse::status_right_click_ignores_non_status_columns ... ok1367test tui::app::tests::task_row_mouse::status_right_click_opens_status_menu_for_clicked_task ... ok1368test tui::app::tests::task_row_mouse::status_right_click_reuses_status_update_and_undo ... ok1369test tui::app::tests::task_row_mouse::task_row_click_ignores_narrow_sidebar_overlay ... ok1370test tui::app::tests::task_row_mouse::task_row_click_opens_detail_on_double_click ... ok1371test tui::app::tests::task_row_mouse::task_row_click_preview_area_miss_is_ignored ... ok1372test tui::app::tests::task_row_mouse::task_row_click_selects_task ... ok1373test tui::app::tests::task_row_mouse::task_row_click_stale_state_is_reset_after_non_task_hit ... ok1374test tui::app::tests::task_row_mouse::task_row_click_wide_layout_respects_sidebar_offset ... ok1375test tui::app::tests::theme_background::modal_overlay_dims_main_surface_underlay ... ok1376test tui::app::tests::theme_background::popover_menu_keeps_main_surface_underlay_bright ... ok1377test tui::app::tests::theme_background::tui_background_uses_terminal_background_for_main_surface ... ok1378test tui::app::tests::typed_overlay_submissions::add_dependency_search_tab_keeps_picker_context ... ok1379test tui::app::tests::typed_overlay_submissions::add_project_submit_uses_intent_independent_of_title ... ok1380test tui::app::tests::typed_overlay_submissions::add_task_priority_shortcut_uses_intent_independent_of_title_prefix ... ok1381test tui::app::tests::typed_overlay_submissions::add_task_project_shortcut_uses_intent_independent_of_title_prefix ... ok1382test tui::app::tests::typed_overlay_submissions::choosing_current_column_preserves_grouped_status ... ok1383test tui::app::tests::typed_overlay_submissions::column_card_drag_moves_task_and_undo_restores_status ... ok1384test tui::app::tests::typed_overlay_submissions::column_card_drag_to_its_current_lane_is_a_no_op ... ok1385test tui::app::tests::typed_overlay_submissions::column_card_right_click_opens_status_choices ... ok1386test tui::app::tests::typed_overlay_submissions::column_lane_header_click_moves_selected_task ... ok1387test tui::app::tests::typed_overlay_submissions::column_move_picker_uses_lane_names_and_first_statuses ... ok1388test tui::app::tests::typed_overlay_submissions::column_move_shortcut_advances_marked_tasks_from_their_own_lanes ... ok1389test tui::app::tests::typed_overlay_submissions::column_move_shortcut_updates_status_and_undo_restores_it ... ok1390test tui::app::tests::typed_overlay_submissions::column_relative_move_keeps_marked_batch_unchanged_at_edge ... ok1391test tui::app::tests::typed_overlay_submissions::column_view_installs_custom_configuration ... ok1392test tui::app::tests::typed_overlay_submissions::column_view_keeps_task_selected_when_status_becomes_done ... ok1393test tui::app::tests::typed_overlay_submissions::column_view_navigates_within_and_between_lanes ... ok1394test tui::app::tests::typed_overlay_submissions::column_view_preview_shortcut_toggles_session_visibility ... ok1395test tui::app::tests::typed_overlay_submissions::delete_project_name_mismatch_keeps_confirmation_open ... ok1396test tui::app::tests::typed_overlay_submissions::delete_project_picker_and_name_confirm_use_distinct_intents ... ok1397test tui::app::tests::typed_overlay_submissions::incompatible_query_coerces_layout_and_back_restores_both ... ok1398test tui::app::tests::typed_overlay_submissions::layout_shortcut_toggles_columns_and_list ... ok1399test tui::app::tests::typed_overlay_submissions::layout_switch_preserves_query_rows_selection_marks_and_history ... ok1400test tui::app::tests::typed_overlay_submissions::navigate_search_result_commits_typed_query ... ok1401test tui::app::tests::typed_overlay_submissions::navigate_search_result_missing_from_results_opens_exact_task ... ok1402test tui::app::tests::typed_overlay_submissions::no_selected_task_shows_info ... ok1403test tui::app::tests::typed_overlay_submissions::related_removal_picker_requires_confirmation_and_supports_undo ... ok1404test tui::app::tests::typed_overlay_submissions::remove_shortcut_opens_current_dependency_picker ... ok1405test tui::app::tests::typed_overlay_submissions::search_selected_blocker_adds_dependency ... ok1406test tui::app::tests::typed_overlay_submissions::status_change_removes_card_outside_scoped_columns_query ... ok1407test tui::app::tests::typed_overlay_submissions::submitting_dependency_removal_removes_dependency ... ok1408test tui::app_attachments::tests::pasted_image_path_accepts_supported_single_file ... ok1409test tui::app_attachments::tests::pasted_image_path_decodes_file_urls ... ok1410test tui::app_attachments::tests::pasted_image_path_ignores_plain_text ... ok1411test tui::app_authoring::tests::add_task_natural_intake_combines_title_and_description ... ok1412test tui::app_edit::tests::external_description_value_retains_initial_baseline ... ok1413test tui::app_intake::tests::cancel_aborts_active_worker_and_clears_work ... ok1414test tui::app_intake::tests::poll_exposes_ready_before_completion ... ok1415test tui::app_intake::tests::starting_new_work_cancels_active_worker ... ok1416test tui::app_metadata::tests::entries_follow_field_ids_and_definition_order_across_renames ... ok1417test tui::app_onboarding::tests::check_draw_overlaps_end_of_purple_reveal ... ok1418test tui::app_onboarding::tests::completed_check_holds_before_the_handoff ... ok1419test tui::app_onboarding::tests::handoff_finishes_before_the_afterglow ... ok1420test tui::app_projects::tests::combined_task_copy_omits_separator_for_empty_description ... ok1421test tui::app_projects::tests::task_copy_text_preserves_description_formatting ... ok1422test tui::app_projects::tests::task_notes_copy_preserves_bodies_and_separates_notes ... ok1423test tui::app_recurrence::tests::recurrence_action_availability_matches_lifecycle ... ok1424test tui::app_update::tests::disabled_automatic_updates_suppress_checks_and_badges ... ok1425test tui::app_update::tests::later_hides_only_the_dismissed_update_badge ... ok1426test tui::app_workspaces::tests::workspace_names_are_trimmed_and_require_a_key ... ok1427test tui::attachment_controller::tests::pending_order_timestamps_are_strictly_increasing ... ok1428test tui::authoring::tests::add_task_description_context_marks_active_step ... ok1429test tui::authoring::tests::add_task_description_is_stored_in_created_draft ... ok1430test tui::authoring::tests::add_task_labels_are_stored_in_created_draft ... ok1431test tui::authoring::tests::add_task_priority_promotes_only_inbox_action_priorities ... ok1432test tui::authoring::tests::add_task_project_selection_retains_flow ... ok1433test tui::authoring::tests::add_task_status_choice_survives_capture_round_trip ... ok1434test tui::authoring::tests::add_task_status_defaults_to_inbox_and_can_be_set ... ok1435test tui::authoring::tests::blank_title_reopens_without_consuming_add_task ... ok1436test tui::authoring::tests::cancel_discards_pending_attachments ... ok1437test tui::authoring::tests::epic_child_origin_owns_epic_and_search_return ... ok1438test tui::authoring::tests::inferred_priority_promotes_derived_inbox_status ... ok1439test tui::authoring::tests::parsed_recurrence_populates_add_task_review_fields ... ok1440test tui::authoring::tests::pending_attachment_survives_parsed_draft_without_entering_description ... ok1441test tui::authoring::tests::project_empty_value_keeps_project_none_for_inferred_create ... ok1442test tui::authoring::tests::rapid_entry_reset_preserves_derived_priority_semantics ... ok1443test tui::authoring::tests::rapid_entry_reset_retains_context_and_clears_task_fields ... ok1444test tui::authoring::tests::standalone_origin_is_part_of_active_flow ... ok1445test tui::bounded_history::tests::push_discards_adjacent_duplicates ... ok1446test tui::bounded_history::tests::push_discards_oldest_entry_at_capacity ... ok1447test tui::changelog::tests::cache_keeps_historical_and_release_content_independently ... ok1448test tui::changelog::tests::cache_round_trip_preserves_both_content_sources ... ok1449test tui::changelog::tests::cached_changelog_omits_an_empty_unreleased_section ... ok1450test tui::changelog::tests::github_changelog_keeps_an_unreleased_section_with_entries ... ok1451test tui::changelog::tests::github_changelog_omits_an_empty_unreleased_section ... ok1452test tui::changelog::tests::historical_changelog_uses_the_default_branch ... ok1453test tui::changelog::tests::installed_release_heading_gets_a_badge ... ok1454test tui::changelog::tests::repository_changelog_keeps_each_entry_on_one_source_line ... ok1455test tui::changelog::tests::scroll_cap_accounts_for_rendered_markdown_wrapping ... ok1456test tui::changelog::tests::unavailable_and_malformed_sources_use_a_stable_fallback ... ok1457test tui::columns::tests::edges_and_missing_selection_use_non_empty_lanes ... ok1458test tui::columns::tests::empty_board_has_no_selection ... ok1459test tui::columns::tests::every_lane_preserves_query_order ... ok1460test tui::columns::tests::groups_in_configured_and_task_order ... ok1461test tui::columns::tests::lane_moves_follow_config_order_and_first_status ... ok1462test tui::columns::tests::mixed_policy_custom_lane_preserves_query_order ... ok1463test tui::columns::tests::navigation_skips_empty_columns_and_clamps_rows ... ok1464test tui::conflict_flow::tests::truncate_value_preview_uses_cell_width ... ok1465test tui::custom_command::tests::invocation_defaults_preserve_inherited_execution_settings_and_null_paths ... ok1466test tui::custom_command::tests::invocation_projects_paths_and_static_settings_without_environment_values ... ok1467test tui::custom_command::tests::invocation_uses_versioned_json_and_static_arguments ... ok1468test tui::custom_command::tests::invocation_without_selection_uses_null_primary ... ok1469test tui::custom_command::tests::marked_target_json_preserves_projection_order_and_raw_selection ... ok1470test tui::custom_command::tests::planner_resolves_cwd_without_reading_the_filesystem ... ok1471test tui::custom_command::tests::static_cwd_resolves_absolute_tilde_and_relative_paths ... ok1472test tui::custom_command::tests::target_policies_resolve_availability_and_precedence ... ok1473test tui::custom_command::tests::terminal_timeout_defaults_to_unlimited_and_honors_configuration ... ok1474test tui::custom_command_runtime::diagnostics::tests::diagnostics_bound_characters_and_display_width ... ok1475test tui::custom_command_runtime::diagnostics::tests::diagnostics_remove_ansi_and_unsafe_controls ... ok1476test tui::custom_command_runtime::diagnostics::tests::diagnostics_render_invalid_utf8_lossily ... ok1477test tui::custom_command_runtime::tests::background_closed_stdin_reports_handoff_failure ... ok1478test tui::custom_command_runtime::tests::background_command_ignores_completion_timeout_and_reports_complete_input_handoff ... ok1479test tui::custom_command_runtime::tests::background_input_delivery_is_bounded_and_cleans_up ... ok1480test tui::custom_command_runtime::tests::bounded_reader_retains_only_the_tail ... ok1481test tui::custom_command_runtime::tests::completions_preserve_invocation_identity_out_of_launch_order ... ok1482test tui::custom_command_runtime::tests::configured_timeout_bounds_input_output_and_wait_phases ... ok1483test tui::custom_command_runtime::tests::failure_does_not_include_input_unless_child_echoes_it ... ok1484test tui::custom_command_runtime::tests::large_failure_retains_tail_and_marks_truncation ... ok1485test tui::custom_command_runtime::tests::missing_and_non_directory_working_directories_fail_before_spawn ... ok1486test tui::custom_command_runtime::tests::nonzero_exit_includes_stderr_diagnostic ... ok1487test tui::custom_command_runtime::tests::nonzero_exit_uses_stdout_when_stderr_is_empty ... ok1488test tui::custom_command_runtime::tests::output_above_retention_limit_is_drained_and_successful ... ok1489test tui::custom_command_runtime::tests::planned_cwd_and_environment_override_reach_the_child ... ok1490test tui::custom_command_runtime::tests::read_failure_names_the_affected_stream_without_output ... ok1491test tui::custom_command_runtime::tests::shutdown_terminates_waiting_process_tree ... ok1492test tui::custom_command_runtime::tests::spawn_errors_do_not_expose_planned_environment_values ... ok1493test tui::custom_command_runtime::tests::successful_background_handoff_survives_controller_shutdown ... ok1494test tui::custom_command_runtime::tests::timeout_terminates_descendants_holding_output_open ... ok1495test tui::custom_command_runtime::tests::waiting_command_drains_output_while_delivering_input ... ok1496test tui::custom_command_runtime::tests::waiting_command_reports_closed_stdin_as_input_failure ... ok1497test tui::custom_command_runtime::tests::waiting_timeout_covers_blocked_input_delivery ... ok1498test tui::detail_selection::tests::selection_range_includes_both_endpoint_cells ... ok1499test tui::detail_selection::tests::text_cell_keeps_combining_marks_with_their_base ... ok1500test tui::detail_selection::tests::text_cell_maps_ascii_and_wide_characters ... ok1501test tui::detail_session::tests::activity_lifecycle_owns_active_state ... ok1502test tui::detail_session::tests::linked_history_restores_state_and_exhausts_cleanly ... ok1503test tui::detail_session::tests::open_and_reset_establish_clean_task_state ... ok1504test tui::detail_session::tests::target_activation_clears_selection_and_tracks_focus ... ok1505test tui::detail_session::tests::text_selection_updates_only_for_matching_frame ... ok1506test tui::event::command_catalog::tests::attachment_domain_routes_status_and_save_without_conflict ... ok1507test tui::event::command_catalog::tests::contextual_first_pages_are_explicit_and_deterministic ... ok1508test tui::event::command_catalog::tests::custom_keybindings_resolve_in_both_contexts ... ok1509test tui::event::command_catalog::tests::custom_names_and_aliases_share_one_catalog_entry ... ok1510test tui::event::command_catalog::tests::custom_target_policies_drive_scope_availability_and_shortcut_resolution ... ok1511test tui::event::command_catalog::tests::detail_keybindings_override_inherited_keys ... ok1512test tui::event::command_catalog::tests::pairing_command_is_discoverable_only_on_list_surfaces ... ok1513test tui::event::command_catalog::tests::parses_case_sensitive_character_and_named_keys ... ok1514test tui::event::command_catalog::tests::rejects_keys_reserved_by_prefix_handling ... ok1515test tui::event::command_catalog::tests::routing_domains_filter_prefix_hints_and_preserve_exact_prefix_precedence ... ok1516test tui::event::command_catalog::tests::session_query_includes_custom_and_built_in_commands ... ok1517test tui::event::command_catalog::tests::text_tiers_precede_availability_and_context ... ok1518test tui::event::command_catalog::tests::typed_queries_keep_commands_unavailable_in_the_captured_context ... ok1519test tui::event::tests::catalog_actions_are_handled ... ok1520test tui::event::tests::catalog_includes_pair_mobile_as_a_keyless_list_command ... ok1521test tui::event::tests::catalog_includes_upcoming_view_command ... ok1522test tui::event::tests::catalog_includes_update_and_changelog_without_global_shortcuts ... ok1523test tui::event::tests::catalog_includes_work_view_commands ... ok1524test tui::event::tests::command_contexts_reject_duplicate_exact_shortcuts ... ok1525test tui::event::tests::command_domains_cover_catalog_sections ... ok1526test tui::event::tests::command_mode_captures_text_keys ... ok1527test tui::event::tests::context_uses_its_own_command_bindings ... ok1528test tui::event::tests::current_single_key_shortcuts_match_catalog ... ok1529test tui::event::tests::custom_command_namespace_remains_free_of_built_in_bindings ... ok1530test tui::event::tests::detail_context_preserves_shared_task_shortcuts ... ok1531test tui::event::tests::detail_context_resolves_detail_shortcuts ... ok1532test tui::event::tests::detail_context_resolves_explicit_recurrence_shortcuts ... ok1533test tui::event::tests::implemented_detail_actions_are_handled ... ok1534test tui::event::tests::layout_shortcut_toggles_while_explicit_commands_have_no_shortcuts ... ok1535test tui::event::tests::maps_command_panel_key ... ok1536test tui::event::tests::maps_navigation_keys ... ok1537test tui::event::tests::normal_context_resolves_forward_shortcut ... ok1538test tui::event::tests::normal_context_resolves_last_change_shortcut ... ok1539test tui::event::tests::normal_escape_cancels_overlay ... ok1540test tui::event::tests::priority_shortcuts_open_picker_in_list_and_detail ... ok1541test tui::event::tests::required_action_families_are_present ... ok1542test tui::event::tests::resolver_reports_missing_and_empty_inputs ... ok1543test tui::event::tests::resolves_authoring_shortcuts ... ok1544test tui::event::tests::resolves_config_shortcuts ... ok1545test tui::event::tests::resolves_conflict_shortcuts ... ok1546test tui::event::tests::resolves_duplicate_exact_sequences_as_ambiguous ... ok1547test tui::event::tests::resolves_exact_prefix_ambiguity ... ok1548test tui::event::tests::resolves_exact_priority_shortcuts ... ok1549test tui::event::tests::resolves_filter_shortcuts ... ok1550test tui::event::tests::resolves_label_administration_shortcuts ... ok1551test tui::event::tests::resolves_multi_key_sequences_from_catalog ... ok1552test tui::event::tests::resolves_order_shortcuts ... ok1553test tui::event::tests::resolves_phase_prefix_shortcuts ... ok1554test tui::event::tests::resolves_project_shortcuts ... ok1555test tui::event::tests::resolves_single_key_shortcuts ... ok1556test tui::event::tests::resolves_sync_shortcut ... ok1557test tui::event::tests::resolves_task_editing_shortcuts ... ok1558test tui::event::tests::resolves_task_sharing_shortcuts ... ok1559test tui::event::tests::resolves_undo_shortcut ... ok1560test tui::event::tests::resolves_upcoming_view_shortcut ... ok1561test tui::event::tests::resolves_view_shortcuts ... ok1562test tui::event::tests::resolves_work_view_shortcuts ... ok1563test tui::event::tests::search_mode_captures_text_keys ... ok1564test tui::event::tests::status_shortcuts_resolve_through_task_prefix ... ok1565test tui::event::tests::task_actions_declare_bulk_target_behavior ... ok1566test tui::gist_controller::tests::controller_keeps_running_gist_work_pending ... ok1567test tui::gist_controller::tests::controller_polls_finished_gist_work ... ok1568test tui::inline_image_surface::tests::backend_change_reconciles_all_displayed_placements ... ok1569test tui::inline_image_surface::tests::changed_placements_wait_for_scroll_to_settle ... ok1570test tui::inline_image_surface::tests::cleanup_flush_failure_is_returned_to_lifecycle_owner ... ok1571test tui::inline_image_surface::tests::empty_view_cancels_deferred_emission ... ok1572test tui::inline_image_surface::tests::iterm_cleanup_repaints_reserved_cells ... ok1573test tui::inline_image_surface::tests::kitty_cleanup_deletes_owned_placement_without_repaint ... ok1574test tui::inline_image_surface::tests::pending_emissions_exclude_displayed_placements ... ok1575test tui::inline_image_surface::tests::retained_exports_replace_attachment_and_obey_capacity ... ok1576test tui::inline_image_surface::tests::write_failure_is_returned_to_lifecycle_owner ... ok1577test tui::inline_images::tests::auto_disables_iterm_previews_inside_tmux ... ok1578test tui::inline_images::tests::auto_disables_kitty_previews_inside_tmux ... ok1579test tui::inline_images::tests::auto_uses_iterm_outside_tmux ... ok1580test tui::inline_images::tests::auto_uses_kitty_graphics_for_known_terminals ... ok1581test tui::inline_images::tests::dispatcher_preserves_iterm2_escape ... ok1582test tui::inline_images::tests::forced_on_wraps_iterm_escape_for_tmux ... ok1583test tui::inline_images::tests::forced_on_wraps_kitty_escape_for_tmux_backend ... ok1584test tui::inline_images::tests::forced_on_wraps_kitty_escape_for_tmux_with_bounded_packets ... ok1585test tui::inline_images::tests::iterm2_delete_escape_is_absent ... ok1586test tui::inline_images::tests::kitty_delete_escape_targets_aven_owned_identifiers ... ok1587test tui::inline_images::tests::kitty_escape_chunks_large_payloads_with_bounded_packets ... ok1588test tui::inline_images::tests::kitty_escape_transmits_encoded_png_payload ... ok1589test tui::inline_images::tests::kitty_identifiers_are_stable_and_placement_specific ... ok1590test tui::inline_images::tests::kitty_tmux_delete_escape_is_wrapped ... ok1591test tui::inline_images::tests::unsupported_terminal_has_no_backend ... ok1592test tui::input::key::tests::command_panel_routes_before_detail_overlay_capture ... ok1593test tui::input::key::tests::control_c_routes_to_quit_before_overlay_capture ... ok1594test tui::input::key::tests::detail_help_routes_before_detail_input_capture ... ok1595test tui::input::key::tests::image_paste_routes_to_the_active_feature ... ok1596test tui::input::key::tests::normal_shortcut_translation_returns_action_and_next_buffer ... ok1597test tui::input::key::tests::pending_escape_cancels_the_shortcut ... ok1598test tui::input::key::tests::prefix_page_scroll_uses_terminal_height ... ok1599test tui::input::key::tests::task_list_control_navigation_does_not_escape_input_contexts ... ok1600test tui::input::key::tests::task_list_routes_page_and_control_navigation ... ok1601test tui::input::mouse::tests::lane_hit_routes_to_semantic_status ... ok1602test tui::input::mouse::tests::scroll_routes_to_prefix_hints_before_surfaces ... ok1603test tui::input::mouse::tests::status_hit_has_priority_over_task_row_hit ... ok1604test tui::list_surface::tests::column_drag_activates_on_motion_and_can_be_canceled ... ok1605test tui::list_surface::tests::expired_task_click_starts_a_new_click_sequence ... ok1606test tui::list_surface::tests::hidden_sidebar_focus_transition_reveals_sidebar ... ok1607test tui::list_surface::tests::hiding_sidebar_returns_focus_to_tasks ... ok1608test tui::list_surface::tests::mark_transitions_are_set_consistent ... ok1609test tui::list_surface::tests::task_double_click_requires_same_task_and_viewport_row ... ok1610test tui::markdown::tests::bold_list_item_renders_styled_text ... ok1611test tui::markdown::tests::empty_input_returns_one_blank_line ... ok1612test tui::markdown::tests::heading_renders_text_without_marker ... ok1613test tui::markdown::tests::inline_code_wraps_long_tokens ... ok1614test tui::markdown::tests::link_renders_text_with_wrapped_url_suffix ... ok1615test tui::markdown::tests::list_continuation_uses_exact_prefix_width ... ok1616test tui::markdown::tests::ordinary_image_renders_alt_text_without_url_suffix ... ok1617test tui::markdown::tests::ordinary_image_with_custom_destination_renders_alt_text ... ok1618test tui::markdown::tests::preview_handles_zero_and_single_line_heights ... ok1619test tui::markdown::tests::preview_preserves_block_boundaries_and_styles_inline_content ... ok1620test tui::markdown::tests::preview_wraps_to_width_and_marks_truncation ... ok1621test tui::markdown::tests::soft_breaks_preserve_source_line_breaks ... ok1622test tui::markdown::tests::table_renders_box_drawing ... ok1623test tui::markdown::tests::unicode_width_wrapping_respects_display_width ... ok1624test tui::natural_add_runtime::tests::detached_intake_receives_originating_tui_pid ... ok1625test tui::natural_add_runtime::tests::task_intake_log_path_ignores_relative_xdg_state_home_and_uses_home ... ok1626test tui::natural_add_runtime::tests::task_intake_log_path_prefers_aven_log_file ... ok1627test tui::natural_add_runtime::tests::task_intake_log_path_uses_absolute_xdg_state_home ... ok1628test tui::navigation::tests::bounded_navigation_clamps_large_deltas_to_edges ... ok1629test tui::navigation::tests::detail_down_scroll_stops_at_cap ... ok1630test tui::navigation::tests::detail_up_scroll_moves_after_resisted_down_scroll ... ok1631test tui::navigation::tests::ignored_detail_keys_clamp_stale_scroll_to_cap ... ok1632test tui::navigation::tests::scroll_with_delta_caps_to_range ... ok1633test tui::navigation::tests::wraps_down_from_last_sidebar_item_to_first_item ... ok1634test tui::navigation::tests::wraps_up_from_first_sidebar_item_to_last_item ... ok1635test tui::navigation::tests::wraps_up_from_first_task_to_last_task ... ok1636test tui::overlay::handlers::tests::add_note_discard_confirmation_accepts_y_and_rejects_submission ... ok1637test tui::overlay::handlers::tests::add_note_discard_confirmation_preserves_draft_when_cancelled ... ok1638test tui::overlay::handlers::tests::add_task_auto_status_choice_restores_derivation ... ok1639test tui::overlay::handlers::tests::add_task_ctrl_g_requests_another_task ... ok1640test tui::overlay::handlers::tests::add_task_ctrl_s_submits_from_every_field ... ok1641test tui::overlay::handlers::tests::add_task_description_paste_preserves_newlines ... ok1642test tui::overlay::handlers::tests::add_task_description_paste_restores_csi_u_ctrl_j_newlines ... ok1643test tui::overlay::handlers::tests::add_task_help_returns_without_changing_text_cursors ... ok1644test tui::overlay::handlers::tests::add_task_image_field_cycles_selected_attachment ... ok1645test tui::overlay::handlers::tests::add_task_metadata_navigation_treats_schedule_as_one_field ... ok1646test tui::overlay::handlers::tests::add_task_modified_enter_submits_from_every_field ... ok1647test tui::overlay::handlers::tests::add_task_partial_recurrence_keeps_composer_schedule_fields_hidden ... ok1648test tui::overlay::handlers::tests::add_task_plain_enter_preserves_field_behavior ... ok1649test tui::overlay::handlers::tests::add_task_priority_derivation_round_trips_between_inbox_and_todo ... ok1650test tui::overlay::handlers::tests::add_task_priority_promotes_explicit_inbox_and_preserves_todo ... ok1651test tui::overlay::handlers::tests::add_task_read_only_schedule_fields_ignore_keys_and_paste ... ok1652test tui::overlay::handlers::tests::add_task_recurrence_and_priority_derive_independently_in_either_order ... ok1653test tui::overlay::handlers::tests::add_task_recurrence_derives_status_unless_status_is_explicit ... ok1654test tui::overlay::handlers::tests::add_task_recurrence_disable_restores_derived_inbox ... ok1655test tui::overlay::handlers::tests::add_task_schedule_editor_applies_natural_summary ... ok1656test tui::overlay::handlers::tests::add_task_schedule_text_updates_structured_fields ... ok1657test tui::overlay::handlers::tests::add_task_schedule_text_validates_after_leaving_the_field ... ok1658test tui::overlay::handlers::tests::add_task_tab_and_backtab_traverse_all_fields ... ok1659test tui::overlay::handlers::tests::add_task_tab_skips_empty_image_field ... ok1660test tui::overlay::handlers::tests::add_task_title_paste_flattens_newlines ... ok1661test tui::overlay::handlers::tests::attachment_only_add_task_requires_discard_confirmation ... ok1662test tui::overlay::handlers::tests::cancelling_schedule_editor_restores_content_sized_composer ... ok1663test tui::overlay::handlers::tests::changed_blank_add_note_requires_discard_confirmation ... ok1664test tui::overlay::handlers::tests::changed_description_edit_requires_discard_confirmation ... ok1665test tui::overlay::handlers::tests::changed_manual_conflict_merge_requires_discard_confirmation ... ok1666test tui::overlay::handlers::tests::clean_add_note_cancels_without_confirmation ... ok1667test tui::overlay::handlers::tests::clean_initialized_description_edit_cancels_without_confirmation ... ok1668test tui::overlay::handlers::tests::clean_initialized_manual_conflict_merge_cancels_without_confirmation ... ok1669test tui::overlay::handlers::tests::composer_help_scroll_stops_at_viewport_cap ... ok1670test tui::overlay::handlers::tests::confirm_yes_and_no ... ok1671test tui::overlay::handlers::tests::ctrl_d_requests_explicit_date_clear ... ok1672test tui::overlay::handlers::tests::detail_marker_does_not_own_scroll_input ... ok1673test tui::overlay::handlers::tests::empty_add_task_escape_cancels_immediately ... ok1674test tui::overlay::handlers::tests::esc_cancels_all_input_overlay_variants ... ok1675test tui::overlay::handlers::tests::help_scroll_stops_at_cap ... ok1676test tui::overlay::handlers::tests::multiline_adapters_normalize_paste_without_changing_baseline_or_mode ... ok1677test tui::overlay::handlers::tests::multiline_ctrl_enter_submits ... ok1678test tui::overlay::handlers::tests::multiline_ctrl_s_submits ... ok1679test tui::overlay::handlers::tests::populated_add_note_requires_discard_confirmation ... ok1680test tui::overlay::handlers::tests::populated_add_task_requires_discard_confirmation ... ok1681test tui::overlay::handlers::tests::recurring_schedule_tab_order_matches_visual_order ... ok1682test tui::overlay::handlers::tests::repeated_esc_never_discards_populated_add_note ... ok1683test tui::overlay::handlers::tests::schedule_editor_previews_large_weekly_rules_and_includes_years ... ok1684test tui::overlay::handlers::tests::schedule_editor_up_and_down_navigate_fields ... ok1685test tui::overlay::handlers::tests::schedule_editor_validates_on_tab_and_clears_while_editing ... ok1686test tui::overlay::handlers::tests::submit_variants_propagate_intents ... ok1687test tui::overlay::handlers::tests::sync_status_emits_retained_sync_action ... ok1688test tui::overlay::handlers::tests::sync_status_scrolls_within_cap ... ok1689test tui::overlay::handlers::tests::sync_status_toggles_details_and_resets_scroll ... ok1690test tui::overlay::handlers::tests::tag_combobox_clipped_and_small_terminal_rows_do_not_toggle ... ok1691test tui::overlay::handlers::tests::tag_combobox_dialog_borders_and_padding_do_not_toggle_rows ... ok1692test tui::overlay::handlers::tests::tag_combobox_mouse_cycles_partial_label_to_selected_then_absent ... ok1693test tui::overlay::handlers::tests::tag_combobox_mouse_removes_selected_label ... ok1694test tui::overlay::handlers::tests::tag_combobox_outside_click_cancels ... ok1695test tui::overlay::handlers::tests::text_panel_closes_on_enter_and_esc ... ok1696test tui::overlay::handlers::tests::text_panel_navigation_scroll_is_capped ... ok1697test tui::overlay::handlers::tests::text_panel_scrolls_with_navigation_keys ... ok1698test tui::overlay::layout::tests::command_layout_clips_mouse_targets_to_content ... ok1699test tui::overlay::layout::tests::confirm_width_counts_wide_prompt_cells ... ok1700test tui::overlay::layout::tests::generic_picker_modes_share_exact_row_mapping ... ok1701test tui::overlay::layout::tests::project_picker_height_stays_stable_while_filtering ... ok1702test tui::overlay::layout::tests::project_picker_height_tracks_items_up_to_viewport_limit ... ok1703test tui::overlay::metadata::tests::actions_share_focus_activation_and_packed_hit_areas ... ok1704test tui::overlay::metadata::tests::discard_blocks_keyboard_and_every_action_click ... ok1705test tui::overlay::metadata::tests::editor_mouse_uses_unicode_and_control_safe_viewport ... ok1706test tui::overlay::metadata::tests::filtered_scrolled_clicks_keep_entry_indices_and_empty_results_do_nothing ... ok1707test tui::overlay::metadata::tests::filtering_keeps_field_identity_and_scroll_tracks_selected_row ... ok1708test tui::overlay::metadata::tests::metadata_geometry_keeps_actions_and_input_reachable ... ok1709test tui::overlay::metadata::tests::mouse_and_focus_use_narrow_rendered_geometry ... ok1710test tui::overlay::mouse::tests::command_row_click_uses_catalog_order_for_highlight ... ok1711test tui::overlay::mouse::tests::header_menu_click_submits_typed_action_and_outside_click_closes ... ok1712test tui::overlay::mouse::tests::overlay_scroll_updates_owned_state_and_clamps_to_context_cap ... ok1713test tui::overlay::mouse::tests::pairing_outside_click_uses_standard_modal_dismissal ... ok1714test tui::overlay::mouse::tests::recurrence_history_right_click_emits_feature_action ... ok1715test tui::overlay::multiline::tests::multiline_delete_at_line_end_merges_next_line ... ok1716test tui::overlay::multiline::tests::multiline_ignores_control_chars_that_are_not_editing_keys ... ok1717test tui::overlay::multiline::tests::multiline_input_splits_and_merges_lines ... ok1718test tui::overlay::multiline::tests::multiline_input_supports_emacs_deletion ... ok1719test tui::overlay::multiline::tests::multiline_input_supports_emacs_navigation ... ok1720test tui::overlay::multiline::tests::multiline_long_line_navigation_keeps_byte_cursor_valid ... ok1721test tui::overlay::multiline::tests::multiline_word_deletion_merges_previous_line_at_line_start ... ok1722test tui::overlay::multiline::tests::newline_split_normalizes_unicode_cursor_and_vertical_navigation ... ok1723test tui::overlay::multiline::tests::shared_keys_match_single_line_for_unicode_and_invalid_byte_cursors ... ok1724test tui::overlay::multiline::tests::unicode_line_boundaries_keep_control_deletion_local ... ok1725test tui::overlay::multiline::tests::word_deletion_crosses_empty_lines_and_preserves_unicode_suffix ... ok1726test tui::overlay::picker::tests::picker_filter_and_selection_normalize ... ok1727test tui::overlay::picker::tests::picker_filter_ignores_dashes_in_labels ... ok1728test tui::overlay::picker::tests::picker_filter_preserves_dash_matching ... ok1729test tui::overlay::picker::tests::picker_moves_with_arrow_keys ... ok1730test tui::overlay::picker::tests::picker_moves_with_ctrl_n_and_ctrl_p ... ok1731test tui::overlay::picker::tests::picker_moves_with_j_and_k_in_navigation_mode ... ok1732test tui::overlay::picker::tests::picker_scroll_moves_down_after_bottom_edge ... ok1733test tui::overlay::picker::tests::picker_scroll_stays_at_bottom_until_selection_reaches_top_edge ... ok1734test tui::overlay::picker::tests::picker_slash_enters_filter_mode_and_esc_returns_to_navigation ... ok1735test tui::overlay::picker::tests::picker_types_j_and_k_in_filter_mode ... ok1736test tui::overlay::picker::tests::project_creation_suggestion_tracks_unmatched_filter ... ok1737test tui::overlay::picker::tests::project_creation_suggestion_yields_to_exact_project ... ok1738test tui::overlay::scroll::tests::close_key_cancels ... ok1739test tui::overlay::scroll::tests::ignored_key_returns_ignored ... ok1740test tui::overlay::scroll::tests::j_key_scrolls_down ... ok1741test tui::overlay::scroll::tests::k_key_scrolls_up ... ok1742test tui::overlay::scroll::tests::page_down_with_zero_rows_is_ignored ... ok1743test tui::overlay::scroll::tests::scroll_caps_at_limit ... ok1744test tui::overlay::state::tests::input_builders_store_intents_with_editor_state ... ok1745test tui::overlay::state::tests::payload_bearing_intents_keep_flow_data_inside_state ... ok1746test tui::overlay::state::tests::picker_builder_uses_intent_mode_and_first_selected_item ... ok1747test tui::overlay::state::tests::recurrence_history_selection_uses_resident_indexes_and_reload_identity ... ok1748test tui::overlay::tag_combobox::tests::alt_backspace_at_empty_input_does_not_remove_selected_label ... ok1749test tui::overlay::tag_combobox::tests::enter_accepts_pending_highlighted_label ... ok1750test tui::overlay::tag_combobox::tests::enter_without_pending_label_submits_selected_labels ... ok1751test tui::overlay::tag_combobox::tests::partial_label_cycles_to_all_then_none ... ok1752test tui::overlay::tag_combobox::tests::space_accepts_pending_label ... ok1753test tui::overlay::tag_combobox::tests::tag_combobox_filters_completes_toggles_and_submits ... ok1754test tui::overlay::text_buffer::tests::exact_insertion_and_editing_clamp_to_unicode_byte_boundaries ... ok1755test tui::overlay::text_buffer::tests::exact_values_and_paste_preserve_opaque_text ... ok1756test tui::overlay::text_buffer::tests::returned_text_keeps_initial_baseline_across_retries ... ok1757test tui::overlay::text_input::tests::text_input_edits_at_cursor ... ok1758test tui::overlay::text_input::tests::text_input_ignores_control_chars_that_are_not_editing_keys ... ok1759test tui::overlay::text_input::tests::text_input_supports_alt_backspace_word_deletion ... ok1760test tui::overlay::text_input::tests::text_input_supports_emacs_deletion ... ok1761test tui::overlay::text_input::tests::text_input_supports_emacs_navigation ... ok1762test tui::overlay::text_input::tests::text_input_supports_word_navigation_and_terminal_aliases ... ok1763test tui::overlay::text_input::tests::text_input_word_navigation_preserves_unicode_boundaries ... ok1764test tui::overlay::text_input::tests::unicode_edits_use_scalar_boundaries_including_combining_marks ... ok1765test tui::overlay::view::tests::blocker_navigation_picker_has_dedicated_presentation_kind ... ok1766test tui::overlay::view::tests::overlay_view_projection_keeps_project_picker_presentation_kinds ... ok1767test tui::platform::clipboard::tests::checks_x11_when_wayland_clipboard_has_no_image ... ok1768test tui::platform::clipboard::tests::distinguishes_missing_tools_from_clipboard_command_failures ... ok1769test tui::platform::clipboard::tests::falls_back_from_missing_wayland_tool_to_x11 ... ok1770test tui::platform::clipboard::tests::reports_linux_clipboard_command_failures ... ok1771test tui::platform::clipboard::tests::reports_missing_linux_clipboard_tools ... ok1772test tui::platform::clipboard::tests::reports_non_image_content_when_an_available_backend_has_no_image ... ok1773test tui::platform::clipboard::tests::selects_linux_clipboard_backend_from_session_environment ... ok1774test tui::platform::clipboard::tests::selects_linux_clipboard_read_and_write_commands ... ok1775test tui::platform::clipboard::tests::writes_linux_clipboard_payload_with_backend_fallback ... ok1776test tui::platform::terminal::tests::external_editor_operation_restores_terminal_after_success_and_failure ... ok1777test tui::platform::terminal::tests::failed_restore_keeps_keyboard_state_available_for_retry ... ok1778test tui::platform::terminal::tests::kitty_keyboard_enhancement_pushes_and_pops_state ... ok1779test tui::platform::terminal::tests::modify_other_keys_enhancement_restores_terminal_mode ... ok1780test tui::platform::viewer::tests::selects_platform_default_browser_commands ... ok1781test tui::platform::viewer::tests::selects_platform_default_image_viewer_commands ... ok1782test tui::preview_controller::tests::active_lease_prevents_ready_cache_eviction ... ok1783test tui::preview_controller::tests::invalid_png_is_rejected_before_protocol_encoding ... ok1784test tui::preview_controller::tests::preview_work_uses_small_bounded_concurrency ... ok1785test tui::preview_controller::tests::repeated_failures_are_suppressed_for_the_session ... ok1786test tui::preview_controller::tests::requests_are_deduplicated_by_hash_and_profile ... ok1787test tui::preview_controller::tests::returning_to_a_key_requeues_after_stale_work_finishes ... ok1788test tui::preview_controller::tests::stale_results_are_rejected ... ok1789test tui::shortcut_buffer::tests::detail_missing_after_prefix_clears_and_warns ... ok1790test tui::shortcut_buffer::tests::detail_missing_without_prefix_passes_through ... ok1791test tui::shortcut_buffer::tests::editor_prefix_ctrl_e_clears_and_returns_true ... ok1792test tui::shortcut_buffer::tests::editor_prefix_non_open_key_clears_and_returns_false ... ok1793test tui::shortcut_buffer::tests::normal_missing_clears_and_reports_full_label ... ok1794test tui::shortcut_buffer::tests::normal_prefix_is_stored_and_rendered ... ok1795test tui::store::launch::tests::rejects_incompatible_query_and_layout ... ok1796test tui::store::launch::tests::rejects_task_filters_for_recent_actions ... ok1797test tui::store::launch::tests::rejects_unknown_label_before_store_construction ... ok1798test tui::store::launch::tests::resolves_all_query_with_columns_layout ... ok1799test tui::store::launch::tests::resolves_composed_browse_state ... ok1800test tui::store::launch::tests::resolves_deleted_task_as_singleton_search_detail ... ok1801test tui::store::launch::tests::resolves_recurring_browse_view ... ok1802test tui::store::launch::tests::resolves_upcoming_browse_view ... ok1803test tui::store::launch::tests::resolves_work_browse_views ... ok1804test tui::store::tests::conflicts::conflict_resolution_rolls_back_when_undo_recording_fails ... ok1805test tui::store::tests::conflicts::next_conflict_flag_index_keeps_single_conflict ... ok1806test tui::store::tests::conflicts::next_conflict_flag_index_returns_none_without_conflicts ... ok1807test tui::store::tests::conflicts::next_conflict_flag_index_wraps_backward ... ok1808test tui::store::tests::conflicts::next_conflict_flag_index_wraps_forward ... ok1809test tui::store::tests::conflicts::resolve_conflict_value_updates_task_and_clears_conflict ... ok1810test tui::store::tests::conflicts::resolve_missing_conflict_leaves_task_unchanged ... ok1811test tui::store::tests::conflicts::update_title_returns_conflicted_field_error ... ok1812test tui::store::tests::dependency_actions::dependency_actions_add_remove_and_undo ... ok1813test tui::store::tests::dependency_actions::dependency_add_rolls_back_when_undo_recording_fails ... ok1814test tui::store::tests::detail_loading::detail_hydration_reports_ids_absent_from_the_projection_as_stale ... ok1815test tui::store::tests::detail_loading::exact_task_load_ignores_active_view_filters ... ok1816test tui::store::tests::detail_loading::exact_task_load_returns_none_for_missing_id ... ok1817test tui::store::tests::detail_loading::task_full_report_renders_shareable_markdown ... ok1818test tui::store::tests::detail_loading::task_markdown_omits_empty_optional_sections ... ok1819test tui::store::tests::domain_mutations_and_pickers::delete_project_hides_project_with_deleted_tasks ... ok1820test tui::store::tests::domain_mutations_and_pickers::delete_project_hides_project_with_tasks ... ok1821test tui::store::tests::domain_mutations_and_pickers::delete_project_removes_unused_project ... ok1822test tui::store::tests::domain_mutations_and_pickers::edit_project_picker_items_includes_project_creation ... ok1823test tui::store::tests::domain_mutations_and_pickers::existing_project_picker_items_excludes_infer_project ... ok1824test tui::store::tests::domain_mutations_and_pickers::label_creation_rolls_back_when_undo_recording_fails ... ok1825test tui::store::tests::domain_mutations_and_pickers::priority_picker_includes_all_priorities ... ok1826test tui::store::tests::domain_mutations_and_pickers::project_creation_rolls_back_when_undo_recording_fails ... ok1827test tui::store::tests::domain_mutations_and_pickers::project_picker_includes_inference_creation_and_existing_projects ... ok1828test tui::store::tests::domain_mutations_and_pickers::project_rename_rolls_back_when_undo_recording_fails ... ok1829test tui::store::tests::domain_mutations_and_pickers::rename_project_updates_view_filters_and_tasks ... ok1830test tui::store::tests::domain_mutations_and_pickers::task_creation_rolls_back_new_labels_when_undo_recording_fails ... ok1831test tui::store::tests::domain_mutations_and_pickers::undo_project_rename_restores_view_filters_and_tasks ... ok1832test tui::store::tests::epics::add_epic_child_promotes_parent_and_undo_restores_both ... ok1833test tui::store::tests::epics::epic_child_creation_rolls_back_task_when_link_validation_fails ... ok1834test tui::store::tests::epics::epic_membership_rolls_back_when_undo_recording_fails ... ok1835test tui::store::tests::epics::epics_view_closed_filter_includes_and_isolates_closed_epics ... ok1836test tui::store::tests::epics::epics_view_starts_with_parents_collapsed ... ok1837test tui::store::tests::epics::remove_completed_epic_child ... ok1838test tui::store::tests::epics::remove_epic_child_uses_resolved_ids_and_records_undo ... ok1839test tui::store::tests::epics::status_change_from_collapsed_epic_selects_remaining_row ... ok1840test tui::store::tests::epics::toggle_epic_expands_and_collapses_parent ... ok1841test tui::store::tests::epics::toggle_epic_noop_when_no_selection ... ok1842test tui::store::tests::label_administration::label_administration_rolls_back_when_undo_cannot_be_recorded ... ok1843test tui::store::tests::label_administration::label_administration_updates_task_and_series_references_and_undoes ... ok1844test tui::store::tests::mutation_wakeup::task_creation_wakes_configured_daemon ... ok1845test tui::store::tests::onboarding::completion_preserves_future_marker ... ok1846test tui::store::tests::onboarding::established_database_is_not_treated_as_first_launch ... ok1847test tui::store::tests::onboarding::fresh_database_is_due_until_completed ... ok1848test tui::store::tests::onboarding::invalid_or_older_markers_are_due_for_empty_database ... ok1849test tui::store::tests::onboarding::marker_parsing_is_trimmed_and_downgrade_safe ... ok1850test tui::store::tests::recurrence_surfaces::done_view_uses_one_grouped_series_history_row ... ok1851test tui::store::tests::recurrence_surfaces::lifecycle_conflict_appears_in_needs_action_with_series_target ... ok1852test tui::store::tests::recurrence_surfaces::paused_projection_leaves_ordinary_views_but_direct_access_remains ... ok1853test tui::store::tests::recurrence_surfaces::recurrence_store_creation_hydrates_series_and_slot_metadata ... ok1854test tui::store::tests::recurrence_surfaces::recurring_series_search_and_refresh_restore_series_identity ... ok1855test tui::store::tests::recurrence_surfaces::recurring_series_view_includes_paused_and_filters_stopped ... ok1856test tui::store::tests::related_actions::create_undo_soft_deletes_tasks_with_related_tombstones ... ok1857test tui::store::tests::related_actions::related_actions_add_remove_and_undo ... ok1858test tui::store::tests::related_actions::related_no_ops_do_not_wake_the_daemon ... ok1859test tui::store::tests::related_actions::related_removal_picker_includes_deleted_targets_with_marker ... ok1860test tui::store::tests::related_actions::related_undo_rejects_a_changed_pair_version ... ok1861test tui::store::tests::sync_workspace_payloads::explicit_workspace_payloads_pair_id_and_key ... ok1862test tui::store::tests::task_creation_and_updates::batch_mutations::batch_delete_hides_rows_and_restores_a_clamped_anchor ... ok1863test tui::store::tests::task_creation_and_updates::batch_mutations::set_exact_priority_for_tasks_rolls_back_on_later_conflict ... ok1864test tui::store::tests::task_creation_and_updates::batch_mutations::set_exact_priority_for_tasks_sets_priority_on_each_marked_task ... ok1865test tui::store::tests::task_creation_and_updates::batch_mutations::single_delete_preserves_row_index_counts_and_undo ... ok1866test tui::store::tests::task_creation_and_updates::batch_mutations::successive_single_deletes_preserve_every_deleted_row ... ok1867test tui::store::tests::task_creation_and_updates::batch_mutations::update_labels_for_tasks_preserves_partial_membership ... ok1868test tui::store::tests::task_creation_and_updates::batch_mutations::update_labels_for_tasks_reports_unchanged_batch ... ok1869test tui::store::tests::task_creation_and_updates::batch_mutations::update_labels_for_tasks_sets_labels_on_each_marked_task ... ok1870test tui::store::tests::task_creation_and_updates::batch_mutations::update_project_for_tasks_sets_project_on_each_marked_task ... ok1871test tui::store::tests::task_creation_and_updates::batch_mutations::update_status_for_tasks_sets_status_on_each_marked_task ... ok1872test tui::store::tests::task_creation_and_updates::creation::create_task_assigns_tui_source ... ok1873test tui::store::tests::task_creation_and_updates::creation::create_task_preserves_previous_selection_when_hidden ... ok1874test tui::store::tests::task_creation_and_updates::creation::create_task_refreshes_and_selects_visible_task ... ok1875test tui::store::tests::task_creation_and_updates::creation::create_task_reports_hidden_by_filters ... ok1876test tui::store::tests::task_creation_and_updates::creation::create_task_uses_priority_to_promote_only_inbox_tasks ... ok1877test tui::store::tests::task_creation_and_updates::creation::filtered_status_change_selects_successor_then_previous_at_end ... ok1878test tui::store::tests::task_creation_and_updates::creation::marked_status_change_keeps_selection_at_ranked_position ... ok1879test tui::store::tests::task_creation_and_updates::creation::preserving_status_change_follows_task_after_queue_reorder ... ok1880test tui::store::tests::task_creation_and_updates::creation::queue_status_change_keeps_selection_at_ranked_position ... ok1881test tui::store::tests::task_creation_and_updates::creation::unchanged_status_keeps_selected_task_at_its_position ... ok1882test tui::store::tests::task_creation_and_updates::creation::update_status_preserving_task_keeps_done_item_in_filtered_view ... ok1883test tui::store::tests::task_creation_and_updates::field_updates::availability_edit_refreshes_task_and_sidebar_counts ... ok1884test tui::store::tests::task_creation_and_updates::field_updates::label_selection_uses_authoritative_labels_after_capture ... ok1885test tui::store::tests::task_creation_and_updates::field_updates::metadata_empty_remove_noop_and_undo_use_core_transactions ... ok1886test tui::store::tests::task_creation_and_updates::field_updates::priority_cycle_uses_authoritative_value_after_selection_capture ... ok1887test tui::store::tests::task_creation_and_updates::field_updates::priority_edit_preserves_low_priority_and_non_inbox_statuses ... ok1888test tui::store::tests::task_creation_and_updates::field_updates::priority_edit_refreshes_queue_activity_timestamp ... ok1889test tui::store::tests::task_creation_and_updates::field_updates::text_mutation_rejects_multiple_targets ... ok1890test tui::store::tests::task_creation_and_updates::field_updates::title_edit_keeps_queue_activity_timestamp ... ok1891test tui::store::tests::task_creation_and_updates::field_updates::unchanged_label_updates_leave_pending_change_count ... ok1892test tui::store::tests::task_creation_and_updates::field_updates::unchanged_task_fields_leave_pending_change_count ... ok1893test tui::store::tests::task_creation_and_updates::field_updates::unchanged_title_edit_leaves_pending_change_count ... ok1894test tui::store::tests::task_creation_and_updates::field_updates::update_labels_adds_and_removes_labels ... ok1895test tui::store::tests::task_creation_and_updates::field_updates::update_task_fields_refresh_selected_task ... ok1896test tui::store::tests::task_creation_and_updates::notes::add_note_to_task_writes_note ... ok1897test tui::store::tests::task_creation_and_updates::notes::note_creation_rolls_back_when_undo_recording_fails ... ok1898test tui::store::tests::task_creation_and_updates::notes::note_creation_undo_follows_deletion_restoration ... ok1899test tui::store::tests::task_creation_and_updates::notes::note_edit_and_delete_roll_back_when_undo_recording_fails ... ok1900test tui::store::tests::task_creation_and_updates::notes::note_edit_and_delete_target_stable_identity ... ok1901test tui::store::tests::task_creation_and_updates::notes::note_lineage_update_failure_rolls_back_restoration ... ok1902test tui::store::tests::task_creation_and_updates::notes::note_restoration_preserves_sync_guards_and_rejects_replacement ... ok1903test tui::store::tests::task_creation_and_updates::refresh::committed_mutation_reports_refresh_failure_without_rolling_back ... ok1904test tui::store::tests::task_creation_and_updates::refresh::late_refresh_failure_preserves_view_and_cached_state ... ok1905test tui::store::tests::task_creation_and_updates::refresh::refresh_replacement_preserves_retained_state_without_cloning_projection ... ok1906test tui::store::tests::task_creation_and_updates::refresh::repeat_entry_creation_reports_committed_refresh_failure_as_completion ... ok1907test tui::store::tests::task_creation_and_updates::refresh::upcoming_cache_rebuilds_at_the_local_date_boundary_after_refresh_failure ... ok1908test tui::store::tests::task_creation_and_updates::rollback::batch_mutation_rolls_back_when_undo_recording_fails ... ok1909test tui::store::tests::task_creation_and_updates::rollback::date_mutation_rolls_back_when_undo_recording_fails ... ok1910test tui::store::tests::task_creation_and_updates::rollback::deletion_rolls_back_when_undo_recording_fails ... ok1911test tui::store::tests::task_creation_and_updates::rollback::label_assignment_rolls_back_when_undo_recording_fails ... ok1912test tui::store::tests::task_creation_and_updates::rollback::new_label_assignment_rolls_back_when_undo_recording_fails ... ok1913test tui::store::tests::task_creation_and_updates::rollback::project_assignment_rolls_back_when_undo_recording_fails ... ok1914test tui::store::tests::task_creation_and_updates::rollback::single_mutation_rolls_back_when_undo_recording_fails ... ok1915test tui::store::tests::task_creation_and_updates::selection_restoration::mutation_families_restore_selection_after_refresh ... ok1916test tui::store::tests::task_creation_and_updates::selection_restoration::unchanged_single_and_batch_edits_preserve_state_without_undo ... ok1917test tui::store::tests::undo::duplicate_project_and_label_do_not_add_undo_entries ... ok1918test tui::store::tests::undo::noop_task_field_updates_do_not_add_undo_entries ... ok1919test tui::store::tests::undo::partially_unchanged_batch_undo_presentation_uses_changed_scope ... ok1920test tui::store::tests::undo::repeated_delete_does_not_add_noop_undo_entry ... ok1921test tui::store::tests::undo::repeated_task_creations_undo_independently ... ok1922test tui::store::tests::undo::single_task_undo_presentation_keeps_display_ref ... ok1923test tui::store::tests::undo::stacked_undo_reports_consumed_entry_and_exposes_next_entry ... ok1924test tui::store::tests::undo::store_startup_clears_pending_undo_but_preserves_consumed_entries ... ok1925test tui::store::tests::undo::undo_atomic_attachment_task_removes_all_database_rows ... ok1926test tui::store::tests::undo::undo_batch_new_label_assignment_removes_shared_label ... ok1927test tui::store::tests::undo::undo_cancel_restores_prior_queue_activity ... ok1928test tui::store::tests::undo::undo_conflict_resolution_restores_unresolved_conflict ... ok1929test tui::store::tests::undo::undo_consumes_entry_once ... ok1930test tui::store::tests::undo::undo_create_task_removes_created_labels ... ok1931test tui::store::tests::undo::undo_create_task_removes_local_unsynced_task ... ok1932test tui::store::tests::undo::undo_creation_preserves_independent_notes_and_relationships ... ok1933test tui::store::tests::undo::undo_delete_restores_task ... ok1934test tui::store::tests::undo::undo_guard_blocks_stale_task_field ... ok1935test tui::store::tests::undo::undo_is_workspace_scoped_within_running_store ... ok1936test tui::store::tests::undo::undo_label_create_fails_when_referenced_by_recurrence ... ok1937test tui::store::tests::undo::undo_label_create_fails_when_referenced_or_synced ... ok1938test tui::store::tests::undo::undo_labels_uses_set_comparison ... ok1939test tui::store::tests::undo::undo_new_label_assignment_removes_unreferenced_label ... ok1940test tui::store::tests::undo::undo_note_create_deletes_only_unsynced_note ... ok1941test tui::store::tests::undo::undo_presentation_resolves_task_hidden_by_mutation ... ok1942test tui::store::tests::undo::undo_project_conflict_resolution_uses_project_ids ... ok1943test tui::store::tests::undo::undo_project_create_fails_when_referenced_or_synced ... ok1944test tui::store::tests::undo::undo_restore_redeletes_task ... ok1945test tui::store::tests::undo::undo_returns_none_when_empty ... ok1946test tui::store::tests::undo::undo_skips_noop_status_before_previous_mutation ... ok1947test tui::store::tests::undo::undo_status_keeps_later_queue_activity ... ok1948test tui::store::tests::undo::undo_title_edit_expires_on_store_restart ... ok1949test tui::store::tests::undo::update_labels_for_tasks_records_single_undo_payload ... ok1950test tui::store::tests::views_filters_and_sort::availability_transition_refreshes_tasks_sidebar_and_project_counts ... ok1951test tui::store::tests::views_filters_and_sort::clear_filters_preserves_view_scope_and_order ... ok1952test tui::store::tests::views_filters_and_sort::closed_filter_reuses_visibility_cycle_for_tasks ... ok1953test tui::store::tests::views_filters_and_sort::deleted_filter_cycle_preserves_project_scope ... ok1954test tui::store::tests::views_filters_and_sort::done_view_shows_done_tasks ... ok1955test tui::store::tests::views_filters_and_sort::ordering_from_queue_switches_to_open ... ok1956test tui::store::tests::views_filters_and_sort::project_scope_hides_done_and_canceled_tasks_in_open_view ... ok1957test tui::store::tests::views_filters_and_sort::query_anchor_preserves_task_identity_across_sorting ... ok1958test tui::store::tests::views_filters_and_sort::query_anchor_uses_clamped_flat_position_when_task_is_hidden ... ok1959test tui::store::tests::views_filters_and_sort::queue_view_hides_done_tasks ... ok1960test tui::store::tests::views_filters_and_sort::search_view_finds_done_tasks_from_queue ... ok1961test tui::store::tests::views_filters_and_sort::search_view_keeps_zero_result_restriction ... ok1962test tui::store::tests::views_filters_and_sort::search_view_preview_hides_deleted_ordinary_text_results ... ok1963test tui::store::tests::views_filters_and_sort::search_view_preview_returns_rendered_fields_without_full_hydration ... ok1964test tui::store::tests::views_filters_and_sort::search_view_submitted_search_hides_deleted_ordinary_text_results ... ok1965test tui::store::tests::views_filters_and_sort::search_view_upgrades_selected_result_to_full_hydration ... ok1966test tui::store::tests::views_filters_and_sort::search_view_without_query_has_an_empty_prompt_projection ... ok1967test tui::store::tests::views_filters_and_sort::show_conflicts_view_sets_conflicts_view ... ok1968test tui::store::tests::views_filters_and_sort::sidebar_selection_prefers_project_scope_when_scoped ... ok1969test tui::store::tests::views_filters_and_sort::timestamp_orders_default_to_descending_and_can_toggle ... ok1970test tui::store::tests::views_filters_and_sort::toggle_deleted_filter_switches_include_deleted ... ok1971test tui::store::tests::views_filters_and_sort::upcoming_keeps_availability_as_effective_order ... ok1972test tui::store::tests::views_filters_and_sort::work_view_refresh_restores_selected_task_identity ... ok1973test tui::store::tests::views_filters_and_sort::work_view_switches_preserve_scope_and_compatible_filters ... ok1974test tui::store::tests::views_filters_and_sort::work_views_and_sidebar_counts_match_core_filters_at_workspace_and_project_scope ... ok1975test tui::store::tests::workspace_scoping::default_startup_opens_all_projects ... ok1976test tui::store::tests::workspace_scoping::deferred_task_intake_retains_spawned_workspace ... ok1977test tui::store::tests::workspace_scoping::delete_project_ignores_tasks_in_other_workspace ... ok1978test tui::store::tests::workspace_scoping::delete_project_uses_store_workspace ... ok1979test tui::store::tests::workspace_scoping::initial_project_opens_project_view ... ok1980test tui::store::tests::workspace_scoping::refresh_reads_store_workspace ... ok1981test tui::store::tests::workspace_scoping::switch_workspace_refreshes_workspace_scoped_state ... ok1982test tui::store::tests::workspace_scoping::workspace_administration_preserves_active_workspace_and_task_ownership ... ok1983test tui::store::tests::workspace_scoping::workspace_picker_order_is_stable_when_active_workspace_changes ... ok1984test tui::store::types::tests::all_query_includes_every_available_status ... ok1985test tui::store::types::tests::columns_compatibility_is_explicit ... ok1986test tui::store::types::tests::incompatible_query_coerces_columns_to_list ... ok1987test tui::store::types::tests::layout_does_not_change_query_semantics ... ok1988test tui::task_selection::tests::detail_target_uses_open_task_as_refresh_anchor ... ok1989test tui::task_selection::tests::ignores_hidden_marks_and_requires_a_visible_target ... ok1990test tui::task_selection::tests::resolves_single_target_without_marks ... ok1991test tui::task_selection::tests::resolves_visible_marks_before_selected_row ... ok1992test tui::terminal_command::tests::configured_timeout_is_distinct_from_unlimited_terminal_default ... ok1993test tui::terminal_command::tests::configured_timeout_restores_terminal_and_cleans_context ... ok1994test tui::terminal_command::tests::context_lifecycle_and_restoration_wrap_every_runner_result ... ok1995test tui::terminal_command::tests::real_runner_inherits_streams_and_delivers_static_process_settings ... ok1996test tui::terminal_command::tests::suspended_terminal_restores_during_unwinding ... ok1997test tui::terminal_command::tests::suspension_failure_attempts_one_restoration ... ok1998test tui::text::tests::boundaries_snap_to_valid_utf8_indices ... ok1999test tui::text::tests::cell_takes_never_split_wide_characters ... ok2000test tui::text::tests::cell_width_ranges_keep_valid_boundaries ... ok2001test tui::text::tests::cell_width_ranges_wrap_wide_characters_by_cells ... ok2002test tui::text::tests::next_word_start_skips_current_word_and_whitespace ... ok2003test tui::text::tests::normalizes_pasted_newline_encodings ... ok2004test tui::text::tests::previous_word_start_skips_trailing_whitespace ... ok2005test tui::text::tests::segment_index_matches_end_cursor_behavior ... ok2006test tui::text::tests::truncate_width_reserves_ellipsis_by_display_cells ... ok2007test tui::text::tests::word_starts_preserve_unicode_boundaries ... ok2008test tui::time::tests::available_in_label_formats_future_values ... ok2009test tui::time::tests::compact_due_labels_fit_the_task_list_column ... ok2010test tui::time::tests::compact_duration_formats_minutes_hours_days_weeks_and_months ... ok2011test tui::ui::columns::tests::blocked_cards_are_dimmed_unless_selected ... ok2012test tui::ui::columns::tests::card_heading_uses_table_ref_and_priority_colors ... ok2013test tui::ui::columns::tests::card_title_wraps_to_two_lines_and_truncates_overflow ... ok2014test tui::ui::columns::tests::compact_terminal_cards_show_icon_only_status_markers ... ok2015test tui::ui::columns::tests::drag_card_geometry_follows_pointer_and_stays_inside_board ... ok2016test tui::ui::columns::tests::hit_testing_uses_rendered_card_geometry ... ok2017test tui::ui::columns::tests::lane_body_hit_testing_includes_empty_lanes_and_excludes_preview ... ok2018test tui::ui::columns::tests::lane_hit_testing_uses_header_geometry ... ok2019test tui::ui::columns::tests::layout_gives_preview_space_back_to_board_when_hidden ... ok2020test tui::ui::columns::tests::layout_reserves_preview_and_keeps_selected_card_visible ... ok2021test tui::ui::columns::tests::marked_card_keeps_non_color_marker_for_focused_composition ... ok2022test tui::ui::columns::tests::overdue_cards_show_deadline_marker ... ok2023test tui::ui::columns::tests::terminal_cards_show_status_markers ... ok2024test tui::ui::detail::tests::activity::task_activity_is_collapsed_by_default_and_expands_with_idle_context ... ok2025test tui::ui::detail::tests::attachments::detail_attachment_filename_truncates_to_content_width ... ok2026test tui::ui::detail::tests::attachments::detail_attachment_hit_tracks_scroll_and_excludes_suppressed_preview ... ok2027test tui::ui::detail::tests::attachments::detail_attachment_row_styles_filename_and_metadata ... ok2028test tui::ui::detail::tests::attachments::detail_attachment_rows_show_filename_and_generic_fallback ... ok2029test tui::ui::detail::tests::attachments::detail_attachment_section_renders_live_rows_once_in_order ... ok2030test tui::ui::detail::tests::attachments::detail_empty_description_renders_attachment_section ... ok2031test tui::ui::detail::tests::attachments::detail_falls_back_to_single_placeholder_when_previews_disabled ... ok2032test tui::ui::detail::tests::attachments::detail_omits_preview_when_frame_is_clipped_by_viewport ... ok2033test tui::ui::detail::tests::attachments::detail_placements_only_include_visible_preview_rows ... ok2034test tui::ui::detail::tests::attachments::detail_preview_preserves_image_aspect_within_max_rows ... ok2035test tui::ui::detail::tests::attachments::detail_renders_pending_and_failed_attachment_rows ... ok2036test tui::ui::detail::tests::attachments::detail_reserves_rows_for_previewable_attachment ... ok2037test tui::ui::detail::tests::attachments::detail_suppressed_preview_keeps_textual_attachment_row ... ok2038test tui::ui::detail::tests::attachments::duplicate_hash_hit_uses_the_visible_attachment_frame ... ok2039test tui::ui::detail::tests::attachments::focused_preview_changes_border_style_without_moving_image ... ok2040test tui::ui::detail::tests::attachments::framed_preview_overflow_expands_scroll_and_reaches_hit_target ... ok2041test tui::ui::detail::tests::attachments::large_attachment_preview_stays_inside_its_border ... ok2042test tui::ui::detail::tests::document::cached_geometry_accepts_frame_specific_detail_styles ... ok2043test tui::ui::detail::tests::document::cached_geometry_invalidates_for_semantic_detail_changes ... ok2044test tui::ui::detail::tests::document::detail_content_layout_matches_wide_and_narrow_metadata_rules ... ok2045test tui::ui::detail::tests::document::detail_content_model_prepares_render_lines_and_scrollbar ... ok2046test tui::ui::detail::tests::document::detail_document_projections_share_semantic_body_geometry ... ok2047test tui::ui::detail::tests::document::detail_section_targets_cycle_through_notes_dependencies_and_activity ... ok2048test tui::ui::detail::tests::document::detail_selection_maps_and_highlights_across_wrapped_title_lines ... ok2049test tui::ui::detail::tests::metadata::custom_metadata_heading_uses_note_heading_and_keycap_styles ... ok2050test tui::ui::detail::tests::metadata::detail_copy_targets_map_displayed_values ... ok2051test tui::ui::detail::tests::metadata::detail_metadata_includes_operational_fields ... ok2052test tui::ui::detail::tests::metadata::detail_metadata_includes_recurrence_state_and_history ... ok2053test tui::ui::detail::tests::metadata::detail_metadata_marks_epics_and_counts_children ... ok2054test tui::ui::detail::tests::metadata::detail_metadata_marks_epics_without_children ... ok2055test tui::ui::detail::tests::metadata::detail_metadata_splits_availability_across_bounded_lines ... ok2056test tui::ui::detail::tests::metadata::detail_metadata_target_maps_both_date_summary_lines ... ok2057test tui::ui::detail::tests::metadata::detail_metadata_target_maps_editable_values_without_body_conflicts ... ok2058test tui::ui::detail::tests::metadata::detail_metadata_uses_shared_epic_rollup_semantics ... ok2059test tui::ui::detail::tests::relationships::detail_body_shows_epic_parent_relationship ... ok2060test tui::ui::detail::tests::relationships::detail_child_hit_maps_child_rows ... ok2061test tui::ui::detail::tests::relationships::detail_content_lists_epic_children ... ok2062test tui::ui::detail::tests::relationships::detail_content_renders_dependency_tree ... ok2063test tui::ui::detail::tests::relationships::detail_dependency_tree_caps_long_blockers ... ok2064test tui::ui::detail::tests::relationships::detail_dependency_tree_caps_long_dependents ... ok2065test tui::ui::detail::tests::relationships::detail_dependency_tree_is_omitted_without_links ... ok2066test tui::ui::detail::tests::relationships::detail_dependency_tree_stacks_when_narrow ... ok2067test tui::ui::detail::tests::relationships::detail_dependency_tree_truncates_titles_in_narrow_width ... ok2068test tui::ui::detail::tests::relationships::detail_epic_parent_relationship_wraps_to_width ... ok2069test tui::ui::detail::tests::relationships::detail_projection_expands_long_dependency_sections ... ok2070test tui::ui::detail::tests::relationships::detail_projection_orders_every_relationship_section ... ok2071test tui::ui::detail::tests::relationships::epic_child_blockers_stay_on_one_row_and_count_hidden_refs ... ok2072test tui::ui::detail::tests::relationships::epic_child_blockers_use_compact_clipped_rows_at_narrow_widths ... ok2073test tui::ui::detail::tests::relationships::epic_child_dependency_rows_share_the_child_hit_target ... ok2074test tui::ui::detail::tests::relationships::epic_children_show_shared_blocker_without_changing_membership_tree ... ok2075test tui::ui::detail::tests::relationships::hovered_detail_child_uses_link_style ... ok2076test tui::ui::detail::tests::relationships::legitimate_removed_suffix_remains_a_live_epic_child_title ... ok2077test tui::ui::detail::tests::relationships::linked_references_use_their_own_project_color_and_dim_suffix ... ok2078test tui::ui::detail::tests::relationships::related_detail_rows_hide_deleted_targets_for_live_tasks ... ok2079test tui::ui::detail::tests::relationships::removed_epic_child_is_labeled_and_excluded_from_counts ... ok2080test tui::ui::detail::tests::text::detail_content_includes_notes ... ok2081test tui::ui::detail::tests::text::detail_content_renders_markdown_description_and_notes ... ok2082test tui::ui::detail::tests::text::detail_description_lines_keep_quote_rail ... ok2083test tui::ui::detail::tests::text::detail_header_breaks_words_that_exceed_narrow_widths ... ok2084test tui::ui::detail::tests::text::detail_header_leads_with_project_context ... ok2085test tui::ui::detail::tests::text::detail_header_marks_epics_with_star ... ok2086test tui::ui::detail::tests::text::detail_header_wraps_by_unicode_display_width ... ok2087test tui::ui::detail::tests::text::detail_header_wraps_the_complete_title_before_metadata ... ok2088test tui::ui::detail::tests::text::detail_markdown_links_hide_destinations_and_have_mouse_targets ... ok2089test tui::ui::detail::tests::text::detail_note_lines_keep_quote_rail ... ok2090test tui::ui::detail::tests::text::detail_selection_copies_rendered_markdown_text ... ok2091test tui::ui::detail::tests::text::detail_selection_highlights_the_selected_range ... ok2092test tui::ui::detail::tests::text::detail_text_mapping_handles_wide_title_characters ... ok2093test tui::ui::detail::tests::text::detail_text_mapping_uses_scrolled_wrapped_description_lines ... ok2094test tui::ui::detail::tests::text::inline_title_editing_stays_on_one_clipped_line ... ok2095test tui::ui::dialog::tests::dialog_hint_line_styles_keys ... ok2096test tui::ui::dialog::tests::dialog_truncates_title_to_border_width ... ok2097test tui::ui::dialog::tests::dimming_darkens_rgb_and_preserves_default_backgrounds ... ok2098test tui::ui::empty_state::tests::advertised_actions_resolve_through_the_catalog ... ok2099test tui::ui::empty_state::tests::load_error_has_distinct_marker_and_color ... ok2100test tui::ui::empty_state::tests::renderer_adapts_to_full_narrow_and_short_areas ... ok2101test tui::ui::footer::tests::attachment_preview_footer_advertises_preview_controls ... ok2102test tui::ui::footer::tests::bulk_footer_actions_share_rendered_hit_ranges ... ok2103test tui::ui::footer::tests::bulk_footer_keys_keep_standard_keycap_contrast ... ok2104test tui::ui::footer::tests::columns_footer_prioritizes_selection_and_move_keys ... ok2105test tui::ui::footer::tests::deleted_detail_footer_advertises_restore ... ok2106test tui::ui::footer::tests::detail_attachment_footer_advertises_save_controls ... ok2107test tui::ui::footer::tests::detail_footer_distinguishes_root_and_nested_back_targets ... ok2108test tui::ui::footer::tests::detail_footer_lists_scroll_and_task_navigation_keys ... ok2109test tui::ui::footer::tests::detail_links_footer_advertises_navigation_controls ... ok2110test tui::ui::footer::tests::detail_mutation_hints_use_catalog_bindings ... ok2111test tui::ui::footer::tests::detail_selection_footer_advertises_copy_and_clear ... ok2112test tui::ui::footer::tests::footer_collapses_to_core_hints_when_narrow ... ok2113test tui::ui::footer::tests::footer_hides_marked_task_scope_when_marks_are_empty ... ok2114test tui::ui::footer::tests::footer_shows_marked_task_scope ... ok2115test tui::ui::footer::tests::list_footer_expands_intent_labels_when_wide ... ok2116test tui::ui::footer::tests::marked_scope_stays_out_of_detail_footer ... ok2117test tui::ui::footer::tests::marked_status_choice_keeps_scope_without_conflicting_clear_hint ... ok2118test tui::ui::footer::tests::recurrence_detail_footer_advertises_catalog_lifecycle_shortcuts ... ok2119test tui::ui::footer::tests::restore_hint_tracks_root_and_nested_deletion_state ... ok2120test tui::ui::header::tests::compact_header_omits_order_when_it_does_not_fit ... ok2121test tui::ui::header::tests::constrained_header_adds_only_complete_priority_metrics ... ok2122test tui::ui::header::tests::constrained_header_keeps_complete_filter_ahead_of_metrics ... ok2123test tui::ui::header::tests::header_click_targets_follow_rendered_segments ... ok2124test tui::ui::header::tests::header_parts_render_scope_view_metrics_filters_and_order ... ok2125test tui::ui::header::tests::header_segment_fit_requires_gap ... ok2126test tui::ui::header::tests::list_only_query_disables_layout_control_visually ... ok2127test tui::ui::header::tests::queue_header_shows_ranked_order_without_direction ... ok2128test tui::ui::header::tests::search_prompt_omits_match_count_filter ... ok2129test tui::ui::header::tests::sync_indicator_keeps_space_after_complete_left_segment ... ok2130test tui::ui::header::tests::sync_status_badge_distinguishes_errors_attention_and_disabled_sync ... ok2131test tui::ui::header::tests::update_badge_is_clear_clickable_and_visible_on_narrow_headers ... ok2132test tui::ui::input::tests::clipped_input_line_budgets_wide_characters_by_cells ... ok2133test tui::ui::input::tests::clipped_input_line_keeps_wide_cursor_visible ... ok2134test tui::ui::input::tests::clipped_input_line_scrolls_to_cursor_cell ... ok2135test tui::ui::input::tests::cursor_cell_has_correct_style ... ok2136test tui::ui::input::tests::input_cursor_handles_byte_indexed_unicode_cursor ... ok2137test tui::ui::input::tests::input_cursor_spans_draws_end_cursor_as_blank_cell ... ok2138test tui::ui::input::tests::input_line_draws_cursor_as_cell ... ok2139test tui::ui::input::tests::input_line_keeps_full_width_value_unclipped ... ok2140test tui::ui::input::tests::prefixed_input_line_preserves_prefix ... ok2141test tui::ui::overlays::changelog::tests::reader_adds_top_padding_and_styles_installed_badge ... ok2142test tui::ui::overlays::changelog::tests::reader_hides_link_destinations_and_reserves_scrollbar_gap ... ok2143test tui::ui::overlays::changelog::tests::reader_reflows_source_wrapped_entries_to_dialog_width ... ok2144test tui::ui::overlays::changelog::tests::relative_documentation_links_resolve_to_the_canonical_site ... ok2145test tui::ui::overlays::changelog::tests::rendered_markdown_links_have_mouse_targets ... ok2146test tui::ui::overlays::database_stats::tests::line_width_counts_wide_value_cells ... ok2147test tui::ui::overlays::onboarding::tests::completed_entrance_matches_stable_dialog ... ok2148test tui::ui::overlays::recurrence_history::tests::recurrence_history_full_page_reserves_footer_hints ... ok2149test tui::ui::overlays::recurrence_history::tests::recurrence_history_narrow_rows_keep_metadata_and_hit_testing_aligned ... ok2150test tui::ui::overlays::recurrence_history::tests::recurrence_history_pause_and_miss_markers_are_explicit ... ok2151test tui::ui::overlays::search::tests::padded_meta_line_fills_cell_width ... ok2152test tui::ui::overlays::search::tests::span_truncation_uses_cell_width ... ok2153test tui::ui::overlays::tests::add_task_overlay::add_task_child_modes_use_shared_dialog_and_control_styles ... ok2154test tui::ui::overlays::tests::add_task_overlay::add_task_description_blank_later_line_omits_placeholder ... ok2155test tui::ui::overlays::tests::add_task_overlay::add_task_description_empty_input_shows_placeholder ... ok2156test tui::ui::overlays::tests::add_task_overlay::add_task_description_empty_unfocused_shows_placeholder ... ok2157test tui::ui::overlays::tests::add_task_overlay::add_task_description_unfocused_preview_starts_at_top ... ok2158test tui::ui::overlays::tests::add_task_overlay::add_task_description_wraps_and_marks_hidden_rows ... ok2159test tui::ui::overlays::tests::add_task_overlay::add_task_empty_title_input_shows_placeholder ... ok2160test tui::ui::overlays::tests::add_task_overlay::add_task_empty_title_input_without_focus_omits_cursor ... ok2161test tui::ui::overlays::tests::add_task_overlay::add_task_metadata_title_labels_values ... ok2162test tui::ui::overlays::tests::add_task_overlay::add_task_metadata_values_use_shared_styles ... ok2163test tui::ui::overlays::tests::add_task_overlay::add_task_overlay_does_not_truncate_description_hints ... ok2164test tui::ui::overlays::tests::add_task_overlay::add_task_overlay_does_not_truncate_title_hints ... ok2165test tui::ui::overlays::tests::add_task_overlay::add_task_overlay_grows_for_wrapped_description ... ok2166test tui::ui::overlays::tests::add_task_overlay::add_task_overlay_keeps_space_above_shortcuts ... ok2167test tui::ui::overlays::tests::add_task_overlay::add_task_overlay_marks_automatic_status ... ok2168test tui::ui::overlays::tests::add_task_overlay::add_task_overlay_omits_title_placeholder_cursor_when_description_focused ... ok2169test tui::ui::overlays::tests::add_task_overlay::add_task_overlay_pins_footer_to_bottom ... ok2170test tui::ui::overlays::tests::add_task_overlay::add_task_overlay_renders_metadata_fields_and_footer ... ok2171test tui::ui::overlays::tests::add_task_overlay::add_task_overlay_replaces_footer_when_priority_prefix_is_active ... ok2172test tui::ui::overlays::tests::add_task_overlay::add_task_overlay_replaces_footer_when_status_prefix_is_active ... ok2173test tui::ui::overlays::tests::add_task_overlay::add_task_overlay_shows_pending_images ... ok2174test tui::ui::overlays::tests::add_task_overlay::add_task_overlay_starts_compact ... ok2175test tui::ui::overlays::tests::add_task_overlay::add_task_template_shows_natural_schedule_summary ... ok2176test tui::ui::overlays::tests::add_task_overlay::add_task_title_input_draws_cursor_as_cell ... ok2177test tui::ui::overlays::tests::add_task_overlay::add_task_title_input_draws_end_cursor_as_blank_cell ... ok2178test tui::ui::overlays::tests::add_task_overlay::add_task_title_input_scrolls_to_cursor_cell ... ok2179test tui::ui::overlays::tests::add_task_overlay::add_task_validation_and_help_are_visible ... ok2180test tui::ui::overlays::tests::add_task_overlay::add_task_wide_layout_bounds_long_metadata_values ... ok2181test tui::ui::overlays::tests::add_task_overlay::add_task_wide_medium_and_narrow_layouts_keep_every_field ... ok2182test tui::ui::overlays::tests::add_task_overlay::composer_help_expands_the_parent_dialog ... ok2183test tui::ui::overlays::tests::add_task_overlay::composer_help_scroll_cap_matches_add_task_layout ... ok2184test tui::ui::overlays::tests::add_task_overlay::composer_help_scrolls_with_a_stable_dialog_and_scrollbar ... ok2185test tui::ui::overlays::tests::add_task_overlay::composer_help_uses_muted_keys_and_dim_descriptions ... ok2186test tui::ui::overlays::tests::add_task_overlay::composer_shows_configured_natural_schedule_without_detail_fields ... ok2187test tui::ui::overlays::tests::add_task_overlay::focused_schedule_field_teaches_natural_input ... ok2188test tui::ui::overlays::tests::add_task_overlay::focused_schedule_field_waits_to_show_validation ... ok2189test tui::ui::overlays::tests::add_task_overlay::hint_lines_style_keys ... ok2190test tui::ui::overlays::tests::add_task_overlay::inactive_composer_headers_stay_distinct_from_placeholders ... ok2191test tui::ui::overlays::tests::add_task_overlay::malformed_recurrence_shows_recurrence_guidance ... ok2192test tui::ui::overlays::tests::add_task_overlay::metadata_grid_keeps_three_balanced_columns_above_title ... ok2193test tui::ui::overlays::tests::add_task_overlay::nested_controls_preserve_composer_height ... ok2194test tui::ui::overlays::tests::add_task_overlay::nested_schedule_editor_dims_only_its_underlay ... ok2195test tui::ui::overlays::tests::add_task_overlay::nested_schedule_editor_leaves_the_outer_surface_unchanged ... ok2196test tui::ui::overlays::tests::add_task_overlay::once_schedule_dialog_aligns_type_and_field_values ... ok2197test tui::ui::overlays::tests::add_task_overlay::once_schedule_dialog_explains_available_and_due_inputs ... ok2198test tui::ui::overlays::tests::add_task_overlay::recurring_schedule_dialog_keeps_validation_guidance_visible ... ok2199test tui::ui::overlays::tests::add_task_overlay::recurring_schedule_dialog_renders_fields_and_preview ... ok2200test tui::ui::overlays::tests::add_task_overlay::repeating_schedule_dialog_aligns_field_values ... ok2201test tui::ui::overlays::tests::add_task_overlay::repeating_schedule_dialog_waits_to_validate_an_empty_rule ... ok2202test tui::ui::overlays::tests::add_task_overlay::schedule_editor_keeps_the_composer_compact ... ok2203test tui::ui::overlays::tests::add_task_overlay::schedule_field_renders_natural_language_settings ... ok2204test tui::ui::overlays::tests::add_task_overlay::schedule_fields_align_with_the_metadata_grid ... ok2205test tui::ui::overlays::tests::add_task_overlay::schedule_hit_testing_uses_the_summary_row ... ok2206test tui::ui::overlays::tests::add_task_overlay::structured_schedule_dialog_stays_coherent_across_responsive_layouts ... ok2207test tui::ui::overlays::tests::add_task_overlay::structured_schedule_editor_preserves_composer_height ... ok2208test tui::ui::overlays::tests::confirm_overlays::available_update_combines_release_notes_and_actions ... ok2209test tui::ui::overlays::tests::confirm_overlays::compatibility_warning_recommends_updating_server_first ... ok2210test tui::ui::overlays::tests::confirm_overlays::confirm_overlay_wraps_long_prompt ... ok2211test tui::ui::overlays::tests::confirm_overlays::overlay_render_includes_confirm_prompt_and_hints ... ok2212test tui::ui::overlays::tests::confirm_overlays::update_overlay_explains_restart_and_cancellation ... ok2213test tui::ui::overlays::tests::database_stats_overlay::database_stats_overlay_renders_like_sync_status ... ok2214test tui::ui::overlays::tests::database_stats_overlay::database_stats_overlay_scroll_changes_visible_content ... ok2215test tui::ui::overlays::tests::metadata::blank_editor_disables_save_without_empty_string_instructions ... ok2216test tui::ui::overlays::tests::metadata::editor_footer_uses_shared_hotkey_styles_and_click_geometry ... ok2217test tui::ui::overlays::tests::metadata::editor_sizes_to_content_and_keeps_error_and_actions_visible ... ok2218test tui::ui::overlays::tests::metadata::every_visible_action_renders_its_projected_label_and_hotkey ... ok2219test tui::ui::overlays::tests::metadata::fields_align_values_and_show_unset_fields ... ok2220test tui::ui::overlays::tests::metadata::input_uses_shared_cursor_and_footer_packs_visible_actions ... ok2221test tui::ui::overlays::tests::metadata::metadata_uses_shared_dialog_chrome ... ok2222test tui::ui::overlays::tests::multiline_overlays::add_note_discard_confirmation_replaces_editor_with_explicit_controls ... ok2223test tui::ui::overlays::tests::multiline_overlays::add_note_empty_input_shows_placeholder ... ok2224test tui::ui::overlays::tests::multiline_overlays::add_note_overlay_hides_placeholder_on_later_empty_lines ... ok2225test tui::ui::overlays::tests::multiline_overlays::add_note_overlay_keeps_hints_visible_when_input_wraps ... ok2226test tui::ui::overlays::tests::multiline_overlays::add_note_overlay_uses_placeholder_key_styles_and_spacing ... ok2227test tui::ui::overlays::tests::multiline_overlays::add_task_natural_overlay_uses_kind_and_add_task_free_text_style ... ok2228test tui::ui::overlays::tests::multiline_overlays::conflict_manual_discard_confirmation_replaces_editor_with_explicit_controls ... ok2229test tui::ui::overlays::tests::multiline_overlays::conflict_manual_multiline_uses_placeholder_style ... ok2230test tui::ui::overlays::tests::multiline_overlays::description_discard_confirmation_replaces_editor_with_explicit_controls ... ok2231test tui::ui::overlays::tests::multiline_overlays::edit_description_blank_line_does_not_show_placeholder ... ok2232test tui::ui::overlays::tests::multiline_overlays::edit_description_cursor_row_tracks_wrapped_segment ... ok2233test tui::ui::overlays::tests::multiline_overlays::edit_description_empty_input_shows_placeholder ... ok2234test tui::ui::overlays::tests::multiline_overlays::edit_description_kind_does_not_use_natural_style_by_title ... ok2235test tui::ui::overlays::tests::multiline_overlays::edit_description_overlay_sizes_height_to_wrapped_content ... ok2236test tui::ui::overlays::tests::multiline_overlays::edit_description_overlay_width_tracks_terminal_size ... ok2237test tui::ui::overlays::tests::multiline_overlays::edit_description_overlay_wraps_long_lines ... ok2238test tui::ui::overlays::tests::multiline_overlays::edit_description_wraps_end_caret_after_exact_width_line ... ok2239test tui::ui::overlays::tests::multiline_overlays::overlay_render_includes_multiline_submit_hints ... ok2240test tui::ui::overlays::tests::multiline_overlays::overlay_render_omits_empty_multiline_prompt ... ok2241test tui::ui::overlays::tests::onboarding::welcome_card_renders_at_minimum_tui_size ... ok2242test tui::ui::overlays::tests::onboarding::welcome_card_styles_action_keys ... ok2243test tui::ui::overlays::tests::onboarding::welcome_card_uses_shared_dialog_chrome ... ok2244test tui::ui::overlays::tests::pairing_overlay::constrained_overlay_renders_complete_actionable_fallback_without_secrets ... ok2245test tui::ui::overlays::tests::pairing_overlay::header_wraps_complete_copy_without_overlapping_qr_or_footer ... ok2246test tui::ui::overlays::tests::pairing_overlay::layout_saturates_for_minimal_terminal_dimensions ... ok2247test tui::ui::overlays::tests::pairing_overlay::normal_overlay_renders_shared_compact_qr_rows ... ok2248test tui::ui::overlays::tests::pairing_overlay::overlay_presents_only_safe_pairing_data ... ok2249test tui::ui::overlays::tests::picker_overlays::blocker_picker_aligns_titles_after_different_ref_widths ... ok2250test tui::ui::overlays::tests::picker_overlays::blocker_picker_kind_uses_structured_task_renderer ... ok2251test tui::ui::overlays::tests::picker_overlays::blocker_picker_styles_task_reference_and_title ... ok2252test tui::ui::overlays::tests::picker_overlays::edit_project_uses_structured_project_picker ... ok2253test tui::ui::overlays::tests::picker_overlays::label_picker_aligns_wide_labels_by_cells ... ok2254test tui::ui::overlays::tests::picker_overlays::label_picker_uses_structured_usage_columns ... ok2255test tui::ui::overlays::tests::picker_overlays::picker_filter_mode_hints_show_text_entry ... ok2256test tui::ui::overlays::tests::picker_overlays::picker_navigation_mode_hides_filter_input ... ok2257test tui::ui::overlays::tests::picker_overlays::picker_rendered_rows_are_mouse_targets ... ok2258test tui::ui::overlays::tests::picker_overlays::picker_viewport_uses_scroll_position ... ok2259test tui::ui::overlays::tests::picker_overlays::priority_picker_shows_priority_icons ... ok2260test tui::ui::overlays::tests::picker_overlays::project_creation_suggestion_keeps_stable_prefix_color ... ok2261test tui::ui::overlays::tests::picker_overlays::project_path_project_selection_uses_structured_project_picker ... ok2262test tui::ui::overlays::tests::picker_overlays::project_picker_uses_structured_columns ... ok2263test tui::ui::overlays::tests::picker_overlays::project_scope_picker_shows_single_escape_cancellation ... ok2264test tui::ui::overlays::tests::picker_overlays::tag_combobox_shows_partial_label_membership ... ok2265test tui::ui::overlays::tests::picker_overlays::tag_combobox_shows_selected_labels_input_completion_and_matches ... ok2266test tui::ui::overlays::tests::picker_overlays::workspace_picker_shows_direct_filter_hints_and_no_match_state ... ok2267test tui::ui::overlays::tests::presentation_kind_rendering::add_note_kind_uses_specialized_renderer_with_changed_title ... ok2268test tui::ui::overlays::tests::presentation_kind_rendering::add_task_description_kind_uses_specialized_renderer_with_changed_title ... ok2269test tui::ui::overlays::tests::presentation_kind_rendering::add_task_priority_kind_uses_priority_renderer ... ok2270test tui::ui::overlays::tests::presentation_kind_rendering::edit_description_kind_uses_specialized_renderer_with_changed_title ... ok2271test tui::ui::overlays::tests::presentation_kind_rendering::overlay_kinds_use_shared_dialog_chrome ... ok2272test tui::ui::overlays::tests::presentation_kind_rendering::project_picker_kinds_control_submit_hints_with_changed_titles ... ok2273test tui::ui::overlays::tests::sync_status_overlay::conflicts_use_attention_color ... ok2274test tui::ui::overlays::tests::sync_status_overlay::details_reveal_internal_diagnostics ... ok2275test tui::ui::overlays::tests::sync_status_overlay::expanded_details_scroll_on_short_terminals ... ok2276test tui::ui::overlays::tests::sync_status_overlay::failures_are_visible_without_expanding_details ... ok2277test tui::ui::overlays::tests::sync_status_overlay::healthy_sync_status_renders_compact_summary ... ok2278test tui::ui::overlays::tests::sync_status_overlay::local_and_runtime_disabled_states_have_distinct_copy ... ok2279test tui::ui::overlays::tests::sync_status_overlay::manual_sync_is_available_when_automatic_sync_is_off ... ok2280test tui::ui::overlays::tests::sync_status_overlay::summary_fits_narrow_terminals ... ok2281test tui::ui::overlays::tests::text_input::delete_label_name_confirmation_renders_usage_without_clipping ... ok2282test tui::ui::overlays::tests::text_input::delete_project_name_confirmation_separates_prompt_and_input ... ok2283test tui::ui::overlays::tests::text_input::empty_placeholder_text_input_shows_placeholder ... ok2284test tui::ui::overlays::tests::text_input::mixed_date_edit_uses_keep_and_clear_hints ... ok2285test tui::ui::overlays::tests::text_input::overlay_render_includes_text_input_prompt_and_hints ... ok2286test tui::ui::overlays::tests::text_input::overlay_render_omits_empty_text_input_prompt ... ok2287test tui::ui::overlays::tests::text_input::placeholder_text_input_kinds_use_placeholder_style ... ok2288test tui::ui::overlays::tests::text_input::project_path_input_marks_truncated_side ... ok2289test tui::ui::overlays::tests::text_input::project_path_input_marks_wide_text_by_cell_position ... ok2290test tui::ui::overlays::tests::text_input::project_path_input_uses_wide_labeled_dialog ... ok2291test tui::ui::overlays::tests::text_panel_and_search::add_dependency_search_explains_blocker_selection ... ok2292test tui::ui::overlays::tests::text_panel_and_search::add_epic_child_create_action_spans_row_and_updates_enter_hint ... ok2293test tui::ui::overlays::tests::text_panel_and_search::add_epic_child_task_selection_uses_add_enter_hint ... ok2294test tui::ui::overlays::tests::text_panel_and_search::changelog_draws_shared_scrollbar_when_content_overflows ... ok2295test tui::ui::overlays::tests::text_panel_and_search::changelog_renders_markdown_and_reader_controls ... ok2296test tui::ui::overlays::tests::text_panel_and_search::overlay_render_includes_search_title_and_input ... ok2297test tui::ui::overlays::tests::text_panel_and_search::overlay_render_includes_text_panel_content_and_hint ... ok2298test tui::ui::overlays::tests::text_panel_and_search::search_overlay_colors_project_prefix ... ok2299test tui::ui::overlays::tests::text_panel_and_search::search_overlay_marks_epic_results_with_star ... ok2300test tui::ui::overlays::tests::text_panel_and_search::search_overlay_shows_empty_result_summary ... ok2301test tui::ui::overlays::tests::text_panel_and_search::search_overlay_vertical_position_ignores_result_count ... ok2302test tui::ui::overlays::tests::text_panel_and_search::stale_search_overlay_keeps_empty_state_blank ... ok2303test tui::ui::overlays::tests::text_panel_and_search::stale_search_overlay_preserves_cached_empty_summary ... ok2304test tui::ui::overlays::tests::text_panel_and_search::text_panel_rendered_border_matches_mouse_boundary ... ok2305test tui::ui::overlays::tests::text_panel_and_search::text_panel_scroll_offset_changes_visible_content ... ok2306test tui::ui::overlays::update::tests::focused_action_uses_a_filled_accent_without_text_decoration ... ok2307test tui::ui::recent_actions::tests::action_project_cell_keeps_trailing_summary_spacing ... ok2308test tui::ui::recent_actions::tests::action_project_cell_truncates_with_summary_spacing ... ok2309test tui::ui::recent_actions::tests::action_ref_cell_uses_task_ref_style ... ok2310test tui::ui::recent_actions::tests::selected_action_row_keeps_icon_regular_and_text_bold ... ok2311test tui::ui::recurrence::tests::occurrence_ref_uses_project_prefix_style ... ok2312test tui::ui::recurrence::tests::recurring_detail_keeps_hints_visible_with_scrollable_content ... ok2313test tui::ui::recurrence::tests::recurring_detail_uses_dialog_hierarchy_and_standard_hints ... ok2314test tui::ui::recurrence::tests::recurring_detail_uses_the_standard_rounded_dialog ... ok2315test tui::ui::recurrence::tests::recurring_preview_summarizes_series_and_current_task ... ok2316test tui::ui::recurrence::tests::recurring_series_preview_uses_task_list_height_breakpoints ... ok2317test tui::ui::scroll::tests::clamp_scroll_start_stops_at_max_start ... ok2318test tui::ui::scroll::tests::scrollbar_position_reaches_end_at_last_visible_row ... ok2319test tui::ui::shortcuts::tests::available_description_and_note_copy_hints_keep_normal_styles ... ok2320test tui::ui::shortcuts::tests::bulk_command_overlay_discloses_navigation_and_hidden_commands ... ok2321test tui::ui::shortcuts::tests::bulk_command_overlay_identifies_focused_commands ... ok2322test tui::ui::shortcuts::tests::bulk_command_overlay_shows_target_scope ... ok2323test tui::ui::shortcuts::tests::command_line_includes_multi_key_label ... ok2324test tui::ui::shortcuts::tests::command_overlay_does_not_highlight_without_cycle ... ok2325test tui::ui::shortcuts::tests::command_overlay_highlights_cycled_command_row ... ok2326test tui::ui::shortcuts::tests::command_overlay_keeps_arrow_selection_visible ... ok2327test tui::ui::shortcuts::tests::command_overlay_shows_one_compact_shortcut ... ok2328test tui::ui::shortcuts::tests::command_overlay_sizes_name_column_for_visible_commands ... ok2329test tui::ui::shortcuts::tests::command_overlay_truncates_descriptions_with_an_ellipsis ... ok2330test tui::ui::shortcuts::tests::command_overlay_uses_available_width_up_to_its_maximum ... ok2331test tui::ui::shortcuts::tests::command_rendered_rows_select_identical_catalog_candidates ... ok2332test tui::ui::shortcuts::tests::copy_prefix_groups_every_copy_action ... ok2333test tui::ui::shortcuts::tests::custom_command_keybinding_uses_prefix_hint_pipeline ... ok2334test tui::ui::shortcuts::tests::custom_command_palette_rows_right_align_origin_tag ... ok2335test tui::ui::shortcuts::tests::custom_target_palette_annotations_match_availability_in_list_and_detail ... ok2336test tui::ui::shortcuts::tests::detail_help_aligns_description_columns ... ok2337test tui::ui::shortcuts::tests::detail_help_includes_fixed_overlay_rows_and_catalog_commands ... ok2338test tui::ui::shortcuts::tests::detail_help_lists_recurrence_lifecycle_shortcuts ... ok2339test tui::ui::shortcuts::tests::detail_help_overlay_scrollbar_moves_with_scroll_offset ... ok2340test tui::ui::shortcuts::tests::detail_help_overlay_shows_detail_shortcuts ... ok2341test tui::ui::shortcuts::tests::detail_help_scroll_cap_uses_detail_rows ... ok2342test tui::ui::shortcuts::tests::detail_prefix_hint_lines_align_command_descriptions ... ok2343test tui::ui::shortcuts::tests::detail_prefix_hint_lines_use_detail_catalog ... ok2344test tui::ui::shortcuts::tests::focused_child_help_only_lists_child_actions ... ok2345test tui::ui::shortcuts::tests::focused_note_and_disclosure_help_exclude_task_mutations ... ok2346test tui::ui::shortcuts::tests::global_help_includes_upcoming_view_route ... ok2347test tui::ui::shortcuts::tests::global_help_overlay_draws_one_scrollbar ... ok2348test tui::ui::shortcuts::tests::help_columns_balance_section_rows ... ok2349test tui::ui::shortcuts::tests::help_columns_cover_every_command_section ... ok2350test tui::ui::shortcuts::tests::help_overlay_omits_command_names ... ok2351test tui::ui::shortcuts::tests::help_overlay_scrollbar_moves_with_scroll_offset ... ok2352test tui::ui::shortcuts::tests::help_overlay_shows_scroll_position ... ok2353test tui::ui::shortcuts::tests::help_overlays_draw_scrollbars_when_content_overflows ... ok2354test tui::ui::shortcuts::tests::help_overlays_render_title_edge_lines ... ok2355test tui::ui::shortcuts::tests::help_overlays_use_matching_bounds ... ok2356test tui::ui::shortcuts::tests::marked_copy_hints_keep_bulk_actions_and_dim_single_task_actions ... ok2357test tui::ui::shortcuts::tests::marked_edit_hints_show_scope_and_single_task_limits ... ok2358test tui::ui::shortcuts::tests::overlay_render_includes_command_title_and_input ... ok2359test tui::ui::shortcuts::tests::overlay_render_includes_help_title ... ok2360test tui::ui::shortcuts::tests::pairing_command_uses_canonical_label ... ok2361test tui::ui::shortcuts::tests::prefix_hint_lines_include_every_catalog_continuation ... ok2362test tui::ui::shortcuts::tests::prefix_hint_lines_show_remaining_chord_sequence ... ok2363test tui::ui::shortcuts::tests::prefix_hint_lines_use_shared_catalog ... ok2364test tui::ui::shortcuts::tests::prefix_hint_visible_rows_uses_available_terminal_height ... ok2365test tui::ui::shortcuts::tests::recurrence_palette_renders_disabled_reason ... ok2366test tui::ui::shortcuts::tests::unavailable_description_and_note_copy_hints_are_dimmed ... ok2367test tui::ui::shortcuts::tests::undo_description_is_shared_by_help_and_command_panel ... ok2368test tui::ui::shortcuts::tests::view_prefix_hints_include_upcoming ... ok2369test tui::ui::sidebar::tests::sidebar_entry_line_truncates_label_and_preserves_count ... ok2370test tui::ui::sidebar::tests::sidebar_icon_cell_uses_fixed_display_width ... ok2371test tui::ui::sidebar::tests::sidebar_section_indicators_are_right_aligned_without_overflow ... ok2372test tui::ui::splash::tests::check_pixels_are_purple_until_the_stroke_reaches_them ... ok2373test tui::ui::splash::tests::completed_afterglow_restores_the_dimmed_gradient ... ok2374test tui::ui::splash::tests::completed_draw_matches_source_raster ... ok2375test tui::ui::splash::tests::embedded_logo_contains_both_layers ... ok2376test tui::ui::splash::tests::splash_scales_within_terminal ... ok2377test tui::ui::sync_status_model::tests::blocking_errors_take_precedence_over_other_states ... ok2378test tui::ui::sync_status_model::tests::conflicts_are_attention_without_becoming_transport_errors ... ok2379test tui::ui::sync_status_model::tests::daemon_failures_are_visible_attention ... ok2380test tui::ui::sync_status_model::tests::disabled_sync_ignores_inactive_server_mismatches ... ok2381test tui::ui::sync_status_model::tests::local_and_runtime_disabled_states_stay_distinct ... ok2382test tui::ui::task_list::cells::tests::compact_status_column_applies_to_epic_child_rows ... ok2383test tui::ui::task_list::cells::tests::due_cell_colors_deadlines_by_urgency_and_dims_closed_tasks ... ok2384test tui::ui::task_list::cells::tests::epic_child_ref_prefix_aligns_tree_with_parent_marker ... ok2385test tui::ui::task_list::cells::tests::flat_row_marks_deferred_task_and_shows_availability_time ... ok2386test tui::ui::task_list::cells::tests::inline_title_editor_clips_to_cursor_cell ... ok2387test tui::ui::task_list::cells::tests::metadata_cell_highlights_parent_epic_of_selected_child ... ok2388test tui::ui::task_list::cells::tests::metadata_cell_ignores_description_without_notes ... ok2389test tui::ui::task_list::cells::tests::metadata_cell_marks_children_of_selected_epic ... ok2390test tui::ui::task_list::cells::tests::metadata_cell_marks_epics ... ok2391test tui::ui::task_list::cells::tests::metadata_cell_shows_dependency_counts ... ok2392test tui::ui::task_list::cells::tests::metadata_cell_shows_note_marker ... ok2393test tui::ui::task_list::cells::tests::project_cell_truncates_with_status_spacing ... ok2394test tui::ui::task_list::cells::tests::queue_row_time_uses_queue_idle_duration ... ok2395test tui::ui::task_list::cells::tests::selected_and_unselected_refs_start_at_the_same_cell ... ok2396test tui::ui::task_list::cells::tests::task_row_cells_insert_metadata_between_title_and_project ... ok2397test tui::ui::task_list::cells::tests::task_row_cells_use_inline_title_when_selected ... ok2398test tui::ui::task_list::cells::tests::task_state_prefix_distinguishes_cursor_and_mark_states ... ok2399test tui::ui::task_list::hit_test::tests::task_at_position_ignores_scrollbar_column ... ok2400test tui::ui::task_list::hit_test::tests::task_at_position_respects_scroll_position ... ok2401test tui::ui::task_list::hit_test::tests::task_at_position_skips_queue_group_rows ... ok2402test tui::ui::task_list::layout::tests::all_zero_width_fallback_still_has_a_state_gutter ... ok2403test tui::ui::task_list::layout::tests::default_geometry_preserves_expansion_and_gutters_at_all_widths ... ok2404test tui::ui::task_list::layout::tests::fallback_state_gutter_preserves_single_column_content_width ... ok2405test tui::ui::task_list::layout::tests::hidden_columns_have_no_cells_or_gutters ... ok2406test tui::ui::task_list::layout::tests::hidden_status_has_no_state_column_or_hit_area ... ok2407test tui::ui::task_list::layout::tests::reordering_preserves_fixed_content_widths_and_collapsed_columns ... ok2408test tui::ui::task_list::preview::tests::preview_bounds_wrapped_markdown_to_available_height ... ok2409test tui::ui::task_list::preview::tests::preview_marks_epic_parent_with_star ... ok2410test tui::ui::task_list::preview::tests::preview_renders_markdown_blocks_and_inline_styles ... ok2411test tui::ui::task_list::preview::tests::preview_shows_child_tasks_for_epic_parent ... ok2412test tui::ui::task_list::preview::tests::preview_uses_single_remaining_line_for_description ... ok2413test tui::ui::task_list::preview::tests::task_preview_fields_show_created_timestamp ... ok2414test tui::ui::task_list::preview::tests::task_preview_omits_elapsed_availability ... ok2415test tui::ui::task_list::preview::tests::task_preview_shows_availability_and_due_date_responsively ... ok2416test tui::ui::task_list::preview::tests::task_preview_shows_future_availability ... ok2417test tui::ui::task_list::preview::tests::task_preview_timing_lines_preserve_absent_values ... ok2418test tui::ui::task_list::sizing::tests::label_column_width_collapses_in_narrow_layout ... ok2419test tui::ui::task_list::sizing::tests::label_column_width_collapses_without_visible_labels ... ok2420test tui::ui::task_list::sizing::tests::label_column_width_counts_wide_label_cells ... ok2421test tui::ui::task_list::sizing::tests::label_column_width_reserves_lane_for_visible_labels ... ok2422test tui::ui::task_list::sizing::tests::label_column_width_uses_visible_task_labels ... ok2423test tui::ui::task_list::sizing::tests::metadata_column_width_collapses_without_metadata ... ok2424test tui::ui::task_list::sizing::tests::metadata_column_width_reserves_lane_for_deferred_marker ... ok2425test tui::ui::task_list::sizing::tests::metadata_column_width_reserves_lane_for_epics ... ok2426test tui::ui::task_list::sizing::tests::metadata_column_width_reserves_lane_for_metadata ... ok2427test tui::ui::task_list::sizing::tests::metadata_column_width_uses_given_task_refs ... ok2428test tui::ui::task_list::sizing::tests::priority_column_width_collapses_without_priority ... ok2429test tui::ui::task_list::sizing::tests::priority_column_width_reserves_lane_for_priority ... ok2430test tui::ui::task_list::sizing::tests::project_column_width_counts_wide_key_cells ... ok2431test tui::ui::task_list::table::tests::blocked_rows_are_dimmed_unless_selected ... ok2432test tui::ui::task_list::table::tests::default_status_column_shows_text_header_and_status ... ok2433test tui::ui::task_list::table::tests::due_order_labels_and_populates_due_column ... ok2434test tui::ui::task_list::table::tests::inline_title_editor_draws_end_cursor_in_title_column ... ok2435test tui::ui::task_list::table::tests::label_header_cell_aligns_with_label_column_content ... ok2436test tui::ui::task_list::table::tests::list_scrollbar_area_skips_header_row ... ok2437test tui::ui::task_list::table::tests::normal_row_keeps_title_rendering_without_inline_editor ... ok2438test tui::ui::task_list::table::tests::selected_row_renders_inline_title_editor ... ok2439test tui::ui::task_list::table::tests::task_header_labels_age_column ... ok2440test tui::ui::task_list::table::tests::task_header_labels_mixed_deferred_time_column ... ok2441test tui::ui::task_list::table::tests::task_scrollbar_draws_on_right_side ... ok2442test tui::ui::task_list::tests::columns::configured_subset_hides_columns_and_keeps_status_geometry ... ok2443test tui::ui::task_list::tests::columns::dedicated_due_column_keeps_time_contextual ... ok2444test tui::ui::task_list::tests::columns::due_column_leaves_undated_tasks_blank ... ok2445test tui::ui::task_list::tests::columns::due_column_shows_every_row_deadline_across_views_and_ordering ... ok2446test tui::ui::task_list::tests::columns::empty_content_singletons_keep_a_visible_state_target ... ok2447test tui::ui::task_list::tests::columns::explicit_default_order_preserves_rendering ... ok2448test tui::ui::task_list::tests::columns::fallback_state_gutter_keeps_singletons_usable_at_narrow_widths ... ok2449test tui::ui::task_list::tests::columns::fallback_state_gutter_preserves_single_column_content ... ok2450test tui::ui::task_list::tests::columns::hidden_columns_fit_a_narrow_table_without_phantom_gaps ... ok2451test tui::ui::task_list::tests::columns::hidden_ref_keeps_selection_and_marks_on_title ... ok2452test tui::ui::task_list::tests::columns::hidden_status_has_no_mouse_target_but_rows_remain_selectable ... ok2453test tui::ui::task_list::tests::columns::ref_header_aligns_with_task_refs ... ok2454test tui::ui::task_list::tests::columns::reordered_columns_align_headers_content_and_status_hits ... ok2455test tui::ui::task_list::tests::columns::reordered_time_column_keeps_contextual_headings_and_values ... ok2456test tui::ui::task_list::tests::empty_state::empty_epics_view_teaches_closed_filter ... ok2457test tui::ui::task_list::tests::empty_state::empty_filtered_task_list_offers_to_clear_filters ... ok2458test tui::ui::task_list::tests::empty_state::empty_state_classifies_named_and_specialized_surfaces ... ok2459test tui::ui::task_list::tests::empty_state::empty_task_list_adapts_to_short_and_narrow_bodies ... ok2460test tui::ui::task_list::tests::empty_state::empty_task_list_keeps_header_and_invites_first_task ... ok2461test tui::ui::task_list::tests::empty_state::populated_task_list_preserves_rows_without_empty_prompt ... ok2462test tui::ui::task_list::tests::epics::collapsed_epic_rows_show_outcomes_signals_and_subtree_activity ... ok2463test tui::ui::task_list::tests::epics::empty_epic_row_uses_standard_placeholders ... ok2464test tui::ui::task_list::tests::epics::epic_columns_keep_a_blank_gutter_at_normal_and_narrow_widths ... ok2465test tui::ui::task_list::tests::epics::epic_header_switches_between_activity_and_due_semantics ... ok2466test tui::ui::task_list::tests::epics::epic_summary_keeps_parent_task_metadata_in_its_own_lane ... ok2467test tui::ui::task_list::tests::epics::epic_summary_preserves_outcome_and_signal_semantics ... ok2468test tui::ui::task_list::tests::epics::epic_time_column_uses_subtree_activity_and_respects_due_order ... ok2469test tui::ui::task_list::tests::epics::expanded_epic_rows_keep_child_title_and_status_legible ... ok2470test tui::ui::task_list::tests::epics::hidden_ref_and_status_keep_epic_rollups_and_child_rows ... ok2471test tui::ui::task_list::tests::epics::narrow_epic_rows_preserve_rollup_and_core_task_fields ... ok2472test tui::ui::task_list::tests::epics::reordered_epics_keep_summary_and_inline_editing_in_semantic_cells ... ok2473test tui::ui::task_list::tests::interaction::compact_status_column_shows_single_letter_header_and_icon ... ok2474test tui::ui::task_list::tests::interaction::deleted_row_marks_metadata_column_and_keeps_status ... ok2475test tui::ui::task_list::tests::interaction::epic_status_hit_testing_tracks_parent_and_expanded_child_rows ... ok2476test tui::ui::task_list::tests::interaction::recurring_rows_and_preview_show_series_context ... ok2477test tui::ui::task_list::tests::interaction::task_status_at_position_only_hits_status_column ... ok2478test tui::ui::task_list::tests::interaction::task_status_at_position_respects_wide_sidebar_offset ... ok2479test tui::ui::task_list::view_model::tests::collapsed_epic_parent_emits_only_parent_row ... ok2480test tui::ui::task_list::view_model::tests::downward_selection_scrolls_after_bottom_edge ... ok2481test tui::ui::task_list::view_model::tests::empty_task_view_has_no_rows ... ok2482test tui::ui::task_list::view_model::tests::epics_visual_row_finds_child_row ... ok2483test tui::ui::task_list::view_model::tests::expanded_epic_includes_resolved_children ... ok2484test tui::ui::task_list::view_model::tests::expanded_epic_parent_emits_child_row ... ok2485test tui::ui::task_list::view_model::tests::expanded_epic_skips_missing_child_tasks ... ok2486test tui::ui::task_list::view_model::tests::grouped_queue_top_scroll_keeps_scrollbar_at_top ... ok2487test tui::ui::task_list::view_model::tests::non_queue_sort_does_not_emit_duplicate_status_groups ... ok2488test tui::ui::task_list::view_model::tests::project_filtered_queue_view_groups_by_queue_band ... ok2489test tui::ui::task_list::view_model::tests::queue_sticky_header_counts_toward_scroll_visibility ... ok2490test tui::ui::task_list::view_model::tests::queue_view_groups_epics_separately ... ok2491test tui::ui::task_list::view_model::tests::queue_view_groups_terminal_statuses_by_status ... ok2492test tui::ui::task_list::view_model::tests::queue_view_keeps_group_header_with_first_visible_task ... ok2493test tui::ui::task_list::view_model::tests::queue_view_keeps_nonadjacent_equal_bands_in_separate_groups ... ok2494test tui::ui::task_list::view_model::tests::returning_to_first_row_resets_scroll_to_top ... ok2495test tui::ui::task_list::view_model::tests::scrollbar_position_maps_max_scroll_to_end ... ok2496test tui::ui::task_list::view_model::tests::task_list_scroll_clamps_to_valid_rows ... ok2497test tui::ui::task_list::view_model::tests::upward_selection_from_bottom_keeps_final_queue_group_visible ... ok2498test tui::ui::task_list::view_model::tests::upward_selection_from_bottom_keeps_scroll_at_bottom_until_top_edge ... ok2499test tui::ui::task_list::view_model::tests::visual_row_uses_planned_rows ... ok2500test tui::ui::timestamps::tests::local_timestamp_display_keeps_unparsed_values ... ok2501test tui::ui::timestamps::tests::optional_local_timestamp_display_uses_fallback_for_absent_values ... ok2502test tui::ui::timestamps::tests::relative_timestamp_display_formats_recent_values ... ok2503test tui::ui::timestamps::tests::timestamp_display_uses_given_offset ... ok2504test tui::ui::toast::tests::iconless_info_toast_omits_dot ... ok2505test tui::ui::toast::tests::neutral_message_text_can_render_as_info ... ok2506test tui::ui::toast::tests::toast_separators_use_muted_text_color ... ok2507test tui::ui::toast::tests::toast_tone_uses_explicit_severity ... ok2508test tui::ui::toast::tests::toast_tone_uses_severity_colors ... ok2509test tui::ui::toast::tests::toast_uses_icon_and_message ... ok2510test tui::ui::toast::tests::toast_width_counts_wide_content_cells ... ok2511test tui::ui::truncate::tests::truncates_styled_wide_spans_to_cell_width ... ok2512test tui::widgets::tests::label_cell_hides_labels_when_space_is_tight ... ok2513test tui::widgets::tests::label_cell_right_aligns_summary_when_space_allows ... ok2514test tui::widgets::tests::label_cell_sizes_wide_labels_by_cells ... ok2515test tui::widgets::tests::label_cell_uses_dim_text ... ok2516test tui::widgets::tests::status_icon_cell_uses_status_style ... ok2517test tui::widgets::tests::status_icons_cover_every_status_distinctly ... ok2518test tui::widgets::tests::title_cell_truncates_title_when_labels_are_hidden ... ok2519test tui::widgets::tests::title_cell_truncates_wide_titles_by_cells ... ok2520test update::cache::tests::cache_base_uses_xdg_then_dot_cache_on_every_platform ... ok2521test update::cache::tests::cached_outcome_uses_semver_precedence ... ok2522test update::cache::tests::empty_cache_has_no_outcome ... ok2523test update::cache::tests::failures_back_off_to_a_daily_cap ... ok2524test update::cache::tests::later_hides_one_version_for_seven_days ... ok2525test update::cache::tests::scheduling_respects_future_attempt_and_clock_skew ... ok2526test update::compatibility::tests::absent_server_and_current_protocol_need_no_probe ... ok2527test update::compatibility::tests::classifies_a_server_protocol_mismatch ... ok2528test update::compatibility::tests::parses_only_exact_protocol_mismatch_errors ... ok2529test update::compatibility::tests::retained_support_requires_matching_active_and_preserved_baseline ... ok2530test update::eligibility::tests::classifies_direct_unwritable_and_unsupported_paths ... ok2531test update::eligibility::tests::classifies_managed_and_development_paths_before_writability ... ok2532test update::install::tests::checksum_requires_hash_and_expected_filename ... ok2533test update::install::tests::extraction_accepts_only_one_root_binary ... ok2534test update::release::tests::baseline_marker_does_not_change_legacy_active_marker ... ok2535test update::release::tests::parses_release_and_strips_v_for_semver ... ok2536test update::release::tests::reads_exactly_one_valid_sync_protocol_marker ... ok2537test update::release::tests::rejects_malformed_version_and_missing_or_duplicate_assets ... ok2538test update::release::tests::rejects_non_github_asset_urls ... ok2539test update::tests::cancellation_is_reported ... ok2540test update::tests::package_version_is_semver ... ok25412542test result: ok. 1919 passed; 0 failed; 0 ignored; 0 measured; 20 filtered out; finished in 142.90s25432544 Running unittests src/main.rs (target/aarch64-apple-darwin/debug/deps/aven-ca4b8cb57378fbc1)25452546running 0 tests25472548test result: ok. 0 passed; 0 failed; 0 ignored; 0 measured; 0 filtered out; finished in 0.00s25492550 Running tests/cli_attachment_lifecycle.rs (target/aarch64-apple-darwin/debug/deps/cli_attachment_lifecycle-7bc5767cb501906f)25512552running 3 tests2553test attachment_prune_dry_run_and_apply_are_stable_and_private ... ok2554test doctor_reports_attachment_lifecycle_categories ... ok2555test quota_failure_recovers_after_reference_pruning ... ok25562557test result: ok. 3 passed; 0 failed; 0 ignored; 0 measured; 0 filtered out; finished in 2.18s25582559 Running tests/cli_compat.rs (target/aarch64-apple-darwin/debug/deps/cli_compat-d6112c454cd4fcb5)25602561running 2 tests2562test old_schema_database_can_be_opened_and_read ... ok2563test taskless_outcomes_return_to_derived_gaps_on_upgrade ... ok25642565test result: ok. 2 passed; 0 failed; 0 ignored; 0 measured; 0 filtered out; finished in 0.27s25662567 Running tests/cli_config_daemon.rs (target/aarch64-apple-darwin/debug/deps/cli_config_daemon-a094eced61394f56)25682569running 6 tests2570test config_get_reports_defaults_and_unset_optional_values ... ok2571test config_get_reports_every_supported_scalar_without_exposing_secrets ... ok2572test config_help_lists_scalar_commands_and_non_secret_keys ... ok2573test config_set_persists_every_supported_scalar_and_preserves_user_text ... ok2574test config_set_rejects_inline_mappings_instead_of_reformatting_them ... ok2575test config_set_rejects_invalid_keys_and_values_without_changing_the_file ... ok25762577test result: ok. 6 passed; 0 failed; 0 ignored; 0 measured; 0 filtered out; finished in 0.23s25782579 Running tests/cli_conflicts.rs (target/aarch64-apple-darwin/debug/deps/cli_conflicts-33544e8cbc50d11e)25802581running 9 tests2582test conflict_export_and_diff_write_variant_files ... ok2583test conflict_list_json_supports_limit ... ok2584test conflict_show_json_returns_detail ... ok2585test conflicted_field_is_protected_but_other_fields_work ... ok2586test invalid_deleted_conflict_resolution_preserves_task_and_change_log ... ok2587test remote_epic_demotion_conflict_displays_on_off ... ok2588test resolve_conflict_by_stdin_syncs ... ok2589test resolve_conflict_by_variant_syncs ... ok2590test same_field_edit_creates_conflict ... ok25912592test result: ok. 9 passed; 0 failed; 0 ignored; 0 measured; 0 filtered out; finished in 4.47s25932594 Running tests/cli_context.rs (target/aarch64-apple-darwin/debug/deps/cli_context-7fffb87ef07146fc)25952596running 3 tests2597test context_includes_attachment_metadata ... ok2598test context_includes_unresolved_conflicts ... ok2599test context_json_contains_structured_snapshot ... ok26002601test result: ok. 3 passed; 0 failed; 0 ignored; 0 measured; 0 filtered out; finished in 0.92s26022603 Running tests/cli_daemon_sync.rs (target/aarch64-apple-darwin/debug/deps/cli_daemon_sync-dacb6a5554449cf3)26042605running 7 tests2606test daemon_attachment_maintenance_prunes_grace_expired_attachment ... ok2607test daemon_periodic_syncs_without_wake ... ok2608test daemon_refuses_wake_port_that_is_already_bound ... ok2609test daemon_reports_startup_configuration_errors ... ok2610test daemon_syncs_large_backlog_across_budgeted_rounds ... ok2611test daemon_wake_syncs_representative_mutations ... ok2612test daemon_wakes_respect_failure_deadlines_and_recover ... FAILED26132614failures:26152616---- daemon_wakes_respect_failure_deadlines_and_recover stdout ----26172618thread 'daemon_wakes_respect_failure_deadlines_and_recover' (23661942) panicked at tests/cli_daemon_sync.rs:474:9:2619assertion `left == right` failed: wake bypassed retry deadline2620 left: 32621 right: 22622note: run with `RUST_BACKTRACE=1` environment variable to display a backtrace262326242625failures:2626 daemon_wakes_respect_failure_deadlines_and_recover26272628test result: FAILED. 6 passed; 1 failed; 0 ignored; 0 measured; 0 filtered out; finished in 11.39s26292630error: test failed, to rerun pass `--test cli_daemon_sync`