setup
checks.aarch64-darwin.pkgs-aven
· build #5753
· raw
1these 5 derivations will be built:2 /nix/store/05xbvpc8ap4b5v2fc8bdb9pyhzrzqzp4-source.drv3 /nix/store/6pz7xgfdzaii9bbpajhpgbzkpz77mlxk-aven-0.1.44-vendor-staging.drv4 /nix/store/y92isrddd852yqa9l78d8rkpawcrdjmd-aven-0.1.44-vendor.drv5 /nix/store/361hpsl5s1qylskpicjri8ck8wkggajl-aven-0.1.44.drv6 /nix/store/n05qdnqz34graf98fnfpdqjjgjxv7x0x-check-aven.drv7error: build of '/nix/store/361hpsl5s1qylskpicjri8ck8wkggajl-aven-0.1.44.drv' on 'ssh-ng://customer@mac02.m.ntd.one' failed: Cannot build '/nix/store/361hpsl5s1qylskpicjri8ck8wkggajl-aven-0.1.44.drv'.8 Reason: builder failed with exit code 101.9 Output paths:10 /nix/store/qcv5bj5fwgzrfmwn1vvcggklf8fnkz83-aven-0.1.4411 Last 25 log lines:12 > test daemon_attachment_maintenance_prunes_grace_expired_attachment ... ok13 > test daemon_periodic_syncs_without_wake ... ok14 > test daemon_refuses_wake_port_that_is_already_bound ... ok15 > test daemon_reports_startup_configuration_errors ... ok16 > test daemon_syncs_large_backlog_across_budgeted_rounds ... ok17 > test daemon_wake_syncs_representative_mutations ... ok18 > test daemon_wakes_respect_failure_deadlines_and_recover ... FAILED19 >20 > failures:21 >22 > ---- daemon_wakes_respect_failure_deadlines_and_recover stdout ----23 >24 > thread 'daemon_wakes_respect_failure_deadlines_and_recover' (23661942) panicked at tests/cli_daemon_sync.rs:474:9:25 > assertion `left == right` failed: wake bypassed retry deadline26 > left: 327 > right: 228 > note: run with `RUST_BACKTRACE=1` environment variable to display a backtrace29 >30 >31 > failures:32 > daemon_wakes_respect_failure_deadlines_and_recover33 >34 > test result: FAILED. 6 passed; 1 failed; 0 ignored; 0 measured; 0 filtered out; finished in 11.39s35 >36 > error: test failed, to rerun pass `--test cli_daemon_sync`37 For full logs, run:38 nix log /nix/store/361hpsl5s1qylskpicjri8ck8wkggajl-aven-0.1.44.drv39error: Cannot build '/nix/store/361hpsl5s1qylskpicjri8ck8wkggajl-aven-0.1.44.drv'.40 Reason: builder failed with exit code 1.41 Output paths:42 /nix/store/qcv5bj5fwgzrfmwn1vvcggklf8fnkz83-aven-0.1.4443error: Cannot build '/nix/store/n05qdnqz34graf98fnfpdqjjgjxv7x0x-check-aven.drv'.44 Reason: 1 dependency failed.45 Output paths:46 /nix/store/nrj3khk5178g9y3vc10192n6fyhgsh34-check-aven