setup
checks.aarch64-linux.pkgs-clauth
· build #5736
· raw
1these 2 derivations will be built:2 /nix/store/qnyx8kv2yg0ns5bkavpbiapdz9ap3xpc-clauth-0.16.0.drv3 /nix/store/hjsrzaj7jlndic4yb4ljpjh3y82zjhsj-check-clauth.drv4error: build of '/nix/store/qnyx8kv2yg0ns5bkavpbiapdz9ap3xpc-clauth-0.16.0.drv' on 'grpc://farm.numtide.com:50051?client-cert=/run/secrets/vars/per-machine/bld1/nix-farm-ci/crt&client-key=/run/secrets/vars/per-machine/bld1/nix-farm-ci/key&connect-timeout=23&system=aarch64-linux' failed: Cannot build '/nix/store/qnyx8kv2yg0ns5bkavpbiapdz9ap3xpc-clauth-0.16.0.drv'.5 Reason: builder failed with exit code 101.6 Output paths:7 /nix/store/40385qw8mh3g9qcibwd4y21mcw4a32rv-clauth-0.16.08 Last 25 log lines:9 > test watchdog::tests::a_dir_watch_survives_the_rename_that_publishes_a_file ... ok10 > test watchdog::tests::the_poll_fallback_reconciles_when_no_directory_can_be_armed ... ok11 > test watchdog::tests::a_sustained_event_stream_wakes_once_per_window_not_once_per_burst ... ok12 > test watchdog::tests::the_cooldown_is_measured_from_the_end_of_the_reconcile ... ok13 >14 > failures:15 >16 > ---- daemon::api::terminal::tests::strip_session_env_removes_every_session_var stdout ----17 >18 > thread 'daemon::api::terminal::tests::strip_session_env_removes_every_session_var' (6406) panicked at src/daemon/api/../../../tests/inline/daemon_api_terminal.rs:167:28:19 > run env: Os { code: 2, kind: NotFound, message: "No such file or directory" }20 >21 > ---- daemon::api::tests::a_silent_client_is_dropped_without_holding_a_slot_for_the_whole_lifetime stdout ----22 >23 > thread 'daemon::api::tests::a_silent_client_is_dropped_without_holding_a_slot_for_the_whole_lifetime' (6442) panicked at src/daemon/api/../../../tests/inline/daemon_api_server.rs:559:54:24 > fixture: "openssl failed to generate a named-curve key"25 >26 >27 > failures:28 > daemon::api::terminal::tests::strip_session_env_removes_every_session_var29 > daemon::api::tests::a_silent_client_is_dropped_without_holding_a_slot_for_the_whole_lifetime30 >31 > test result: FAILED. 4155 passed; 2 failed; 1 ignored; 0 measured; 6 filtered out; finished in 589.57s32 >33 > error: test failed, to rerun pass `--bin clauth`34 For full logs, run:35 nix log /nix/store/qnyx8kv2yg0ns5bkavpbiapdz9ap3xpc-clauth-0.16.0.drv36error: Cannot build '/nix/store/qnyx8kv2yg0ns5bkavpbiapdz9ap3xpc-clauth-0.16.0.drv'.37 Reason: builder failed with exit code 1.38 Output paths:39 /nix/store/40385qw8mh3g9qcibwd4y21mcw4a32rv-clauth-0.16.040error: Cannot build '/nix/store/hjsrzaj7jlndic4yb4ljpjh3y82zjhsj-check-clauth.drv'.41 Reason: 1 dependency failed.42 Output paths:43 /nix/store/604raxh7bahs4hfqnsym59rr5v7czvxk-check-clauth