setup
checks.x86_64-linux.pkgs-kandev
· build #5726
· raw
1these 2 derivations will be built:2 /nix/store/hv9lh71fm660632f8yn1l1lyk2kcxz98-kandev-0.96.0.drv3 /nix/store/fwm9zf0a1yy9n44623wd0z62w373lpg2-check-kandev.drv4error: Cannot build '/nix/store/hv9lh71fm660632f8yn1l1lyk2kcxz98-kandev-0.96.0.drv'.5 Reason: builder failed with exit code 1.6 Output paths:7 /nix/store/mbgs4w1zwgp6gnfxbgr0y5fw133394l3-kandev-0.96.08 Last 25 log lines:9 > patching file apps/backend/internal/agent/agents/copilot_acp_test.go10 > patching file apps/backend/internal/agent/agents/droid_acp.go11 > patching file apps/backend/internal/agent/agents/gemini.go12 > patching file apps/backend/internal/agent/agents/kilocode_acp.go13 > patching file apps/backend/internal/agent/agents/native_binary_agents_test.go14 > patching file apps/backend/internal/agent/agents/qwen_acp.go15 > patching file apps/backend/internal/agent/hostutility/manager.go16 > Hunk #3 succeeded at 840 (offset 1 line).17 > patching file apps/backend/internal/agent/hostutility/native_binary_test.go18 > patching file apps/backend/internal/agent/registry/provider.go19 > patching file apps/backend/internal/agent/runtime/lifecycle/manager_launch.go20 > patching file apps/backend/internal/agent/runtime/lifecycle/manager_launch_test.go21 > patching file apps/backend/internal/agent/runtime/lifecycle/utility.go22 > Hunk #3 FAILED at 89.23 > Hunk #4 succeeded at 172 with fuzz 2 (offset 1 line).24 > 1 out of 4 hunks FAILED -- saving rejects to file apps/backend/internal/agent/runtime/lifecycle/utility.go.rej25 > patching file apps/backend/internal/agent/runtime/lifecycle/utility_test.go26 > patching file apps/backend/internal/agent/settings/controller/agent_config.go27 > patching file apps/backend/internal/agent/settings/controller/controller_test.go28 > Hunk #2 FAILED at 678.29 > 1 out of 2 hunks FAILED -- saving rejects to file apps/backend/internal/agent/settings/controller/controller_test.go.rej30 > patching file apps/backend/internal/agentctl/server/utility/acp_executor.go31 > Hunk #1 succeeded at 1243 (offset 16 lines).32 > Hunk #2 succeeded at 1259 (offset 16 lines).33 > patching file apps/backend/internal/agentctl/server/utility/probe_allowlist_test.go34 For full logs, run:35 nix log /nix/store/hv9lh71fm660632f8yn1l1lyk2kcxz98-kandev-0.96.0.drv36error: Cannot build '/nix/store/fwm9zf0a1yy9n44623wd0z62w373lpg2-check-kandev.drv'.37 Reason: 1 dependency failed.38 Output paths:39 /nix/store/dfvqj9p0djhjj86yarizbac72qfzvcqv-check-kandev