nixbot

builds

failed kandev-0.96.0 checks.x86_64-linux.pkgs-kandev · build #5682 · raw

1Using versionCheckHook
unpackPhase
2unpacking source archive /nix/store/biyrdawxng35f4q2zi7qpgdmlv0wrihr-source3source root is source
patchPhase
4applying patch /nix/store/s2h13pjcbgq19f41jxn9ygbr1np7hs8q-prefer-native-acp-runtimes.patch5patching file apps/backend/internal/agent/agents/copilot_acp.go6patching file apps/backend/internal/agent/agents/copilot_acp_test.go7patching file apps/backend/internal/agent/agents/droid_acp.go8patching file apps/backend/internal/agent/agents/gemini.go9patching file apps/backend/internal/agent/agents/kilocode_acp.go10patching file apps/backend/internal/agent/agents/native_binary_agents_test.go11patching file apps/backend/internal/agent/agents/qwen_acp.go12patching file apps/backend/internal/agent/hostutility/manager.go13Hunk #3 succeeded at 840 (offset 1 line).14patching file apps/backend/internal/agent/hostutility/native_binary_test.go15patching file apps/backend/internal/agent/registry/provider.go16patching file apps/backend/internal/agent/runtime/lifecycle/manager_launch.go17patching file apps/backend/internal/agent/runtime/lifecycle/manager_launch_test.go18patching file apps/backend/internal/agent/runtime/lifecycle/utility.go19Hunk #3 FAILED at 89.20Hunk #4 succeeded at 172 with fuzz 2 (offset 1 line).211 out of 4 hunks FAILED -- saving rejects to file apps/backend/internal/agent/runtime/lifecycle/utility.go.rej22patching file apps/backend/internal/agent/runtime/lifecycle/utility_test.go23patching file apps/backend/internal/agent/settings/controller/agent_config.go24patching file apps/backend/internal/agent/settings/controller/controller_test.go25Hunk #2 FAILED at 678.261 out of 2 hunks FAILED -- saving rejects to file apps/backend/internal/agent/settings/controller/controller_test.go.rej27patching file apps/backend/internal/agentctl/server/utility/acp_executor.go28Hunk #1 succeeded at 1243 (offset 16 lines).29Hunk #2 succeeded at 1259 (offset 16 lines).30patching file apps/backend/internal/agentctl/server/utility/probe_allowlist_test.go