nixbot

builds
1elastic-arm-caf92e2d: building 3g2hvl9hh739qc7nbvly64czlzvf5mjx-kandev-0.96.0.drv2Using versionCheckHook
unpackPhase
3unpacking source archive /nix/store/biyrdawxng35f4q2zi7qpgdmlv0wrihr-source4source root is source
patchPhase
5applying patch /nix/store/s2h13pjcbgq19f41jxn9ygbr1np7hs8q-prefer-native-acp-runtimes.patch6patching file apps/backend/internal/agent/agents/copilot_acp.go7patching file apps/backend/internal/agent/agents/copilot_acp_test.go8patching file apps/backend/internal/agent/agents/droid_acp.go9patching file apps/backend/internal/agent/agents/gemini.go10patching file apps/backend/internal/agent/agents/kilocode_acp.go11patching file apps/backend/internal/agent/agents/native_binary_agents_test.go12patching file apps/backend/internal/agent/agents/qwen_acp.go13patching file apps/backend/internal/agent/hostutility/manager.go14Hunk #3 succeeded at 840 (offset 1 line).15patching file apps/backend/internal/agent/hostutility/native_binary_test.go16patching file apps/backend/internal/agent/registry/provider.go17patching file apps/backend/internal/agent/runtime/lifecycle/manager_launch.go18patching file apps/backend/internal/agent/runtime/lifecycle/manager_launch_test.go19patching file apps/backend/internal/agent/runtime/lifecycle/utility.go20Hunk #3 FAILED at 89.21Hunk #4 succeeded at 172 with fuzz 2 (offset 1 line).221 out of 4 hunks FAILED -- saving rejects to file apps/backend/internal/agent/runtime/lifecycle/utility.go.rej23patching file apps/backend/internal/agent/runtime/lifecycle/utility_test.go24patching file apps/backend/internal/agent/settings/controller/agent_config.go25patching file apps/backend/internal/agent/settings/controller/controller_test.go26Hunk #2 FAILED at 678.271 out of 2 hunks FAILED -- saving rejects to file apps/backend/internal/agent/settings/controller/controller_test.go.rej28patching file apps/backend/internal/agentctl/server/utility/acp_executor.go29Hunk #1 succeeded at 1243 (offset 16 lines).30Hunk #2 succeeded at 1259 (offset 16 lines).31patching file apps/backend/internal/agentctl/server/utility/probe_allowlist_test.go