nixbot

builds

failed plannotator-tui-0.9.4 checks.aarch64-darwin.pkgs-plannotator-tui · build #5681 · raw

1Using versionCheckHook
unpackPhase
2unpacking source archive /nix/store/hx3qvqbykzjzyp4lk0rq2wzb1a066prj-source3source root is source4Executing cargoSetupPostUnpackHook5Finished cargoSetupPostUnpackHook
patchPhase
6Executing cargoSetupPostPatchHook7Validating consistency between /nix/var/nix/builds/nix-11696-1687616826/source/Cargo.lock and /nix/var/nix/builds/nix-11696-1687616826/plannotator-tui-0.9.4-vendor/Cargo.lock8Finished cargoSetupPostPatchHook
buildPhase
9Executing cargoBuildHook10cargoBuildHook flags: -j 10 --target aarch64-apple-darwin --offline --profile release11 Compiling proc-macro2 v1.0.10712 Compiling unicode-ident v1.0.2413 Compiling quote v1.0.4714 Compiling libc v0.2.18915 Compiling cfg-if v1.0.416 Compiling bitflags v2.13.117 Compiling allocator-api2 v0.2.2118 Compiling itoa v1.0.1819 Compiling equivalent v1.0.220 Compiling rustversion v1.0.2321 Compiling foldhash v0.2.022 Compiling either v1.18.023 Compiling serde_core v1.0.22924 Compiling thiserror v2.0.2025 Compiling unicode-width v0.2.226 Compiling strsim v0.11.127 Compiling heck v0.5.028 Compiling once_cell v1.21.429 Compiling ident_case v1.0.130 Compiling hashbrown v0.17.131 Compiling hashbrown v0.16.132 Compiling itertools v0.14.033 Compiling version_check v0.9.534 Compiling smallvec v1.15.235 Compiling unicode-segmentation v1.13.336 Compiling static_assertions v1.1.037 Compiling ryu v1.0.2338 Compiling typenum v1.20.139 Compiling zerocopy v0.8.5640 Compiling lru v0.18.341 Compiling ahash v0.8.1242 Compiling instability v0.3.1343 Compiling syn v3.0.444 Compiling syn v2.0.11945 Compiling castaway v0.2.446 Compiling hybrid-array v0.4.1447 Compiling unicode-truncate v2.0.148 Compiling critical-section v1.2.049 Compiling errno v0.3.1450 Compiling parking_lot_core v0.9.1251 Compiling memchr v2.8.352 Compiling find-msvc-tools v0.1.1153 Compiling shlex v2.0.154 Compiling signal-hook v0.3.1855 Compiling log v0.4.3456 Compiling winnow v1.0.457 Compiling semver v1.0.2858 Compiling mio v1.2.259 Compiling compact_str v0.9.160 Compiling convert_case v0.10.061 Compiling rustc_version v0.4.162 Compiling aho-corasick v1.1.563 Compiling cc v1.4.464 Compiling indexmap v2.14.065 Compiling signal-hook-registry v1.4.866 Compiling toml_parser v1.1.3+spec-1.1.067 Compiling toml_datetime v1.1.1+spec-1.1.068 Compiling pkg-config v0.3.3469 Compiling vcpkg v0.2.1570 Compiling rustix v1.1.471 Compiling scopeguard v1.2.072 Compiling regex-syntax v0.8.1173 Compiling zmij v1.0.2374 Compiling indoc v2.0.775 Compiling lock_api v0.4.1476 Compiling toml_edit v0.25.13+spec-1.1.077 Compiling darling_core v0.24.178 Compiling libsqlite3-sys v0.28.079 Compiling rstest_macros v0.26.180 Compiling crypto-common v0.2.281 Compiling block-buffer v0.12.182 Compiling num_threads v0.1.783 Compiling powerfmt v0.2.084 Compiling pin-project-lite v0.2.1785 Compiling const-oid v0.10.286 Compiling deranged v0.5.887 Compiling serde_json v1.0.15188 Compiling time-core v0.1.989 Compiling litrs v1.0.090 Compiling num-conv v0.2.291 Compiling parking_lot v0.12.592 Compiling document-features v0.2.1293 Compiling regex-automata v0.4.1894 Compiling thiserror-impl v2.0.2095 Compiling futures-macro v0.3.3496 Compiling digest v0.11.397 Compiling time v0.3.5598 Compiling strum_macros v0.28.099 Compiling derive_more-impl v2.1.1100 Compiling proc-macro-crate v3.5.0101 Compiling signal-hook-mio v0.2.5102 Compiling hashbrown v0.14.5103 Compiling cpufeatures v0.3.1104 Compiling line-clipping v0.3.8105 Compiling derive_more v2.1.1106 Compiling relative-path v1.9.3107 Compiling darling_macro v0.24.1108 Compiling kasuari v0.4.12109 Compiling pulldown-cmark v0.13.4110 Compiling glob v0.3.4111 Compiling slab v0.4.12112 Compiling darling v0.24.1113 Compiling futures-core v0.3.34114 Compiling futures-task v0.3.34115 Compiling serde v1.0.229116 Compiling crossterm v0.29.0117 Compiling futures-util v0.3.34118 Compiling strum v0.28.0119 Compiling regex v1.13.1120 Compiling hashlink v0.9.1121 Compiling tracing-attributes v0.1.31122 Compiling serde_derive v1.0.229123 Compiling tracing-core v0.1.36124 Compiling ratatui-core v0.1.2125 Compiling getopts v0.2.24126 Compiling fallible-streaming-iterator v0.1.9127 Compiling fallible-iterator v0.3.0128 Compiling pulldown-cmark-escape v0.11.0129 Compiling futures-timer v3.0.4130 Compiling diff v0.1.13131 Compiling yansi v1.0.1132 Compiling anyhow v1.0.104133 Compiling unicase v2.9.0134 Compiling pretty_assertions v1.4.1135 Compiling tracing v0.1.44136 Compiling sha2 v0.11.0137 Compiling sha1 v0.11.0138 Compiling ratatui-widgets v0.3.2139 Compiling ratatui-crossterm v0.1.2140 Compiling serde_spanned v1.1.1141 Compiling terminal-trx v0.2.6142 Compiling itertools v0.15.0143 Compiling xterm-color v1.0.2144 Compiling toml_writer v1.1.2+spec-1.1.0145 Compiling terminal-colorsaurus v1.0.3146 Compiling toml v1.1.4+spec-1.1.0147 Compiling similar v3.2.0148 Compiling rstest v0.26.1149 Compiling ratatui-macros v0.7.2150 Compiling plannotator-tui-schema v0.9.4 (/nix/var/nix/builds/nix-11696-1687616826/source/crates/plannotator-tui-schema)151 Compiling ratatui v0.30.2152 Compiling tui-markdown v0.3.9153 Compiling rusqlite v0.31.0154 Compiling plannotator-tui-hosts v0.9.4 (/nix/var/nix/builds/nix-11696-1687616826/source/crates/plannotator-tui-hosts)155 Compiling plannotator-tui v0.9.4 (/nix/var/nix/builds/nix-11696-1687616826/source/crates/plannotator-tui)156 Finished `release` profile [optimized] target(s) in 30.40s157Executing cargoInstallPostBuildHook158Finished cargoInstallPostBuildHook159Finished cargoBuildHook160buildPhase completed in 30 seconds
checkPhase
161Executing cargoCheckHook162cargoCheckHook flags: -j 10 --profile release --target aarch64-apple-darwin --offline --163 Compiling serde v1.0.229164 Compiling getrandom v0.3.4165 Compiling ahash v0.8.12166 Compiling serde_json v1.0.151167 Compiling strum v0.28.0168 Compiling autocfg v1.5.1169 Compiling regex-syntax v0.8.11170 Compiling ref-cast v1.0.27171 Compiling ref-cast-impl v1.0.27172 Compiling aho-corasick v1.1.5173 Compiling ratatui-core v0.1.2174 Compiling num-traits v0.2.19175 Compiling unicode-general-category v1.1.0176 Compiling bit-vec v0.8.0177 Compiling borrow-or-share v0.2.4178 Compiling bit-set v0.8.0179 Compiling micromap v0.3.0180 Compiling ratatui-widgets v0.3.2181 Compiling ratatui-crossterm v0.1.2182 Compiling tui-markdown v0.3.9183 Compiling regex-automata v0.4.18184 Compiling hashbrown v0.14.5185 Compiling plannotator-tui-schema v0.9.4 (/nix/var/nix/builds/nix-11696-1687616826/source/crates/plannotator-tui-schema)186 Compiling ratatui-macros v0.7.2187 Compiling ratatui v0.30.2188 Compiling vsimd v0.8.0189 Compiling hashlink v0.9.1190 Compiling num-integer v0.1.47191 Compiling num-complex v0.4.6192 Compiling fluent-uri v0.4.1193 Compiling num-bigint v0.4.8194 Compiling num-iter v0.1.46195 Compiling rusqlite v0.31.0196 Compiling percent-encoding v2.3.2197 Compiling bytecount v0.6.9198 Compiling num-cmp v0.1.0199 Compiling outref v0.5.2200 Compiling uuid-simd v0.8.0201 Compiling email_address v0.2.9202 Compiling jsonschema-regex v0.52.0203 Compiling data-encoding v2.11.1204 Compiling referencing v0.52.0205 Compiling plannotator-tui-hosts v0.9.4 (/nix/var/nix/builds/nix-11696-1687616826/source/crates/plannotator-tui-hosts)206 Compiling num-rational v0.4.2207 Compiling num v0.4.3208 Compiling fraction v0.17.0209 Compiling regex v1.13.1210 Compiling jsonschema-value v0.52.0211 Compiling fancy-regex v0.19.0212 Compiling jsonschema v0.52.0213 Compiling plannotator-tui v0.9.4 (/nix/var/nix/builds/nix-11696-1687616826/source/crates/plannotator-tui)214 Finished `release` profile [optimized] target(s) in 1m 13s215 Running unittests src/main.rs (target/aarch64-apple-darwin/release/deps/plannotator_tui-5d8f0561c23914e8)216217running 187 tests218test app::feedback::tests::reply_reviews_keep_sending_the_whole_transient_review ... ok219test app::menu::tests::a_narrow_pane_keeps_both_header_buttons_on_one_line ... ok220test app::feedback::tests::the_zero_pending_button_stays_visible_and_does_not_send_or_record_another_delivery ... ok221test app::menu::tests::clicking_the_review_button_opens_the_menu_and_clicking_a_row_runs_it ... ok222test app::menu::tests::a_rows_own_key_runs_it_from_the_menu ... ok223test app::pick::tests::a_stamp_that_already_carries_an_offset_is_shown_as_written ... ok224test app::pick::tests::a_utc_stamp_is_shown_on_the_local_clock ... ok225test app::feedback::tests::folder_feedback_ends_every_file_block_with_a_blank_line ... ok226test app::pick::tests::a_zone_string_reads_as_minutes_east_of_utc ... ok227test app::pick::tests::the_local_offset_is_a_real_time_zone_on_every_platform ... ok228test app::feedback::tests::incremental_send_and_explicit_resend_use_the_same_set_for_body_history_and_ids ... ok229test app::menu::tests::enter_runs_the_highlighted_row_and_closes_the_menu ... ok230test app::menu::tests::the_header_holds_send_and_review_and_m_opens_and_closes_the_menu ... ok231test app::feedback::tests::folder_counts_and_delivery_cover_collapsed_files_but_exclude_orphans_and_siblings ... ok232test app::menu::tests::the_menu_is_unavailable_while_composing_and_in_reply_reviews ... ok233test app::menu::tests::movement_skips_dimmed_rows_and_opens_on_the_first_that_applies ... ok234test app::selection::tests::columns_span_rows_in_either_drag_direction ... ok235test app::feedback::tests::a_folder_opens_expands_and_reloads_when_one_annotated_file_is_unreadable ... ok236test app::review::tests::a_failed_undo_stays_available_for_retry_without_losing_the_archive ... ok237test app::review::tests::finished_notes_are_recoverable_with_submission_history_disabled ... ok238test app::review::tests::a_deleted_files_archive_is_still_visible_and_restores_when_its_source_returns ... ok239test app::send::tests::s_closes_a_reply_review_with_nothing_to_send ... ok240test app::send::tests::s_after_a_send_closes_without_sending_again ... ok241test app::review::tests::finish_undo_and_restore_keep_pending_edits_and_preserve_sent_status ... ok242test app::review::tests::sent_markers_clear_on_edit_and_review_shortcuts_are_text_while_composing ... ok243test app::feedback::tests::unsuccessful_sends_leave_the_record_pending_and_offer_retry ... ok244test app::review::tests::folder_finish_reports_partial_failure_and_undo_covers_only_committed_archives ... ok245test app::review::tests::the_archive_picker_scrolls_and_restores_the_clicked_annotation ... ok246test app::send::tests::s_copies_then_closes_when_the_target_is_not_an_agent ... ok247test app::send::tests::s_keeps_the_window_open_while_the_agent_is_at_a_dialog ... ok248test app::tests::a_block_key_ends_roaming ... ok249test app::send::tests::removing_a_sent_annotation_leaves_the_review_sent ... ok250test app::tests::a_comment_can_span_lines_and_enter_saves_it ... ok251test app::tests::a_column_move_in_block_mode_starts_roaming_so_the_cursor_is_drawn ... ok252test app::tests::a_message_review_archives_the_session_id_and_the_transcript_path_separately ... ok253test app::tests::a_message_review_without_a_session_id_archives_only_the_transcript_path ... ok254test app::send::tests::s_sends_a_reply_review_and_closes ... ok255test app::tests::a_reply_already_sent_is_not_sent_again_from_another_reply ... ok256test app::tests::a_status_leads_the_footer_and_the_name_counters_and_key_help_stay ... ok257test app::tests::double_clicking_a_block_offers_the_toolbar_for_the_whole_block ... ok258test app::tests::a_status_leads_the_footer_so_a_narrow_pane_cannot_truncate_it_away ... ok259test app::tests::escaping_the_picker_keeps_the_newest_message ... ok260test app::send::tests::the_footer_names_s_only_in_a_reply_review_and_fits_at_80_columns ... ok261test app::tests::clicking_the_send_button_sends ... ok262test app::send::tests::s_does_nothing_in_a_file_review ... ok263test app::tests::moving_the_picker_cursor_previews_that_message ... ok264test app::tests::dot_in_the_tree_shows_hidden_folders_but_never_the_skipped_ones ... ok265test app::tests::newest_opens_the_newest_reply_and_leaves_the_picker_on_p ... ok266test app::tests::a_single_annotated_reply_sends_the_same_body_as_before ... ok267test app::tests::paging_through_a_block_taller_than_the_screen_selects_that_block ... ok268test app::tests::paging_a_document_that_cannot_scroll_selects_the_edge_block ... ok269test app::tests::paging_down_takes_the_selection_along_so_the_next_block_key_continues_on_screen ... ok270test app::tests::paging_a_one_row_pane_keeps_the_selection ... ok271test app::tests::paging_up_takes_the_selection_along ... ok272test app::tests::notes_on_every_reply_are_sent_together_each_under_its_own_reply ... ok273test app::tests::pasting_into_the_comment_box_keeps_newlines ... ok274test app::tests::previewing_away_and_back_keeps_annotations ... ok275test app::tests::quitting_with_notes_only_on_a_reply_that_is_not_open_asks_first ... ok276test app::tests::the_header_draws_the_send_button_and_records_where_it_is ... ok277test app::tests::quitting_with_unsent_feedback_asks_before_it_quits ... ok278test app::tests::roaming_moves_by_row_so_a_selection_can_start_mid_block ... ok279test app::tests::the_picker_lists_newest_first_and_opens_the_chosen_message ... ok280test archive::tests::host_labels_map_to_plannotators_spellings ... ok281test archive::tests::a_foreign_reader_sees_valid_json_with_a_numeric_v ... ok282test archive::tests::a_sidecar_is_skipped_for_a_record_without_content ... ok283test base64::tests::matches_reference_vectors ... ok284test app::send::tests::send_writeback_preserves_changes_made_while_the_transport_is_running ... ok285test config::tests::a_configured_theme_is_read_and_leaves_the_rest_alone ... ok286test archive::tests::an_agent_message_submission_records_agent_provenance ... ok287test config::tests::an_unknown_theme_error_names_the_value ... ok288test config::tests::config_path_precedence ... ok289test archive::tests::the_env_knob_follows_plannotators_resolver_semantics ... ok290test config::tests::empty_file_is_the_default_config ... ok291test config::tests::invalid_placement_error_names_the_value ... ok292test config::tests::partial_file_keeps_other_defaults ... ok293test config::tests::roundtrips_through_toml ... ok294test config::tests::unknown_key_error_names_the_key ... ok295test config::tests::the_theme_defaults_to_asking_the_terminal ... ok296test delivery::tests::blocked_agent_is_blocked_with_herdrs_message ... ok297test delivery::tests::describe_names_the_agent_when_known ... ok298test archive::tests::the_sidecar_carries_the_feedback_the_agent_received ... ok299test delivery::tests::success_is_ok_regardless_of_output ... ok300test delivery::tests::missing_or_unready_agent_is_unavailable ... ok301test archive::tests::the_index_line_matches_the_v1_contract_shape ... ok302test delivery::tests::an_oversized_copy_is_emitted_whole_rather_than_truncated ... ok303test archive::tests::same_millisecond_submissions_bump_the_sidecar_counter ... ok304test delivery::tests::the_clipboard_sequence_is_osc52_over_the_raw_utf8_bytes ... ok305test delivery::tests::unknown_code_and_garbage_are_failures_that_keep_the_text ... ok306test doc::tests::front_matter_is_dropped_and_nested_lists_stay_one_block ... ok307test doc::tests::splits_top_level_blocks_with_ranges ... ok308test export::tests::an_entry_without_lines_has_no_line_label ... ok309test export::tests::export_matches_the_agent_facing_shape ... ok310test herdr::context::tests::explicit_deliver_to_wins_and_carries_the_agent_label ... ok311test export::tests::fences_grow_past_embedded_backticks ... ok312test herdr::context::tests::any_exact_session_or_pid_selects_the_message_entrypoint ... ok313test herdr::context::tests::context_pane_is_a_target_only_when_an_agent_runs_there ... ok314test herdr::context::tests::context_with_omitted_and_unknown_fields_parses ... ok315test herdr::context::tests::own_pane_id_is_never_a_target ... ok316test herdr::context::tests::only_an_exact_newest_flag_skips_the_picker ... ok317test herdr::context::tests::outside_herdr_nothing_is_set ... ok318test herdr::context::tests::the_reviewed_pane_is_the_focused_one_from_an_action_else_the_caller ... ok319test herdr::context::tests::the_terminal_pane_and_line_count_come_from_the_launcher ... ok320test herdr::launch::tests::a_human_in_a_plain_shell_pane_gets_no_agent_target ... ok321test herdr::launch::tests::env_placement_beats_config_and_arg_beats_env ... ok322test herdr::launch::tests::ctrl_click_opens_the_linked_file ... ok323test herdr::launch::tests::a_last_launch_carries_the_pid_and_host_instead_of_a_file ... ok324test herdr::launch::tests::explicit_placement_still_wins_over_the_mirror_default ... ok325test herdr::launch::tests::herdrs_agent_session_is_passed_to_the_pane_as_a_path_or_an_id ... ok326test herdr::launch::tests::herdrs_exact_agent_identity_needs_no_process_info ... ok327test herdr::launch::tests::mirror_defaults_to_a_split_next_to_the_remote_invoking_pane ... ok328test herdr::launch::tests::only_file_urls_are_opened ... ok329test herdr::launch::tests::newest_reaches_the_pane_only_when_last_was_asked_for_it ... ok330test herdr::launch::tests::run_refuses_outside_herdr ... ok331test herdr::launch::tests::popup_placement_emits_size_and_no_target_pane ... ok332test herdr::launch::tests::terminal_review_of_a_shell_splits_beside_it_and_delivers_nowhere ... ok333test herdr::launch::tests::agent_skill_delivers_to_and_splits_beside_the_calling_pane ... ok334test delivery::tests::headless_runs_never_reach_the_terminal_clipboard ... ok335test herdr::launch::tests::terminal_review_reads_the_focused_pane_and_delivers_to_its_agent ... ok336test herdr::launch::tests::the_agent_pid_is_the_named_agent_process_else_the_group_leader ... ok337test herdr::launch::tests::the_plugin_id_comes_from_the_environment ... ok338test herdr::terminal::tests::blank_lines_inside_the_output_are_kept ... ok339test herdr::terminal::tests::cleaning_removes_escapes_controls_and_surrounding_blank_lines ... ok340test herdr::terminal::tests::long_lines_break_at_a_space_and_short_lines_are_untouched ... ok341test herdr::terminal::tests::output_with_nothing_visible_cleans_to_empty ... ok342test herdr::terminal::tests::the_document_renders_the_output_as_one_code_block ... ok343test herdr::terminal::tests::the_fence_outlasts_any_backticks_in_the_output ... ok344test herdr::terminal::tests::the_review_is_transient_and_titled_by_its_pane ... ok345test last::fallback::tests::only_a_pid_registered_session_counts_as_exact ... ok346test herdr::launch::tests::human_keybind_opens_the_focused_folder_and_delivers_to_its_agent ... ok347test last::roots::tests::every_documented_root_override_is_honoured ... ok348test last::roots::tests::pi_agent_and_xdg_overrides_apply_when_the_more_specific_values_are_absent ... ok349test last::tests::an_exactly_identified_transcript_is_never_annotated ... ok350test last::tests::inside_herdr_a_guessed_transcript_names_the_missing_session_id ... ok351test last::tests::outside_herdr_a_guessed_transcript_says_what_was_shown_without_naming_herdr ... ok352test last::locate::tests::a_transcript_named_on_the_command_line_is_never_reported_as_a_guess ... ok353test layout::tests::rendered_text_strips_markup_and_joins_blocks_without_separator ... ok354test srcmap::tests::decoration_maps_to_nothing ... ok355test srcmap::tests::maps_through_concealed_markup ... ok356test store::review::tests::an_edit_advances_past_a_delivery_even_if_the_clock_went_backwards ... ok357test last::locate::tests::a_transcript_without_an_id_in_its_name_keeps_a_valid_supplied_id ... ok358test herdr::terminal::tests::a_quote_across_a_broken_path_reads_as_printed ... ok359test store::review::tests::every_written_timestamp_has_three_fractional_digits_and_a_trailing_z ... ok360test store::review::tests::restoring_never_overwrites_an_active_annotation_with_the_same_id ... ok361test store::review::tests::rfc3339_offsets_and_precision_are_compared_as_instants ... ok362test store::tests::civil_dates_are_correct ... ok363test last::locate::tests::the_transcript_name_is_the_authority_over_a_supplied_id ... ok364test store::review::tests::an_unparsable_timestamp_can_be_finished_and_is_pending_again_after_an_edit ... ok365test theme::tests::a_theme_setting_roundtrips_through_its_own_name ... ok366test store::tests::a_record_without_deliveries_still_loads ... ok367test store::review::tests::archive_and_restore_failures_leave_memory_and_disk_intact ... ok368test store::tests::saves_on_every_change_and_re_resolves_after_an_edit ... ok369test app::tests::the_tree_scrolls_to_keep_the_cursor_visible_and_hit_tests_through_the_offset ... ok370test theme::tests::an_empty_environment_variable_is_not_a_choice ... ok371test store::review::tests::archiving_keeps_pending_notes_and_restores_complete_annotations_and_history ... ok372test theme::tests::an_unreadable_environment_variable_is_an_error_naming_the_value ... ok373test theme::tests::auto_in_the_environment_reopens_the_question_a_configured_theme_closed ... ok374test theme::tests::auto_uses_the_terminals_answer_and_falls_back_to_dark_without_one ... ok375test theme::tests::no_light_role_reuses_its_dark_value ... ok376test theme::tests::the_config_file_beats_detection ... ok377test theme::tests::the_dark_palette_is_unchanged ... ok378test theme::tests::the_environment_beats_the_config_file ... ok379test theme::tests::the_light_selection_is_a_background_not_a_reversal ... ok380test theme::tests::the_palette_is_dark_until_something_installs_one ... ok381test store::review::tests::archive_only_records_are_discoverable_and_sent_orphans_can_be_finished ... ok382test store::tests::legacy_sidecar_is_imported_once_and_left_alone ... ok383test store::review::tests::incremental_batches_and_edits_remain_correct_after_reopening ... ok384test workspace_paths::tests::relative_and_dotted_spellings_resolve_to_one_absolute_path ... ok385test wrap::table::tests::a_budget_too_small_for_the_words_is_still_spent_in_full ... ok386test wrap::table::tests::a_pipe_inside_a_cell_falls_back_to_clipping_instead_of_dropping_it ... ok387test wrap::table::tests::a_row_the_reflow_cannot_read_is_clipped_not_word_wrapped ... ok388test store::tests::all_delivered_tracks_the_last_send_across_reloads ... ok389test wrap::table::tests::columns_keep_their_longest_word_and_share_the_rest_in_proportion ... ok390test wrap::table::tests::a_window_narrower_than_the_box_gets_the_clipped_table ... ok391test wrap::table::tests::every_row_of_a_squeezed_table_is_the_same_width ... ok392test wrap::table::tests::table_cells_wrap_without_breaking_the_box ... ok393test wrap::table::tests::words_stay_whole_when_a_wrapped_table_has_room_for_them ... ok394test wrap::table::tests::wrapped_table_cells_still_name_the_source_char_under_them ... ok395test wrap::tests::empty_line_is_one_row ... ok396test wrap::tests::hard_splits_long_tokens_and_wide_chars_take_two_cells ... ok397test tree::tests::hidden_entries_appear_only_once_they_are_asked_for ... ok398test wrap::tests::styles_survive_wrapping_at_span_and_line_level ... ok399test wrap::tests::wraps_on_word_boundaries_and_keeps_offsets ... ok400test tree::tests::the_shallowest_markdown_ignores_hidden_folders ... ok401test tree::tests::the_root_lists_one_level_and_expanding_descends_lazily ... ok402test tree::tests::the_shallowest_markdown_is_found_without_walking_everything ... ok403test tree::tests::toggling_a_file_row_changes_nothing ... ok404test tree::tests::skipped_directories_are_never_listed_or_read ... ok405406test result: ok. 187 passed; 0 failed; 0 ignored; 0 measured; 0 filtered out; finished in 0.16s407408 Running tests/annotate_occurrence.rs (target/aarch64-apple-darwin/release/deps/annotate_occurrence-ebde515f7d164613)409410running 3 tests411test a_missing_occurrence_fails_and_says_how_many_there_are ... ok412test occurrence_marks_the_named_match_of_a_repeated_phrase ... ok413test without_occurrence_the_first_match_is_marked ... ok414415test result: ok. 3 passed; 0 failed; 0 ignored; 0 measured; 0 filtered out; finished in 0.50s416417 Running tests/codex_pid.rs (target/aarch64-apple-darwin/release/deps/codex_pid-ecff11417d3c11de)418419running 0 tests420421test result: ok. 0 passed; 0 failed; 0 ignored; 0 measured; 0 filtered out; finished in 0.00s422423 Running tests/folder_export.rs (target/aarch64-apple-darwin/release/deps/folder_export-1545e678e4a5a9bf)424425running 1 test426test folder_export_includes_every_annotated_file ... ok427428test result: ok. 1 passed; 0 failed; 0 ignored; 0 measured; 0 filtered out; finished in 0.02s429430 Running tests/last.rs (target/aarch64-apple-darwin/release/deps/last-398949fb1626a124)431432running 13 tests433test print_never_fails_the_caller_when_nothing_is_found ... ok434test print_reads_a_copilot_session_directory ... ok435test print_reads_a_droid_log ... ok436test omp_reads_pi_format_sessions ... ok437test claude_config_override_is_used_for_an_exact_id ... ok438test print_writes_the_newest_assistant_message_of_a_claude_transcript ... ok439test a_session_path_without_a_host_is_sniffed ... ok440test herdr_reported_codex_id_beats_a_newer_unrelated_rollout ... ok441test herdr_open_rejects_newest_by_name ... ok442test print_writes_the_newest_assistant_message_of_a_pi_session ... ok443test stdin_is_printed_back_verbatim ... ok444test hermes_reads_the_session_named_by_id_from_hermes_home ... ok445test print_reads_a_codex_thread_from_a_sessions_root ... ok446447test result: ok. 13 passed; 0 failed; 0 ignored; 0 measured; 0 filtered out; finished in 0.01s448449 Running tests/terminal.rs (target/aarch64-apple-darwin/release/deps/terminal-2ccc36d6dfec59ca)450451running 6 tests452test line_counts_must_be_positive_numbers ... ok453test print_shows_the_focused_panes_cleaned_output_as_one_code_block ... FAILED454test an_action_without_a_focused_pane_reads_nothing ... FAILED455test a_pane_with_nothing_on_it_fails_without_opening_a_review ... FAILED456test the_review_pane_opens_on_the_output_and_sends_to_the_agent_that_produced_it ... FAILED457test a_failed_read_reports_herdrs_error_without_opening_a_review ... FAILED458459failures:460461---- print_shows_the_focused_panes_cleaned_output_as_one_code_block stdout ----462463thread 'print_shows_the_focused_panes_cleaned_output_as_one_code_block' (22013807) panicked at crates/plannotator-tui/tests/terminal.rs:32:5:464rustc failed: error: linking with `cc` failed: exit status: 1465 |466 = note: "cc" "/nix/var/nix/builds/nix-11696-1687616826/plannotator terminal print ü-16886/fake herdr/rustckUpKQK/symbols.o" "<2 object files omitted>" "<sysroot>/lib/rustlib/aarch64-apple-darwin/lib/{libstd-*,libpanic_unwind-*,libobject-*,libmemchr-*,libaddr2line-*,libgimli-*,libcfg_if-*,librustc_demangle-*,libstd_detect-*,libhashbrown-*,librustc_std_workspace_alloc-*,libminiz_oxide-*,libadler2-*,libunwind-*,liblibc-*,librustc_std_workspace_core-*,liballoc-*,libcore-*,libcompiler_builtins-*}.rlib" "-lSystem" "-lc" "-lm" "-arch" "arm64" "-mmacosx-version-min=14.0.0" "-o" "/nix/var/nix/builds/nix-11696-1687616826/plannotator terminal print ü-16886/fake herdr/herdr" "-Wl,-dead_strip" "-nodefaultlibs"467 = note: some arguments are omitted. use `--verbose` to show all linker arguments468 = note: clang: error: no such file or directory: '$/nix/var/nix/builds/nix-11696-1687616826/plannotator terminal print 303274-16886/fake herdr/rustckUpKQK/symbols.o'469 clang: error: no such file or directory: '$/nix/var/nix/builds/nix-11696-1687616826/plannotator terminal print 303274-16886/fake herdr/herdr.fake_herdr.1f3d8391611ad6f0-cgu.0.rcgu.o'470 clang: error: no such file or directory: '$/nix/var/nix/builds/nix-11696-1687616826/plannotator terminal print 303274-16886/fake herdr/herdr.alxm6t0z2y2syuksm1amaasmz.rcgu.o'471 472473error: aborting due to 1 previous error474475476note: run with `RUST_BACKTRACE=1` environment variable to display a backtrace477478---- an_action_without_a_focused_pane_reads_nothing stdout ----479480thread 'an_action_without_a_focused_pane_reads_nothing' (22013805) panicked at crates/plannotator-tui/tests/terminal.rs:32:5:481rustc failed: error: linking with `cc` failed: exit status: 1482 |483 = note: "cc" "/nix/var/nix/builds/nix-11696-1687616826/plannotator terminal unfocused ü-16886/fake herdr/rustcxizr7A/symbols.o" "<2 object files omitted>" "<sysroot>/lib/rustlib/aarch64-apple-darwin/lib/{libstd-*,libpanic_unwind-*,libobject-*,libmemchr-*,libaddr2line-*,libgimli-*,libcfg_if-*,librustc_demangle-*,libstd_detect-*,libhashbrown-*,librustc_std_workspace_alloc-*,libminiz_oxide-*,libadler2-*,libunwind-*,liblibc-*,librustc_std_workspace_core-*,liballoc-*,libcore-*,libcompiler_builtins-*}.rlib" "-lSystem" "-lc" "-lm" "-arch" "arm64" "-mmacosx-version-min=14.0.0" "-o" "/nix/var/nix/builds/nix-11696-1687616826/plannotator terminal unfocused ü-16886/fake herdr/herdr" "-Wl,-dead_strip" "-nodefaultlibs"484 = note: some arguments are omitted. use `--verbose` to show all linker arguments485 = note: clang: error: no such file or directory: '$/nix/var/nix/builds/nix-11696-1687616826/plannotator terminal unfocused 303274-16886/fake herdr/rustcxizr7A/symbols.o'486 clang: error: no such file or directory: '$/nix/var/nix/builds/nix-11696-1687616826/plannotator terminal unfocused 303274-16886/fake herdr/herdr.fake_herdr.1f3d8391611ad6f0-cgu.0.rcgu.o'487 clang: error: no such file or directory: '$/nix/var/nix/builds/nix-11696-1687616826/plannotator terminal unfocused 303274-16886/fake herdr/herdr.alxm6t0z2y2syuksm1amaasmz.rcgu.o'488 489490error: aborting due to 1 previous error491492493494---- a_pane_with_nothing_on_it_fails_without_opening_a_review stdout ----495496thread 'a_pane_with_nothing_on_it_fails_without_opening_a_review' (22013804) panicked at crates/plannotator-tui/tests/terminal.rs:32:5:497rustc failed: error: linking with `cc` failed: exit status: 1498 |499 = note: "cc" "/nix/var/nix/builds/nix-11696-1687616826/plannotator terminal empty ü-16886/fake herdr/rustcxgGnkj/symbols.o" "<2 object files omitted>" "<sysroot>/lib/rustlib/aarch64-apple-darwin/lib/{libstd-*,libpanic_unwind-*,libobject-*,libmemchr-*,libaddr2line-*,libgimli-*,libcfg_if-*,librustc_demangle-*,libstd_detect-*,libhashbrown-*,librustc_std_workspace_alloc-*,libminiz_oxide-*,libadler2-*,libunwind-*,liblibc-*,librustc_std_workspace_core-*,liballoc-*,libcore-*,libcompiler_builtins-*}.rlib" "-lSystem" "-lc" "-lm" "-arch" "arm64" "-mmacosx-version-min=14.0.0" "-o" "/nix/var/nix/builds/nix-11696-1687616826/plannotator terminal empty ü-16886/fake herdr/herdr" "-Wl,-dead_strip" "-nodefaultlibs"500 = note: some arguments are omitted. use `--verbose` to show all linker arguments501 = note: clang: error: no such file or directory: '$/nix/var/nix/builds/nix-11696-1687616826/plannotator terminal empty 303274-16886/fake herdr/rustcxgGnkj/symbols.o'502 clang: error: no such file or directory: '$/nix/var/nix/builds/nix-11696-1687616826/plannotator terminal empty 303274-16886/fake herdr/herdr.fake_herdr.1f3d8391611ad6f0-cgu.0.rcgu.o'503 clang: error: no such file or directory: '$/nix/var/nix/builds/nix-11696-1687616826/plannotator terminal empty 303274-16886/fake herdr/herdr.alxm6t0z2y2syuksm1amaasmz.rcgu.o'504 505506error: aborting due to 1 previous error507508509510---- the_review_pane_opens_on_the_output_and_sends_to_the_agent_that_produced_it stdout ----511512thread 'the_review_pane_opens_on_the_output_and_sends_to_the_agent_that_produced_it' (22013808) panicked at crates/plannotator-tui/tests/terminal.rs:32:5:513rustc failed: error: linking with `cc` failed: exit status: 1514 |515 = note: "cc" "/nix/var/nix/builds/nix-11696-1687616826/plannotator terminal launch ü-16886/fake herdr/rustcl5u0Yj/symbols.o" "<2 object files omitted>" "<sysroot>/lib/rustlib/aarch64-apple-darwin/lib/{libstd-*,libpanic_unwind-*,libobject-*,libmemchr-*,libaddr2line-*,libgimli-*,libcfg_if-*,librustc_demangle-*,libstd_detect-*,libhashbrown-*,librustc_std_workspace_alloc-*,libminiz_oxide-*,libadler2-*,libunwind-*,liblibc-*,librustc_std_workspace_core-*,liballoc-*,libcore-*,libcompiler_builtins-*}.rlib" "-lSystem" "-lc" "-lm" "-arch" "arm64" "-mmacosx-version-min=14.0.0" "-o" "/nix/var/nix/builds/nix-11696-1687616826/plannotator terminal launch ü-16886/fake herdr/herdr" "-Wl,-dead_strip" "-nodefaultlibs"516 = note: some arguments are omitted. use `--verbose` to show all linker arguments517 = note: clang: error: no such file or directory: '$/nix/var/nix/builds/nix-11696-1687616826/plannotator terminal launch 303274-16886/fake herdr/rustcl5u0Yj/symbols.o'518 clang: error: no such file or directory: '$/nix/var/nix/builds/nix-11696-1687616826/plannotator terminal launch 303274-16886/fake herdr/herdr.fake_herdr.1f3d8391611ad6f0-cgu.0.rcgu.o'519 clang: error: no such file or directory: '$/nix/var/nix/builds/nix-11696-1687616826/plannotator terminal launch 303274-16886/fake herdr/herdr.alxm6t0z2y2syuksm1amaasmz.rcgu.o'520 521522error: aborting due to 1 previous error523524525526---- a_failed_read_reports_herdrs_error_without_opening_a_review stdout ----527528thread 'a_failed_read_reports_herdrs_error_without_opening_a_review' (22013803) panicked at crates/plannotator-tui/tests/terminal.rs:32:5:529rustc failed: error: linking with `cc` failed: exit status: 1530 |531 = note: "cc" "/nix/var/nix/builds/nix-11696-1687616826/plannotator terminal error ü-16886/fake herdr/rustc8hOmle/symbols.o" "<2 object files omitted>" "<sysroot>/lib/rustlib/aarch64-apple-darwin/lib/{libstd-*,libpanic_unwind-*,libobject-*,libmemchr-*,libaddr2line-*,libgimli-*,libcfg_if-*,librustc_demangle-*,libstd_detect-*,libhashbrown-*,librustc_std_workspace_alloc-*,libminiz_oxide-*,libadler2-*,libunwind-*,liblibc-*,librustc_std_workspace_core-*,liballoc-*,libcore-*,libcompiler_builtins-*}.rlib" "-lSystem" "-lc" "-lm" "-arch" "arm64" "-mmacosx-version-min=14.0.0" "-o" "/nix/var/nix/builds/nix-11696-1687616826/plannotator terminal error ü-16886/fake herdr/herdr" "-Wl,-dead_strip" "-nodefaultlibs"532 = note: some arguments are omitted. use `--verbose` to show all linker arguments533 = note: clang: error: no such file or directory: '$/nix/var/nix/builds/nix-11696-1687616826/plannotator terminal error 303274-16886/fake herdr/rustc8hOmle/symbols.o'534 clang: error: no such file or directory: '$/nix/var/nix/builds/nix-11696-1687616826/plannotator terminal error 303274-16886/fake herdr/herdr.fake_herdr.1f3d8391611ad6f0-cgu.0.rcgu.o'535 clang: error: no such file or directory: '$/nix/var/nix/builds/nix-11696-1687616826/plannotator terminal error 303274-16886/fake herdr/herdr.alxm6t0z2y2syuksm1amaasmz.rcgu.o'536 537538error: aborting due to 1 previous error539540541542543failures:544 a_failed_read_reports_herdrs_error_without_opening_a_review545 a_pane_with_nothing_on_it_fails_without_opening_a_review546 an_action_without_a_focused_pane_reads_nothing547 print_shows_the_focused_panes_cleaned_output_as_one_code_block548 the_review_pane_opens_on_the_output_and_sends_to_the_agent_that_produced_it549550test result: FAILED. 1 passed; 5 failed; 0 ignored; 0 measured; 0 filtered out; finished in 0.17s551552error: test failed, to rerun pass `-p plannotator-tui --test terminal`