setup
checks.x86_64-linux.pkgs-clauth
· build #5638
· raw
1these 2 derivations will be built:2 /nix/store/j61wwqnx9hr314nkdhww6f501hl7922j-clauth-0.16.0.drv3 /nix/store/l12y3qk3bhwa7vc7nd73s6r3pa1ywazq-check-clauth.drv4error: Cannot build '/nix/store/j61wwqnx9hr314nkdhww6f501hl7922j-clauth-0.16.0.drv'.5 Reason: builder failed with exit code 101.6 Output paths:7 /nix/store/rsh9slwly2rklqby19f6jrd97zg2bs8i-clauth-0.16.08 Last 25 log lines:9 > run env: Os { code: 2, kind: NotFound, message: "No such file or directory" }10 >11 > ---- daemon::api::routes::tests::an_unknown_tier_device_is_refused_while_the_others_work stdout ----12 >13 > thread 'daemon::api::routes::tests::an_unknown_tier_device_is_refused_while_the_others_work' (6338) panicked at src/daemon/api/../../../tests/inline/daemon_api_routes.rs:2248:5:14 > assertion `left == right` failed15 > left: 016 > right: 117 >18 > ---- daemon::api::routes::tests::an_unreadable_device_list_refuses_every_request stdout ----19 >20 > thread 'daemon::api::routes::tests::an_unreadable_device_list_refuses_every_request' (6339) panicked at src/daemon/api/../../../tests/inline/daemon_api_routes.rs:2297:5:21 > assertion `left == right` failed22 > left: 023 > right: 124 >25 >26 > failures:27 > daemon::api::routes::tests::an_unknown_tier_device_is_refused_while_the_others_work28 > daemon::api::routes::tests::an_unreadable_device_list_refuses_every_request29 > daemon::api::terminal::tests::strip_session_env_removes_every_session_var30 >31 > test result: FAILED. 4154 passed; 3 failed; 1 ignored; 0 measured; 6 filtered out; finished in 594.59s32 >33 > error: test failed, to rerun pass `--bin clauth`34 For full logs, run:35 nix log /nix/store/j61wwqnx9hr314nkdhww6f501hl7922j-clauth-0.16.0.drv36error: Cannot build '/nix/store/l12y3qk3bhwa7vc7nd73s6r3pa1ywazq-check-clauth.drv'.37 Reason: 1 dependency failed.38 Output paths:39 /nix/store/09q7fww2vdh1k0lr8yk05xh0165qrwrp-check-clauth