nixbot

builds
1Sourcing python-remove-tests-dir-hook2Sourcing python-catch-conflicts-hook.sh3Sourcing python-remove-bin-bytecode-hook.sh4Sourcing pypa-build-hook5Using pypaBuildPhase6Sourcing python-runtime-deps-check-hook7Using pythonRuntimeDepsCheckHook8Sourcing pypa-install-hook9Using pypaInstallPhase10Sourcing python-imports-check-hook.sh11Using pythonImportsCheckPhase12Sourcing python-namespaces-hook13Sourcing python-catch-conflicts-hook.sh14Sourcing pytest-check-hook15Using pytestCheckPhase
unpackPhase
16unpacking source archive /nix/store/6j02vr0b49bmba7q45fbwsnz9xq9m7kv-source17source root is source18setting SOURCE_DATE_EPOCH to timestamp 315619200 of file "source/tests/test_watch.py"
configurePhase
19no configure script, doing nothing
buildPhase
20Executing pypaBuildPhase21Creating a wheel...22pypa build flags: --no-isolation --outdir dist/ --wheel23* Getting build dependencies for wheel...24/nix/store/qmli4gwqi36clrxc1i29q6mnf8sizlbc-python3.14-setuptools-83.0.0/lib/python3.14/site-packages/setuptools/config/_apply_pyprojecttoml.py:82: SetuptoolsDeprecationWarning: `project.license` as a TOML table is deprecated25!!2627 ********************************************************************************28 Please use a simple string containing a SPDX expression for `project.license`. You can also use `project.license-files`. (Both options available on setuptools>=77.0.0).2930 By 2027-Feb-18, you need to update your project and remove deprecated calls31 or your builds will no longer be supported.3233 See https://packaging.python.org/en/latest/guides/writing-pyproject-toml/#license for details.34 ********************************************************************************3536!!37 corresp(dist, value, root_dir)38/nix/store/qmli4gwqi36clrxc1i29q6mnf8sizlbc-python3.14-setuptools-83.0.0/lib/python3.14/site-packages/setuptools/config/_apply_pyprojecttoml.py:61: SetuptoolsDeprecationWarning: License classifiers are deprecated.39!!4041 ********************************************************************************42 Please consider removing the following classifiers in favor of a SPDX license expression:4344 License :: OSI Approved :: Apache Software License4546 See https://packaging.python.org/en/latest/guides/writing-pyproject-toml/#license for details.47 ********************************************************************************4849!!50 dist._finalize_license_expression()51/nix/store/qmli4gwqi36clrxc1i29q6mnf8sizlbc-python3.14-setuptools-83.0.0/lib/python3.14/site-packages/setuptools/dist.py:765: SetuptoolsDeprecationWarning: License classifiers are deprecated.52!!5354 ********************************************************************************55 Please consider removing the following classifiers in favor of a SPDX license expression:5657 License :: OSI Approved :: Apache Software License5859 See https://packaging.python.org/en/latest/guides/writing-pyproject-toml/#license for details.60 ********************************************************************************6162!!63 self._finalize_license_expression()64running egg_info65creating src/mcptoon.egg-info66writing src/mcptoon.egg-info/PKG-INFO67writing dependency_links to src/mcptoon.egg-info/dependency_links.txt68writing entry points to src/mcptoon.egg-info/entry_points.txt69writing requirements to src/mcptoon.egg-info/requires.txt70writing top-level names to src/mcptoon.egg-info/top_level.txt71writing manifest file 'src/mcptoon.egg-info/SOURCES.txt'72reading manifest file 'src/mcptoon.egg-info/SOURCES.txt'73adding license file 'LICENSE'74adding license file 'NOTICE'75writing manifest file 'src/mcptoon.egg-info/SOURCES.txt'76* Building wheel...77/nix/store/qmli4gwqi36clrxc1i29q6mnf8sizlbc-python3.14-setuptools-83.0.0/lib/python3.14/site-packages/setuptools/config/_apply_pyprojecttoml.py:82: SetuptoolsDeprecationWarning: `project.license` as a TOML table is deprecated78!!7980 ********************************************************************************81 Please use a simple string containing a SPDX expression for `project.license`. You can also use `project.license-files`. (Both options available on setuptools>=77.0.0).8283 By 2027-Feb-18, you need to update your project and remove deprecated calls84 or your builds will no longer be supported.8586 See https://packaging.python.org/en/latest/guides/writing-pyproject-toml/#license for details.87 ********************************************************************************8889!!90 corresp(dist, value, root_dir)91/nix/store/qmli4gwqi36clrxc1i29q6mnf8sizlbc-python3.14-setuptools-83.0.0/lib/python3.14/site-packages/setuptools/config/_apply_pyprojecttoml.py:61: SetuptoolsDeprecationWarning: License classifiers are deprecated.92!!9394 ********************************************************************************95 Please consider removing the following classifiers in favor of a SPDX license expression:9697 License :: OSI Approved :: Apache Software License9899 See https://packaging.python.org/en/latest/guides/writing-pyproject-toml/#license for details.100 ********************************************************************************101102!!103 dist._finalize_license_expression()104/nix/store/qmli4gwqi36clrxc1i29q6mnf8sizlbc-python3.14-setuptools-83.0.0/lib/python3.14/site-packages/setuptools/dist.py:765: SetuptoolsDeprecationWarning: License classifiers are deprecated.105!!106107 ********************************************************************************108 Please consider removing the following classifiers in favor of a SPDX license expression:109110 License :: OSI Approved :: Apache Software License111112 See https://packaging.python.org/en/latest/guides/writing-pyproject-toml/#license for details.113 ********************************************************************************114115!!116 self._finalize_license_expression()117running bdist_wheel118running build119running build_py120creating build/lib/mcptoon121copying src/mcptoon/sync.py -> build/lib/mcptoon122copying src/mcptoon/config.py -> build/lib/mcptoon123copying src/mcptoon/skills.py -> build/lib/mcptoon124copying src/mcptoon/manifest.py -> build/lib/mcptoon125copying src/mcptoon/health.py -> build/lib/mcptoon126copying src/mcptoon/discover.py -> build/lib/mcptoon127copying src/mcptoon/client.py -> build/lib/mcptoon128copying src/mcptoon/cache.py -> build/lib/mcptoon129copying src/mcptoon/__init__.py -> build/lib/mcptoon130copying src/mcptoon/serve.py -> build/lib/mcptoon131copying src/mcptoon/native_tools.py -> build/lib/mcptoon132copying src/mcptoon/bench.py -> build/lib/mcptoon133copying src/mcptoon/installer.py -> build/lib/mcptoon134copying src/mcptoon/cli.py -> build/lib/mcptoon135copying src/mcptoon/footer.py -> build/lib/mcptoon136copying src/mcptoon/toon_vendored.py -> build/lib/mcptoon137copying src/mcptoon/plugin.py -> build/lib/mcptoon138copying src/mcptoon/errors.py -> build/lib/mcptoon139copying src/mcptoon/watch.py -> build/lib/mcptoon140copying src/mcptoon/demo_server.py -> build/lib/mcptoon141copying src/mcptoon/welcome.py -> build/lib/mcptoon142copying src/mcptoon/router.py -> build/lib/mcptoon143copying src/mcptoon/demo.py -> build/lib/mcptoon144copying src/mcptoon/schema_simplifier.py -> build/lib/mcptoon145copying src/mcptoon/usage.py -> build/lib/mcptoon146copying src/mcptoon/packs.py -> build/lib/mcptoon147copying src/mcptoon/__main__.py -> build/lib/mcptoon148copying src/mcptoon/output.py -> build/lib/mcptoon149running egg_info150writing src/mcptoon.egg-info/PKG-INFO151writing dependency_links to src/mcptoon.egg-info/dependency_links.txt152writing entry points to src/mcptoon.egg-info/entry_points.txt153writing requirements to src/mcptoon.egg-info/requires.txt154writing top-level names to src/mcptoon.egg-info/top_level.txt155reading manifest file 'src/mcptoon.egg-info/SOURCES.txt'156adding license file 'LICENSE'157adding license file 'NOTICE'158writing manifest file 'src/mcptoon.egg-info/SOURCES.txt'159copying src/mcptoon/packs.json -> build/lib/mcptoon160creating build/lib/mcptoon/skill161copying src/mcptoon/skill/SKILL.md -> build/lib/mcptoon/skill162installing to build/bdist.macosx-14.0-arm64/wheel163running install164running install_lib165creating build/bdist.macosx-14.0-arm64/wheel166creating build/bdist.macosx-14.0-arm64/wheel/mcptoon167copying build/lib/mcptoon/sync.py -> build/bdist.macosx-14.0-arm64/wheel/./mcptoon168copying build/lib/mcptoon/config.py -> build/bdist.macosx-14.0-arm64/wheel/./mcptoon169creating build/bdist.macosx-14.0-arm64/wheel/mcptoon/skill170copying build/lib/mcptoon/skill/SKILL.md -> build/bdist.macosx-14.0-arm64/wheel/./mcptoon/skill171copying build/lib/mcptoon/skills.py -> build/bdist.macosx-14.0-arm64/wheel/./mcptoon172copying build/lib/mcptoon/manifest.py -> build/bdist.macosx-14.0-arm64/wheel/./mcptoon173copying build/lib/mcptoon/health.py -> build/bdist.macosx-14.0-arm64/wheel/./mcptoon174copying build/lib/mcptoon/discover.py -> build/bdist.macosx-14.0-arm64/wheel/./mcptoon175copying build/lib/mcptoon/client.py -> build/bdist.macosx-14.0-arm64/wheel/./mcptoon176copying build/lib/mcptoon/packs.json -> build/bdist.macosx-14.0-arm64/wheel/./mcptoon177copying build/lib/mcptoon/cache.py -> build/bdist.macosx-14.0-arm64/wheel/./mcptoon178copying build/lib/mcptoon/__init__.py -> build/bdist.macosx-14.0-arm64/wheel/./mcptoon179copying build/lib/mcptoon/serve.py -> build/bdist.macosx-14.0-arm64/wheel/./mcptoon180copying build/lib/mcptoon/native_tools.py -> build/bdist.macosx-14.0-arm64/wheel/./mcptoon181copying build/lib/mcptoon/bench.py -> build/bdist.macosx-14.0-arm64/wheel/./mcptoon182copying build/lib/mcptoon/installer.py -> build/bdist.macosx-14.0-arm64/wheel/./mcptoon183copying build/lib/mcptoon/cli.py -> build/bdist.macosx-14.0-arm64/wheel/./mcptoon184copying build/lib/mcptoon/footer.py -> build/bdist.macosx-14.0-arm64/wheel/./mcptoon185copying build/lib/mcptoon/toon_vendored.py -> build/bdist.macosx-14.0-arm64/wheel/./mcptoon186copying build/lib/mcptoon/plugin.py -> build/bdist.macosx-14.0-arm64/wheel/./mcptoon187copying build/lib/mcptoon/errors.py -> build/bdist.macosx-14.0-arm64/wheel/./mcptoon188copying build/lib/mcptoon/watch.py -> build/bdist.macosx-14.0-arm64/wheel/./mcptoon189copying build/lib/mcptoon/demo_server.py -> build/bdist.macosx-14.0-arm64/wheel/./mcptoon190copying build/lib/mcptoon/welcome.py -> build/bdist.macosx-14.0-arm64/wheel/./mcptoon191copying build/lib/mcptoon/router.py -> build/bdist.macosx-14.0-arm64/wheel/./mcptoon192copying build/lib/mcptoon/demo.py -> build/bdist.macosx-14.0-arm64/wheel/./mcptoon193copying build/lib/mcptoon/schema_simplifier.py -> build/bdist.macosx-14.0-arm64/wheel/./mcptoon194copying build/lib/mcptoon/usage.py -> build/bdist.macosx-14.0-arm64/wheel/./mcptoon195copying build/lib/mcptoon/packs.py -> build/bdist.macosx-14.0-arm64/wheel/./mcptoon196copying build/lib/mcptoon/__main__.py -> build/bdist.macosx-14.0-arm64/wheel/./mcptoon197copying build/lib/mcptoon/output.py -> build/bdist.macosx-14.0-arm64/wheel/./mcptoon198running install_egg_info199Copying src/mcptoon.egg-info to build/bdist.macosx-14.0-arm64/wheel/./mcptoon-0.8.0-py3.14.egg-info200running install_scripts201creating build/bdist.macosx-14.0-arm64/wheel/mcptoon-0.8.0.dist-info/WHEEL202creating '/nix/var/nix/builds/nix-37956-120846597/source/dist/.tmp-2a1lku0m/mcptoon-0.8.0-py3-none-any.whl' and adding 'build/bdist.macosx-14.0-arm64/wheel' to it203adding 'mcptoon/__init__.py'204adding 'mcptoon/__main__.py'205adding 'mcptoon/bench.py'206adding 'mcptoon/cache.py'207adding 'mcptoon/cli.py'208adding 'mcptoon/client.py'209adding 'mcptoon/config.py'210adding 'mcptoon/demo.py'211adding 'mcptoon/demo_server.py'212adding 'mcptoon/discover.py'213adding 'mcptoon/errors.py'214adding 'mcptoon/footer.py'215adding 'mcptoon/health.py'216adding 'mcptoon/installer.py'217adding 'mcptoon/manifest.py'218adding 'mcptoon/native_tools.py'219adding 'mcptoon/output.py'220adding 'mcptoon/packs.json'221adding 'mcptoon/packs.py'222adding 'mcptoon/plugin.py'223adding 'mcptoon/router.py'224adding 'mcptoon/schema_simplifier.py'225adding 'mcptoon/serve.py'226adding 'mcptoon/skills.py'227adding 'mcptoon/sync.py'228adding 'mcptoon/toon_vendored.py'229adding 'mcptoon/usage.py'230adding 'mcptoon/watch.py'231adding 'mcptoon/welcome.py'232adding 'mcptoon/skill/SKILL.md'233adding 'mcptoon-0.8.0.dist-info/licenses/LICENSE'234adding 'mcptoon-0.8.0.dist-info/licenses/NOTICE'235adding 'mcptoon-0.8.0.dist-info/METADATA'236adding 'mcptoon-0.8.0.dist-info/WHEEL'237adding 'mcptoon-0.8.0.dist-info/entry_points.txt'238adding 'mcptoon-0.8.0.dist-info/top_level.txt'239adding 'mcptoon-0.8.0.dist-info/RECORD'240removing build/bdist.macosx-14.0-arm64/wheel241Successfully built mcptoon-0.8.0-py3-none-any.whl242Finished creating a wheel...243Finished executing pypaBuildPhase
pythonRuntimeDepsCheckHook
244Executing pythonRuntimeDepsCheck245Checking runtime dependencies for mcptoon-0.8.0-py3-none-any.whl246Finished executing pythonRuntimeDepsCheck
installPhase
247Executing pypaInstallPhase248Successfully installed mcptoon-0.8.0-py3-none-any.whl249Finished executing pypaInstallPhase
pythonOutputDistPhase
250Executing pythonOutputDistPhase251Finished executing pythonOutputDistPhase
fixupPhase
252checking for references to /nix/var/nix/builds/nix-37956-120846597/ in /nix/store/79hnq2h7rlbh42r80i5hv8x1pz4m3ri4-mcptoon-0.8.0...253patching script interpreter paths in /nix/store/79hnq2h7rlbh42r80i5hv8x1pz4m3ri4-mcptoon-0.8.0254stripping (with command strip and flags -S) in /nix/store/79hnq2h7rlbh42r80i5hv8x1pz4m3ri4-mcptoon-0.8.0/lib /nix/store/79hnq2h7rlbh42r80i5hv8x1pz4m3ri4-mcptoon-0.8.0/bin255checking for references to /nix/var/nix/builds/nix-37956-120846597/ in /nix/store/68skpld3ljfb8rxbisfai92rc4rrvril-mcptoon-0.8.0-dist...256patching script interpreter paths in /nix/store/68skpld3ljfb8rxbisfai92rc4rrvril-mcptoon-0.8.0-dist257Rewriting #!/nix/store/4l8r0s2r5fna7src82b5fc2hixdvfyw0-python3-3.14.7/bin/python3.14 to #!/nix/store/4l8r0s2r5fna7src82b5fc2hixdvfyw0-python3-3.14.7258wrapping `/nix/store/79hnq2h7rlbh42r80i5hv8x1pz4m3ri4-mcptoon-0.8.0/bin/mcptoon'...259Executing pythonRemoveTestsDir260Finished executing pythonRemoveTestsDir
installCheckPhase
261no Makefile or custom installCheckPhase, doing nothing
pythonImportsCheckPhase
262Executing pythonImportsCheckPhase263Check whether the following modules can be imported: mcptoon
pytestCheckPhase
264Executing pytestCheckPhase265pytest flags: -m pytest -k not\ \(test_search_registry_returns_list\)\ and\ not\ \(test_search_smithery_returns_list\)\ and\ not\ \(test_search_mcp_registry_returns_list\)266============================= test session starts ==============================267platform darwin -- Python 3.14.7, pytest-9.1.1, pluggy-1.6.0268rootdir: /nix/var/nix/builds/nix-37956-120846597/source269configfile: pyproject.toml270testpaths: tests271collected 1466 items / 3 deselected / 1463 selected 272273tests/test_bench.py ............. [ 0%]274tests/test_cache.py .... [ 1%]275tests/test_calculator.py .......................... [ 2%]276tests/test_claude_plugin_package.py ............. [ 3%]277tests/test_cli_flags.py ........... [ 4%]278tests/test_client.py .............................. [ 6%]279tests/test_command_coverage.py ......... [ 7%]280tests/test_completion.py ........ [ 7%]281tests/test_config.py ......... [ 8%]282tests/test_dead_server_diagnostics.py ... [ 8%]283tests/test_demo.py ..................... [ 10%]284tests/test_demo_dead_package.py ........ [ 10%]285tests/test_demo_server.py .............................................. [ 13%]286..... [ 14%]287tests/test_discover.py .................................... [ 16%]288tests/test_doctor_star_hint.py ..... [ 16%]289tests/test_envelope.py ........ [ 17%]290tests/test_fallback_json.py ...... [ 17%]291tests/test_footprint_claims.py ............ [ 18%]292tests/test_gemini_manifest.py ...... [ 19%]293tests/test_health.py ............. [ 19%]294tests/test_help_shortcircuit.py ......... [ 20%]295tests/test_http_user_agent.py ......... [ 21%]296tests/test_installer_registry.py ............................ [ 23%]297tests/test_lang.py ............................ [ 25%]298tests/test_llms_txt.py ...... [ 25%]299tests/test_native_tools.py ............................................. [ 28%]300.................... [ 29%]301tests/test_output.py ................................................... [ 33%]302........................................................................ [ 38%]303................ [ 39%]304tests/test_plugin_install.py .......... [ 40%]305tests/test_plugin_scan.py ............................... [ 42%]306tests/test_policy_overrides.py ................ [ 43%]307tests/test_presence.py ................................................. [ 46%]308....... [ 47%]309tests/test_readme_links.py ... [ 47%]310tests/test_registry_sync.py ............ [ 48%]311tests/test_reversible.py ............................................... [ 51%]312................. [ 52%]313tests/test_router.py .............................................. [ 55%]314tests/test_search.py ................................ [ 57%]315tests/test_serve.py .................................................... [ 61%]316 [ 61%]317tests/test_serve_perf.py .......... [ 62%]318tests/test_serve_prompts.py ........ [ 62%]319tests/test_skill_package.py .................... [ 63%]320tests/test_skill_packs.py ............... [ 65%]321tests/test_skill_search.py .......... [ 65%]322tests/test_skills.py .F................................................. [ 69%]323.....................ss................................................. [ 74%]324................................... [ 76%]325tests/test_stats_toggle.py ......... [ 77%]326tests/test_stderr_pipe_deadlock.py .... [ 77%]327tests/test_sync.py ..................................................... [ 80%]328............ [ 81%]329tests/test_tier_claims_consistent.py .... [ 82%]330tests/test_toml_config.py .......................... [ 83%]331tests/test_toon_cross_validate.py ............................... [ 85%]332tests/test_uninstall_end_to_end.py .......... [ 86%]333tests/test_v02_features.py .................................... [ 89%]334tests/test_v04_features.py ................ [ 90%]335tests/test_v05_features.py ...................... [ 91%]336tests/test_v072_delight.py ..................s.. [ 93%]337tests/test_v073_http_security.py .............................. [ 95%]338tests/test_v074_stdio_timeout.py ............ [ 96%]339tests/test_v076_stateless_serve.py ................... [ 97%]340tests/test_v07_spec2026.py ..................... [ 98%]341tests/test_watch.py .................. [100%]342343=================================== FAILURES ===================================344____________ ScanTests.test_canonical_spelling_wins_when_both_exist ____________345346self = <tests.test_skills.ScanTests testMethod=test_canonical_spelling_wins_when_both_exist>347348 def test_canonical_spelling_wins_when_both_exist(self):349 """Deterministic, not directory-order dependent.350 351 Skipped on Windows: the two names are the same file there, so "both352 exist" cannot be set up. The guarantee still matters on a case-sensitive353 filesystem, where a directory really can hold both.354 """355 if os.name == "nt":356 self.skipTest("NTFS folds case; both spellings cannot coexist")357 with tempfile.TemporaryDirectory() as tmp:358 root = Path(tmp)359 d = root / "both"360 d.mkdir()361 (d / "SKILL.md").write_text(362 "---\nname: both\ndescription: 正名。触发词:both\n---\n\nbody\n",363 encoding="utf-8")364 (d / "skill.md").write_text(365 "---\nname: both\ndescription: 别名。触发词:both\n---\n\nbody\n",366 encoding="utf-8")367 idx = skills.scan_roots([root])368 self.assertEqual(len(idx["skills"]), 1)369> self.assertIn("正名", idx["skills"][0]["desc"])370E AssertionError: '正名' not found in '别名。触发词:both'371372tests/test_skills.py:108: AssertionError373=========================== short test summary info ============================374FAILED tests/test_skills.py::ScanTests::test_canonical_spelling_wins_when_both_exist - AssertionError: '正名' not found in '别名。触发词:both'375====== 1 failed, 1459 passed, 3 skipped, 3 deselected in 82.10s (0:01:22) ======