setup
checks.aarch64-darwin.pkgs-mcptoon
· build #5615
· raw
1these 3 derivations will be built:2 /nix/store/4357srxv583vc1zcrm8lznhhv2f2gr06-source.drv3 /nix/store/bbwcr0q68d3nx28bnmvzjw36cfmralsj-mcptoon-0.8.0.drv4 /nix/store/pp4b74d9f69qd5gqnk9jxryxgis515dv-check-mcptoon.drv5error: build of '/nix/store/bbwcr0q68d3nx28bnmvzjw36cfmralsj-mcptoon-0.8.0.drv' on 'ssh-ng://customer@mac02.m.ntd.one' failed: Cannot build '/nix/store/bbwcr0q68d3nx28bnmvzjw36cfmralsj-mcptoon-0.8.0.drv'.6 Reason: builder failed with exit code 1.7 Output paths:8 /nix/store/68skpld3ljfb8rxbisfai92rc4rrvril-mcptoon-0.8.0-dist9 /nix/store/79hnq2h7rlbh42r80i5hv8x1pz4m3ri4-mcptoon-0.8.010 Last 25 log lines:11 > Skipped on Windows: the two names are the same file there, so "both12 > exist" cannot be set up. The guarantee still matters on a case-sensitive13 > filesystem, where a directory really can hold both.14 > """15 > if os.name == "nt":16 > self.skipTest("NTFS folds case; both spellings cannot coexist")17 > with tempfile.TemporaryDirectory() as tmp:18 > root = Path(tmp)19 > d = root / "both"20 > d.mkdir()21 > (d / "SKILL.md").write_text(22 > "---\nname: both\ndescription: 正名。触发词:both\n---\n\nbody\n",23 > encoding="utf-8")24 > (d / "skill.md").write_text(25 > "---\nname: both\ndescription: 别名。触发词:both\n---\n\nbody\n",26 > encoding="utf-8")27 > idx = skills.scan_roots([root])28 > self.assertEqual(len(idx["skills"]), 1)29 > > self.assertIn("正名", idx["skills"][0]["desc"])30 > E AssertionError: '正名' not found in '别名。触发词:both'31 >32 > tests/test_skills.py:108: AssertionError33 > =========================== short test summary info ============================34 > FAILED tests/test_skills.py::ScanTests::test_canonical_spelling_wins_when_both_exist - AssertionError: '正名' not found in '别名。触发词:both'35 > ====== 1 failed, 1459 passed, 3 skipped, 3 deselected in 82.10s (0:01:22) ======36 For full logs, run:37 nix log /nix/store/bbwcr0q68d3nx28bnmvzjw36cfmralsj-mcptoon-0.8.0.drv38error: Cannot build '/nix/store/bbwcr0q68d3nx28bnmvzjw36cfmralsj-mcptoon-0.8.0.drv'.39 Reason: builder failed with exit code 1.40 Output paths:41 /nix/store/68skpld3ljfb8rxbisfai92rc4rrvril-mcptoon-0.8.0-dist42 /nix/store/79hnq2h7rlbh42r80i5hv8x1pz4m3ri4-mcptoon-0.8.043error: Cannot build '/nix/store/pp4b74d9f69qd5gqnk9jxryxgis515dv-check-mcptoon.drv'.44 Reason: 1 dependency failed.45 Output paths:46 /nix/store/as88faw0103kh1zb8zqgpqnhk6laskb2-check-mcptoon