setup
checks.aarch64-linux.pkgs-clauth
· build #5613
· raw
1these 2 derivations will be built:2 /nix/store/qnyx8kv2yg0ns5bkavpbiapdz9ap3xpc-clauth-0.16.0.drv3 /nix/store/hjsrzaj7jlndic4yb4ljpjh3y82zjhsj-check-clauth.drv4scheduler at farm.numtide.com:50051: upstream connect error or disconnect/reset before headers. retried and the latest reset reason: remote connection failure, reconnecting5scheduler at farm.numtide.com:50051: scheduler passive, another node serves, reconnecting6scheduler at farm.numtide.com:50051: no healthy upstream, reconnecting7scheduler at farm.numtide.com:50051: no healthy upstream, reconnecting8scheduler at farm.numtide.com:50051: no healthy upstream, reconnecting9error: build of '/nix/store/qnyx8kv2yg0ns5bkavpbiapdz9ap3xpc-clauth-0.16.0.drv' on 'grpc://farm.numtide.com:50051?client-cert=/run/secrets/vars/per-machine/bld1/nix-farm-ci/crt&client-key=/run/secrets/vars/per-machine/bld1/nix-farm-ci/key&connect-timeout=21&system=aarch64-linux' failed: Cannot build '/nix/store/qnyx8kv2yg0ns5bkavpbiapdz9ap3xpc-clauth-0.16.0.drv'.10 Reason: builder failed with exit code 101.11 Output paths:12 /nix/store/40385qw8mh3g9qcibwd4y21mcw4a32rv-clauth-0.16.013 Last 25 log lines:14 >15 > ---- daemon::api::terminal::tests::strip_session_env_removes_every_session_var stdout ----16 >17 > thread 'daemon::api::terminal::tests::strip_session_env_removes_every_session_var' (6406) panicked at src/daemon/api/../../../tests/inline/daemon_api_terminal.rs:167:28:18 > run env: Os { code: 2, kind: NotFound, message: "No such file or directory" }19 >20 > ---- daemon::api::tests::a_silent_client_is_dropped_without_holding_a_slot_for_the_whole_lifetime stdout ----21 >22 > thread 'daemon::api::tests::a_silent_client_is_dropped_without_holding_a_slot_for_the_whole_lifetime' (6442) panicked at src/daemon/api/../../../tests/inline/daemon_api_server.rs:559:54:23 > fixture: "openssl failed to generate a named-curve key"24 >25 > ---- usage::scheduler::tests::oauth_and_provider_completions_clear_only_their_own_activity stdout ----26 >27 > thread 'usage::scheduler::tests::oauth_and_provider_completions_clear_only_their_own_activity' (11001) panicked at src/usage/../../tests/inline/scheduler.rs:1420:5:28 > provider completion publishes its own cadence deadline: 179033091903829 >30 >31 > failures:32 > daemon::api::terminal::tests::strip_session_env_removes_every_session_var33 > daemon::api::tests::a_silent_client_is_dropped_without_holding_a_slot_for_the_whole_lifetime34 > usage::scheduler::tests::oauth_and_provider_completions_clear_only_their_own_activity35 >36 > test result: FAILED. 4154 passed; 3 failed; 1 ignored; 0 measured; 6 filtered out; finished in 594.93s37 >38 > error: test failed, to rerun pass `--bin clauth`39 For full logs, run:40 nix log /nix/store/qnyx8kv2yg0ns5bkavpbiapdz9ap3xpc-clauth-0.16.0.drv41error: Cannot build '/nix/store/qnyx8kv2yg0ns5bkavpbiapdz9ap3xpc-clauth-0.16.0.drv'.42 Reason: builder failed with exit code 1.43 Output paths:44 /nix/store/40385qw8mh3g9qcibwd4y21mcw4a32rv-clauth-0.16.045error: Cannot build '/nix/store/hjsrzaj7jlndic4yb4ljpjh3y82zjhsj-check-clauth.drv'.46 Reason: 1 dependency failed.47 Output paths:48 /nix/store/604raxh7bahs4hfqnsym59rr5v7czvxk-check-clauth