setup
checks.aarch64-linux.pkgs-mcptoon
· build #5505
· raw
1these 2 derivations will be built:2 /nix/store/3i5sv8bq23v0nlmc3alpa3j6v51nn4m8-mcptoon-0.7.22.drv3 /nix/store/180lgcy5xil40agy4fbyan0v2k4vq1ic-check-mcptoon.drv4error: build of '/nix/store/3i5sv8bq23v0nlmc3alpa3j6v51nn4m8-mcptoon-0.7.22.drv' on 'grpc://farm.numtide.com:50051?client-cert=/run/secrets/vars/per-machine/bld1/nix-farm-ci/crt&client-key=/run/secrets/vars/per-machine/bld1/nix-farm-ci/key&connect-timeout=23&system=aarch64-linux' failed: Cannot build '/nix/store/3i5sv8bq23v0nlmc3alpa3j6v51nn4m8-mcptoon-0.7.22.drv'.5 Reason: builder failed with exit code 1.6 Output paths:7 /nix/store/snz88dv9gs8x2fmvzfjgqzj6rsdvn4k9-mcptoon-0.7.228 /nix/store/zx2kggki5bq7vznw5flqn41szac501rj-mcptoon-0.7.22-dist9 Last 25 log lines:10 > 11 > if req._tunnel_host:12 > tunnel_headers = {}13 > proxy_auth_hdr = "Proxy-Authorization"14 > if proxy_auth_hdr in headers:15 > tunnel_headers[proxy_auth_hdr] = headers[proxy_auth_hdr]16 > # Proxy-Authorization should not be sent to origin17 > # server.18 > del headers[proxy_auth_hdr]19 > h.set_tunnel(req._tunnel_host, headers=tunnel_headers)20 > 21 > try:22 > try:23 > h.request(req.get_method(), req.selector, req.data, headers,24 > encode_chunked=req.has_header('Transfer-encoding'))25 > except OSError as err: # timeout error26 > > raise URLError(err)27 > E urllib.error.URLError: <urlopen error [Errno -3] Temporary failure in name resolution>28 >29 > /nix/store/3fl7bdkdxk2k4nssy1d1161isbzn6bsr-python3-3.14.7/lib/python3.14/urllib/request.py:1323: URLError30 > =========================== short test summary info ============================31 > FAILED tests/test_serve.py::TestInstallByName::test_search_registry_returns_list - mcptoon.installer.RegistryError: No MCP registry reachable (smithery: URLEr...32 > FAILED tests/test_serve.py::TestInstallByName::test_search_smithery_returns_list - urllib.error.URLError: <urlopen error [Errno -3] Temporary failure in name ...33 > FAILED tests/test_serve.py::TestInstallByName::test_search_mcp_registry_returns_list - urllib.error.URLError: <urlopen error [Errno -3] Temporary failure in name ...34 > ============= 3 failed, 1323 passed, 1 skipped in 72.15s (0:01:12) =============35 For full logs, run:36 nix log /nix/store/3i5sv8bq23v0nlmc3alpa3j6v51nn4m8-mcptoon-0.7.22.drv37error: Cannot build '/nix/store/3i5sv8bq23v0nlmc3alpa3j6v51nn4m8-mcptoon-0.7.22.drv'.38 Reason: builder failed with exit code 1.39 Output paths:40 /nix/store/snz88dv9gs8x2fmvzfjgqzj6rsdvn4k9-mcptoon-0.7.2241 /nix/store/zx2kggki5bq7vznw5flqn41szac501rj-mcptoon-0.7.22-dist42error: Cannot build '/nix/store/180lgcy5xil40agy4fbyan0v2k4vq1ic-check-mcptoon.drv'.43 Reason: 1 dependency failed.44 Output paths:45 /nix/store/c83829v4jc6v9bxzcnnv6zhkvwjp24j6-check-mcptoon