kandev-0.95.1
checks.aarch64-darwin.pkgs-kandev
· build #5340
· raw
1Using versionCheckHook
unpackPhase
2unpacking source archive /nix/store/y500camrq3ksyf3ac4hl2451j8888kd0-source3source root is sourcepatchPhase
4applying patch /nix/store/lmvj32x9r5mc4kq7fgf06bhk186sj39d-prefer-native-acp-runtimes.patch5patching file apps/backend/internal/agent/agents/copilot_acp.go6patching file apps/backend/internal/agent/agents/copilot_acp_test.go7patching file apps/backend/internal/agent/agents/droid_acp.go8patching file apps/backend/internal/agent/agents/gemini.go9patching file apps/backend/internal/agent/agents/kilocode_acp.go10patching file apps/backend/internal/agent/agents/native_binary_agents_test.go11patching file apps/backend/internal/agent/agents/opencode_acp.go12Hunk #1 FAILED at 23.13Hunk #2 FAILED at 84.142 out of 2 hunks FAILED -- saving rejects to file apps/backend/internal/agent/agents/opencode_acp.go.rej15patching file apps/backend/internal/agent/agents/qwen_acp.go16patching file apps/backend/internal/agent/hostutility/managed_runtime_recovery_test.go17Hunk #1 FAILED at 19.18Hunk #2 FAILED at 98.19Hunk #3 FAILED at 176.20Hunk #4 FAILED at 254.214 out of 4 hunks FAILED -- saving rejects to file apps/backend/internal/agent/hostutility/managed_runtime_recovery_test.go.rej22patching file apps/backend/internal/agent/hostutility/managed_runtime_test.go23Hunk #1 FAILED at 24.24Hunk #2 FAILED at 41.252 out of 2 hunks FAILED -- saving rejects to file apps/backend/internal/agent/hostutility/managed_runtime_test.go.rej26patching file apps/backend/internal/agent/hostutility/manager.go27Hunk #3 FAILED at 823.281 out of 3 hunks FAILED -- saving rejects to file apps/backend/internal/agent/hostutility/manager.go.rej29patching file apps/backend/internal/agent/hostutility/native_binary_test.go30patching file apps/backend/internal/agent/registry/provider.go31patching file apps/backend/internal/agent/runtime/lifecycle/manager_launch.go32Hunk #1 succeeded at 609 (offset 2 lines).33patching file apps/backend/internal/agent/runtime/lifecycle/manager_launch_test.go34Hunk #1 FAILED at 131.35Hunk #2 FAILED at 148.362 out of 2 hunks FAILED -- saving rejects to file apps/backend/internal/agent/runtime/lifecycle/manager_launch_test.go.rej37patching file apps/backend/internal/agent/runtime/lifecycle/utility.go38Hunk #4 succeeded at 171 with fuzz 2 (offset 9 lines).39patching file apps/backend/internal/agent/runtime/lifecycle/utility_test.go40Hunk #3 succeeded at 508 (offset 51 lines).41patching file apps/backend/internal/agent/settings/controller/agent_config.go42Hunk #1 succeeded at 231 (offset 30 lines).43Hunk #2 succeeded at 248 (offset 30 lines).44patching file apps/backend/internal/agent/settings/controller/controller_test.go45Hunk #1 FAILED at 174.46Hunk #2 succeeded at 661 (offset 1 line).47Hunk #3 succeeded at 678 (offset 1 line).481 out of 3 hunks FAILED -- saving rejects to file apps/backend/internal/agent/settings/controller/controller_test.go.rej49patching file apps/backend/internal/agentctl/server/utility/acp_executor.go50Hunk #1 succeeded at 1227 (offset 5 lines).51Hunk #2 succeeded at 1243 (offset 5 lines).52patching file apps/backend/internal/agentctl/server/utility/probe_allowlist_test.go