setup
checks.aarch64-linux.pkgs-agentty
· build #5332
· raw
1these 2 derivations will be built:2 /nix/store/l0dm49lmy5g9lnh9sbsax5yd2fsiy4ld-agentty-0.9.5.drv3 /nix/store/jjpsgwm627nrhx38hlk2j2f8iwn9yn8a-check-agentty.drv4error: build of '/nix/store/l0dm49lmy5g9lnh9sbsax5yd2fsiy4ld-agentty-0.9.5.drv' on 'grpc://farm.numtide.com:50051?client-cert=/run/secrets/vars/per-machine/bld1/nix-farm-ci/crt&client-key=/run/secrets/vars/per-machine/bld1/nix-farm-ci/key&connect-timeout=21&system=aarch64-linux' failed: Cannot build '/nix/store/l0dm49lmy5g9lnh9sbsax5yd2fsiy4ld-agentty-0.9.5.drv'.5 Reason: builder failed with exit code 1.6 Output paths:7 /nix/store/bayiaa7ic45m733d8niszyccgbc2bnik-agentty-0.9.58 Last 25 log lines:9 > [356/383] Building CXX object CMakeFiles/agentty_runtime_obj.dir/src/runtime/view/panels/stats.cpp.o10 > [357/383] Building CXX object CMakeFiles/agentty_runtime_obj.dir/src/runtime/view/panels/settings_list.cpp.o11 > [358/383] Building CXX object CMakeFiles/agentty_runtime_obj.dir/src/runtime/view/panels/skills.cpp.o12 > [359/383] Building CXX object CMakeFiles/agentty_runtime_obj.dir/src/runtime/view/panels/fork.cpp.o13 > [360/383] Building CXX object CMakeFiles/agentty_runtime_obj.dir/src/runtime/view/diff_review.cpp.o14 > [361/383] Building CXX object CMakeFiles/agentty_runtime_obj.dir/src/runtime/view/login.cpp.o15 > [362/383] Building CXX object CMakeFiles/agentty_runtime_obj.dir/src/runtime/view/view.cpp.o16 > [363/383] Building CXX object CMakeFiles/agentty_mcp_obj.dir/src/mcp/oauth.cpp.o17 > [364/383] Building CXX object CMakeFiles/agentty_acp_obj.dir/src/acp/server.cpp.o18 > FAILED: [code=1] CMakeFiles/agentty_acp_obj.dir/src/acp/server.cpp.o19 > /nix/store/z2qkl46kv87zcs2sfwfjgc75nq0hbzhf-gcc-wrapper-15.3.0/bin/g++ -DAGENTTY_HAS_RAGCPP=1 -DAGENTTY_MCP=1 -DAGENTTY_VERSION=\"0.9.5\" -DRAGCPP_USE_SIMD=1 -DSIMDJSON_THREADS_ENABLED=1 -I/build/source/include -I/build/source/rag-cpp/include -isystem /build/source/mcp-cpp/include -isystem /build/source/maya/include -isystem /build/source/acp-cpp/include -isystem /build/source/build/acp-cpp/generated/include -O3 -DNDEBUG -std=c++26 -flto=auto -fno-fat-lto-objects -fPIC -fPIC -Wall -Wextra -Wpedantic -Wno-deprecated-declarations -Wno-missing-field-initializers -Wno-maybe-uninitialized -MD -MT CMakeFiles/agentty_acp_obj.dir/src/acp/server.cpp.o -MF CMakeFiles/agentty_acp_obj.dir/src/acp/server.cpp.o.d -o CMakeFiles/agentty_acp_obj.dir/src/acp/server.cpp.o -c /build/source/src/acp/server.cpp20 > g++: fatal error: Killed signal terminated program cc1plus21 > compilation terminated.22 > [365/383] Building CXX object CMakeFiles/agentty_mcp_obj.dir/src/mcp/bridge.cpp.o23 > FAILED: [code=1] CMakeFiles/agentty_mcp_obj.dir/src/mcp/bridge.cpp.o24 > /nix/store/z2qkl46kv87zcs2sfwfjgc75nq0hbzhf-gcc-wrapper-15.3.0/bin/g++ -DAGENTTY_HAS_RAGCPP=1 -DAGENTTY_MCP=1 -DAGENTTY_VERSION=\"0.9.5\" -DRAGCPP_USE_SIMD=1 -DSIMDJSON_THREADS_ENABLED=1 -I/build/source/include -I/build/source/rag-cpp/include -isystem /build/source/mcp-cpp/include -isystem /build/source/maya/include -O3 -DNDEBUG -std=c++26 -flto=auto -fno-fat-lto-objects -fPIC -fPIC -Wall -Wextra -Wpedantic -Wno-deprecated-declarations -Wno-missing-field-initializers -Wno-maybe-uninitialized -MD -MT CMakeFiles/agentty_mcp_obj.dir/src/mcp/bridge.cpp.o -MF CMakeFiles/agentty_mcp_obj.dir/src/mcp/bridge.cpp.o.d -o CMakeFiles/agentty_mcp_obj.dir/src/mcp/bridge.cpp.o -c /build/source/src/mcp/bridge.cpp25 > g++: fatal error: Killed signal terminated program cc1plus26 > compilation terminated.27 > [366/383] Building CXX object CMakeFiles/agentty_mcp_obj.dir/src/tool/mcp_tools_bridge.cpp.o28 > [367/383] Building CXX object CMakeFiles/agentty_acp_obj.dir/src/provider/acp_provider_adapter.cpp.o29 > [368/383] Building CXX object CMakeFiles/agentty_acp_obj.dir/src/provider/external_acp_backend.cpp.o30 > [369/383] Building CXX object CMakeFiles/agentty_mcp_obj.dir/src/mcp/http_server.cpp.o31 > [370/383] Building CXX object CMakeFiles/agentty_mcp_obj.dir/src/mcp/serve.cpp.o32 > [371/383] Building CXX object CMakeFiles/agentty_mcp_obj.dir/src/tool/mcp_tools_backends.cpp.o33 > ninja: build stopped: subcommand failed.34 For full logs, run:35 nix log /nix/store/l0dm49lmy5g9lnh9sbsax5yd2fsiy4ld-agentty-0.9.5.drv36error: Cannot build '/nix/store/l0dm49lmy5g9lnh9sbsax5yd2fsiy4ld-agentty-0.9.5.drv'.37 Reason: builder failed with exit code 1.38 Output paths:39 /nix/store/bayiaa7ic45m733d8niszyccgbc2bnik-agentty-0.9.540error: Cannot build '/nix/store/jjpsgwm627nrhx38hlk2j2f8iwn9yn8a-check-agentty.drv'.41 Reason: 1 dependency failed.42 Output paths:43 /nix/store/8wr73x9aar48zgwkbsv6b5qqzhrpyiqq-check-agentty