setup
checks.aarch64-linux.pkgs-kandev
· build #5323
· raw
1these 5 derivations will be built:2 /nix/store/mpxs1xxw4sy7sw3nsh7sh6f4vzkycqw3-source.drv3 /nix/store/09x9528b993i2807qgz4hy9wwkym5whv-kandev-web-0.95.1.drv4 /nix/store/yf8k76lmlh4span82ikzbh9m87s32r0i-kandev-0.95.1-go-modules.drv5 /nix/store/bfarfki2a3fhfhswlklsqdynm5xgxmhb-kandev-0.95.1.drv6 /nix/store/vk9nxllac53wwkxpyhx4g2l9l2n68wlv-check-kandev.drv7error: build of '/nix/store/bfarfki2a3fhfhswlklsqdynm5xgxmhb-kandev-0.95.1.drv' on 'grpc://farm.numtide.com:50051?client-cert=/run/secrets/vars/per-machine/bld1/nix-farm-ci/crt&client-key=/run/secrets/vars/per-machine/bld1/nix-farm-ci/key&connect-timeout=20&system=aarch64-linux' failed: Cannot build '/nix/store/bfarfki2a3fhfhswlklsqdynm5xgxmhb-kandev-0.95.1.drv'.8 Reason: builder failed with exit code 1.9 Output paths:10 /nix/store/ffff5p75gxg8xdx29c20p5xsxflxgr6r-kandev-0.95.111 Last 25 log lines:12 > 1 out of 3 hunks FAILED -- saving rejects to file apps/backend/internal/agent/hostutility/manager.go.rej13 > patching file apps/backend/internal/agent/hostutility/native_binary_test.go14 > patching file apps/backend/internal/agent/registry/provider.go15 > patching file apps/backend/internal/agent/runtime/lifecycle/manager_launch.go16 > Hunk #1 succeeded at 609 (offset 2 lines).17 > patching file apps/backend/internal/agent/runtime/lifecycle/manager_launch_test.go18 > Hunk #1 FAILED at 131.19 > Hunk #2 FAILED at 148.20 > 2 out of 2 hunks FAILED -- saving rejects to file apps/backend/internal/agent/runtime/lifecycle/manager_launch_test.go.rej21 > patching file apps/backend/internal/agent/runtime/lifecycle/utility.go22 > Hunk #4 succeeded at 171 with fuzz 2 (offset 9 lines).23 > patching file apps/backend/internal/agent/runtime/lifecycle/utility_test.go24 > Hunk #3 succeeded at 508 (offset 51 lines).25 > patching file apps/backend/internal/agent/settings/controller/agent_config.go26 > Hunk #1 succeeded at 231 (offset 30 lines).27 > Hunk #2 succeeded at 248 (offset 30 lines).28 > patching file apps/backend/internal/agent/settings/controller/controller_test.go29 > Hunk #1 FAILED at 174.30 > Hunk #2 succeeded at 661 (offset 1 line).31 > Hunk #3 succeeded at 678 (offset 1 line).32 > 1 out of 3 hunks FAILED -- saving rejects to file apps/backend/internal/agent/settings/controller/controller_test.go.rej33 > patching file apps/backend/internal/agentctl/server/utility/acp_executor.go34 > Hunk #1 succeeded at 1227 (offset 5 lines).35 > Hunk #2 succeeded at 1243 (offset 5 lines).36 > patching file apps/backend/internal/agentctl/server/utility/probe_allowlist_test.go37 For full logs, run:38 nix log /nix/store/bfarfki2a3fhfhswlklsqdynm5xgxmhb-kandev-0.95.1.drv39error: Cannot build '/nix/store/bfarfki2a3fhfhswlklsqdynm5xgxmhb-kandev-0.95.1.drv'.40 Reason: builder failed with exit code 1.41 Output paths:42 /nix/store/ffff5p75gxg8xdx29c20p5xsxflxgr6r-kandev-0.95.143error: Cannot build '/nix/store/vk9nxllac53wwkxpyhx4g2l9l2n68wlv-check-kandev.drv'.44 Reason: 1 dependency failed.45 Output paths:46 /nix/store/1bi0i9gbb4ysl88rdmfivmg3wgm7vs4z-check-kandev