nixbot

builds
1elastic-arm-0766aa56: building bfarfki2a3fhfhswlklsqdynm5xgxmhb-kandev-0.95.1.drv2Using versionCheckHook
unpackPhase
3unpacking source archive /nix/store/y500camrq3ksyf3ac4hl2451j8888kd0-source4source root is source
patchPhase
5applying patch /nix/store/lmvj32x9r5mc4kq7fgf06bhk186sj39d-prefer-native-acp-runtimes.patch6patching file apps/backend/internal/agent/agents/copilot_acp.go7patching file apps/backend/internal/agent/agents/copilot_acp_test.go8patching file apps/backend/internal/agent/agents/droid_acp.go9patching file apps/backend/internal/agent/agents/gemini.go10patching file apps/backend/internal/agent/agents/kilocode_acp.go11patching file apps/backend/internal/agent/agents/native_binary_agents_test.go12patching file apps/backend/internal/agent/agents/opencode_acp.go13Hunk #1 FAILED at 23.14Hunk #2 FAILED at 84.152 out of 2 hunks FAILED -- saving rejects to file apps/backend/internal/agent/agents/opencode_acp.go.rej16patching file apps/backend/internal/agent/agents/qwen_acp.go17patching file apps/backend/internal/agent/hostutility/managed_runtime_recovery_test.go18Hunk #1 FAILED at 19.19Hunk #2 FAILED at 98.20Hunk #3 FAILED at 176.21Hunk #4 FAILED at 254.224 out of 4 hunks FAILED -- saving rejects to file apps/backend/internal/agent/hostutility/managed_runtime_recovery_test.go.rej23patching file apps/backend/internal/agent/hostutility/managed_runtime_test.go24Hunk #1 FAILED at 24.25Hunk #2 FAILED at 41.262 out of 2 hunks FAILED -- saving rejects to file apps/backend/internal/agent/hostutility/managed_runtime_test.go.rej27patching file apps/backend/internal/agent/hostutility/manager.go28Hunk #3 FAILED at 823.291 out of 3 hunks FAILED -- saving rejects to file apps/backend/internal/agent/hostutility/manager.go.rej30patching file apps/backend/internal/agent/hostutility/native_binary_test.go31patching file apps/backend/internal/agent/registry/provider.go32patching file apps/backend/internal/agent/runtime/lifecycle/manager_launch.go33Hunk #1 succeeded at 609 (offset 2 lines).34patching file apps/backend/internal/agent/runtime/lifecycle/manager_launch_test.go35Hunk #1 FAILED at 131.36Hunk #2 FAILED at 148.372 out of 2 hunks FAILED -- saving rejects to file apps/backend/internal/agent/runtime/lifecycle/manager_launch_test.go.rej38patching file apps/backend/internal/agent/runtime/lifecycle/utility.go39Hunk #4 succeeded at 171 with fuzz 2 (offset 9 lines).40patching file apps/backend/internal/agent/runtime/lifecycle/utility_test.go41Hunk #3 succeeded at 508 (offset 51 lines).42patching file apps/backend/internal/agent/settings/controller/agent_config.go43Hunk #1 succeeded at 231 (offset 30 lines).44Hunk #2 succeeded at 248 (offset 30 lines).45patching file apps/backend/internal/agent/settings/controller/controller_test.go46Hunk #1 FAILED at 174.47Hunk #2 succeeded at 661 (offset 1 line).48Hunk #3 succeeded at 678 (offset 1 line).491 out of 3 hunks FAILED -- saving rejects to file apps/backend/internal/agent/settings/controller/controller_test.go.rej50patching file apps/backend/internal/agentctl/server/utility/acp_executor.go51Hunk #1 succeeded at 1227 (offset 5 lines).52Hunk #2 succeeded at 1243 (offset 5 lines).53patching file apps/backend/internal/agentctl/server/utility/probe_allowlist_test.go