nodejs-slim-26.9.0
checks.x86_64-linux.pkgs-hermes-desktop
· build #5077
· raw
1structuredAttrs is enabled
unpackPhase
2unpacking source archive /nix/store/7ajvk1c4mspigbdgf21bn9d7f7p9kmgk-node-v26.9.0.tar.xz3source root is node-v26.9.04setting SOURCE_DATE_EPOCH to timestamp 1789550914 of file "node-v26.9.0/tools/nix/v8.nix"patchPhase
5applying patch /nix/store/j4p9lc7z8hi4g40cpqpj3qxb9a7bvanp-configure-armv6-vfpv2.patch6patching file configure.py7Hunk #1 succeeded at 49 with fuzz 1 (offset -1 lines).8applying patch /nix/store/igz0qnjkvwi4f2mn7i13h3ndxl9n5ryi-node-npm-build-npm-package-logic.patch9patching file deps/npm/node_modules/@npmcli/run-script/lib/set-path.js10Hunk #1 succeeded at 13 with fuzz 2 (offset 1 line).11Hunk #2 succeeded at 37 (offset 8 lines).12patching file deps/npm/node_modules/pacote/lib/git.js13Hunk #1 succeeded at 186 (offset -2 lines).14patching file deps/npm/node_modules/@npmcli/arborist/lib/arborist/build-ideal-tree.js15Hunk #1 succeeded at 802 (offset 62 lines).16patching file deps/npm/node_modules/@npmcli/arborist/lib/arborist/load-actual.js17Hunk #1 succeeded at 121 with fuzz 1 (offset -26 lines).18applying patch /nix/store/57n0csr7hpdd0y91ljxpiwlfw7fsx3kl-use-correct-env-in-tests.patch19patching file test/parallel/test-child-process-default-options.js20patching file test/parallel/test-child-process-env.js21patching file test/parallel/test-child-process-exec-env.js22applying patch /nix/store/p2mhv95s89kaqmdynhz6y6asalf8y4dh-bin-sh-node-run-v22.patch23patching file test/fixtures/run-script/node_modules/.bin/positional-args24Hunk #1 succeeded at 1 with fuzz 1.25applying patch /nix/store/3za8p3x3hjfr1a9b1lc3z4aapp9sm2ja-use-nix-codesign.patch26patching file test/parallel/test-macos-app-sandbox.js27applying patch /nix/store/6whc7i794ygkcwjwrprw7y9aglfl238g-fix-temporal-integration-with-shared-icu.patch28patching file deps/v8/src/objects/js-temporal-zoneinfo64.cc29patching file tools/v8_gypfiles/v8.gyp30Hunk #1 succeeded at 1398 (offset 19 lines).31Hunk #2 succeeded at 2051 (offset 93 lines).updateAutotoolsGnuConfigScriptsPhase
32Updating Autotools / GNU config script to a newer upstream version: ./deps/libffi/config.sub33Updating Autotools / GNU config script to a newer upstream version: ./deps/cares/config/config.sub34Updating Autotools / GNU config script to a newer upstream version: ./deps/ngtcp2/ngtcp2/third-party/libev/config.sub35Updating Autotools / GNU config script to a newer upstream version: ./deps/libffi/config.guess36Updating Autotools / GNU config script to a newer upstream version: ./deps/cares/config/config.guess37Updating Autotools / GNU config script to a newer upstream version: ./deps/ngtcp2/ngtcp2/third-party/libev/config.guessconfigurePhase
38fixing libtool script ./deps/libffi/ltmain.sh39fixing libtool script ./deps/cares/config/ltmain.sh40fixing libtool script ./deps/ngtcp2/ngtcp2/third-party/libev/ltmain.sh41./deps/libffi/configure42./deps/cares/configure43./deps/ngtcp2/ngtcp2/third-party/libev/configure44configure flags: --prefix=/nix/store/mn8r5sjblqmigxv5lg89q4wcj5zqb16n-nodejs-slim-26.9.0 --ninja --with-intl=system-icu --openssl-use-def-ca-store --no-cross-compiling --dest-os=linux --dest-cpu=x64 --v8-enable-temporal-support --use-prefix-to-find-headers --shared-abseil --shared-abseil-libpath=/nix/store/iqvb7h1ykhm12304qwx17xbncrhhy1g4-abseil-cpp-20260107.1/lib --shared-ada --shared-ada-libpath=/nix/store/vk3yq4nzlrdvq1qxgy3764qaycanr0mc-ada-4.0.0/lib --shared-brotli --shared-brotli-libpath=/nix/store/xhgd6rb4h8ssid9yw8nvw74cwq69md5y-brotli-1.2.0-lib/lib --shared-cares --shared-cares-libpath=/nix/store/68syfccdbv3hlz7imlc9xl9fzyz4v8gx-c-ares-1.34.8/lib --shared-ffi --shared-ffi-libpath=/nix/store/3r5wfb1dl3sfknvy1yringvmap0hxj4r-libffi-3.8.0/lib --shared-gtest --shared-gtest-libpath=/nix/store/5sdsmm8s00hck28yp95fk993rg42mqsp-gtest-1.18.0/lib --shared-hdr-histogram --shared-hdr-histogram-libpath=/nix/store/9g532g9jf92xy9xh68p99ml815q11zs0-hdrhistogram_c-0.11.10/lib --shared-highway --shared-highway-libpath=/nix/store/xs1jbkdzxs4ym0rh89nx8xfwj387x3aj-libhwy-1.4.0/lib --shared-http-parser --shared-http-parser-libpath=/nix/store/1lw7d9jsv7qb6nvc4fmvvqsyphaacqcs-llhttp-9.4.3/lib --shared-libuv --shared-libuv-libpath=/nix/store/68b1blnvl4scgdq48d4p7h4lw4pm5w0w-libuv-1.52.1/lib --shared-lief --shared-lief-libpath=/nix/store/nx4g3j20wvgq36b406q6rysvqzzrxaci-lief-0.17.6/lib --shared-merve --shared-merve-libpath=/nix/store/2gj58j8rd88kaan7bsqhl9fjxxp11qqi-merve-1.2.2/lib --shared-nbytes --shared-nbytes-libpath=/nix/store/zf8c839ahp1fn736lih7ai2y14rrx2gn-nbytes-0.1.4/lib --shared-nghttp2 --shared-nghttp2-libpath=/nix/store/6avzrsm02jh7q48ym3hgznj3ypc2shc2-nghttp2-1.70.0-lib/lib --shared-nghttp3 --shared-nghttp3-libpath=/nix/store/dki4fkk75v2x4aqkszmi257wxq6rkkyr-nghttp3-1.16.0/lib --shared-ngtcp2 --shared-ngtcp2-libpath=/nix/store/2hc131frgdz45bjbajmpvlrj185lah7p-ngtcp2-1.23.0/lib --shared-openssl --shared-openssl-libpath=/nix/store/yj34vymbqf7mf4lmffipy8jqc4kwr1mc-openssl-3.6.4/lib --shared-simdjson --shared-simdjson-libpath=/nix/store/129shchmqszagbb0m8kk7ddzb7nnklxv-simdjson-4.6.8/lib --shared-simdutf --shared-simdutf-libpath=/nix/store/dw6xlar7m4qfrhbk63zhcc5pmixa1ga1-simdutf-9.1.0/lib --shared-sqlite --shared-sqlite-libpath=/nix/store/7a0nx1a0rdc5s07vxrsdhplqnzncl5z9-sqlite-3.53.3/lib --shared-temporal_capi --shared-temporal_capi-libpath=/nix/store/7hrx4vyx67h46xxwqj3zw4nafa1m8d04-temporal_capi-0.2.6/lib --shared-uvwasi --shared-uvwasi-libpath=/nix/store/qnbgx63w8yya5330xcxyixja3ah6gfzm-uvwasi-0.0.23/lib --shared-zlib --shared-zlib-libpath=/nix/store/lw86vj9kfwgvlivg3p8qg2nibpmhmsl9-zlib-1.3.2/lib --shared-zstd --shared-zstd-libpath=/nix/store/8ik1d1r4l2jzm9mjh6bc0a13yczx62wg-zstd-1.5.7/lib45INFO: configure completed successfullybuildPhase
46build flags: -j48 SHELL=/nix/store/svx59425zxp552p2b8gm11qj5r09b56i-bash-5.3p15/bin/bash47TERM=dumb ninja -C out/Release -j4848ninja: Entering directory `out/Release'49[1/1871] CXX obj/deps/v8/src/base/v8_libbase.abort-mode.o50[2/1871] CXX obj/deps/v8/src/base/v8_libbase.fpu.o51[3/1871] CXX obj/deps/v8/src/base/v8_libbase.vlq-base64.o52[4/1871] CXX obj/deps/v8/src/base/v8_libbase.bits.o53[5/1871] CXX obj/deps/v8/src/base/v8_libbase.sys-info.o54[6/1871] CXX obj/deps/v8/src/base/debug/v8_libbase.stack_trace.o55[7/1871] CXX obj/deps/v8/src/base/v8_libbase.division-by-constant.o56[8/1871] CXX obj/deps/v8/src/base/platform/v8_libbase.platform.o57[9/1871] CXX obj/deps/v8/src/base/v8_libbase.once.o58[10/1871] CXX obj/deps/v8/src/base/v8_libbase.cpu.o59[11/1871] CXX obj/deps/v8/src/base/numbers/v8_libbase.diy-fp.o60[12/1871] CXX obj/deps/v8/src/base/numbers/v8_libbase.bignum-dtoa.o61[13/1871] CXX obj/deps/v8/src/base/numbers/v8_libbase.cached-powers.o62[14/1871] CXX obj/deps/v8/src/base/v8_libbase.file-utils.o63[15/1871] CXX obj/deps/v8/src/base/platform/v8_libbase.semaphore.o64[16/1871] CXX obj/deps/v8/src/base/platform/v8_libbase.platform-posix-time.o65[17/1871] CXX obj/deps/v8/src/base/v8_libbase.region-allocator.o66[18/1871] CXX obj/deps/v8/src/base/sanitizer/v8_libbase.lsan-page-allocator.o67[19/1871] CXX obj/deps/v8/src/base/numbers/v8_libbase.dtoa.o68[20/1871] CXX obj/deps/v8/src/base/v8_libbase.page-allocator.o69[21/1871] CXX obj/deps/v8/src/base/numbers/v8_libbase.fixed-dtoa.o70[22/1871] CXX obj/deps/v8/src/base/numbers/v8_libbase.strtod.o71[23/1871] CXX obj/deps/v8/src/base/sanitizer/v8_libbase.lsan-virtual-address-space.o72[24/1871] CXX obj/deps/v8/src/base/debug/v8_libbase.stack_trace_posix.o73[25/1871] ACTION Checking inspector protocol compatibility74[26/1871] CXX obj/deps/v8/src/base/numbers/v8_libbase.bignum.o75[27/1871] CXX obj/deps/v8/src/base/platform/v8_libbase.memory-protection-key.o76[28/1871] ACTION Generating temporal zoneinfo static data77[29/1871] CXX obj/deps/v8/src/base/v8_libbase.strings.o78[30/1871] CXX obj/deps/v8/src/base/numbers/v8_libbase.fast-dtoa.o79[31/1871] CC obj/deps/v8/third_party/zlib/v8_zlib.compress.o80cc1: warning: command-line option '-fvisibility-inlines-hidden' is valid for C++/ObjC++ but not for C81[32/1871] CC obj/deps/v8/third_party/zlib/v8_zlib.cpu_features.o82cc1: warning: command-line option '-fvisibility-inlines-hidden' is valid for C++/ObjC++ but not for C83[33/1871] CXX obj/deps/v8/src/base/platform/v8_libbase.platform-linux.o84[34/1871] CC obj/deps/v8/third_party/zlib/v8_zlib.adler32.o85cc1: warning: command-line option '-fvisibility-inlines-hidden' is valid for C++/ObjC++ but not for C86[35/1871] CC obj/deps/v8/third_party/zlib/v8_zlib.gzclose.o87cc1: warning: command-line option '-fvisibility-inlines-hidden' is valid for C++/ObjC++ but not for C88[36/1871] CXX obj/deps/v8/src/base/v8_libbase.ieee754.o89[37/1871] CC obj/deps/v8/third_party/zlib/v8_zlib.gzlib.o90cc1: warning: command-line option '-fvisibility-inlines-hidden' is valid for C++/ObjC++ but not for C91[38/1871] CC obj/deps/v8/third_party/zlib/v8_zlib.crc32.o92cc1: warning: command-line option '-fvisibility-inlines-hidden' is valid for C++/ObjC++ but not for C93[39/1871] CC obj/deps/v8/third_party/zlib/v8_zlib.gzwrite.o94cc1: warning: command-line option '-fvisibility-inlines-hidden' is valid for C++/ObjC++ but not for C95[40/1871] CC obj/deps/v8/third_party/zlib/v8_zlib.gzread.o96cc1: warning: command-line option '-fvisibility-inlines-hidden' is valid for C++/ObjC++ but not for C97[41/1871] ACTION Generating inspector protocol sources from protocol json98[42/1871] STAMP obj/tools/v8_gypfiles/v8_inspector_headers.actions_rules_copies.stamp99[43/1871] CC obj/deps/v8/third_party/zlib/v8_zlib.inftrees.o100cc1: warning: command-line option '-fvisibility-inlines-hidden' is valid for C++/ObjC++ but not for C101[44/1871] CC obj/deps/v8/third_party/zlib/v8_zlib.uncompr.o102cc1: warning: command-line option '-fvisibility-inlines-hidden' is valid for C++/ObjC++ but not for C103[45/1871] CC obj/deps/v8/third_party/zlib/v8_zlib.zutil.o104cc1: warning: command-line option '-fvisibility-inlines-hidden' is valid for C++/ObjC++ but not for C105[46/1871] CC obj/deps/v8/third_party/zlib/v8_zlib.infback.o106cc1: warning: command-line option '-fvisibility-inlines-hidden' is valid for C++/ObjC++ but not for C107[47/1871] CC obj/deps/v8/third_party/zlib/v8_zlib.inffast.o108cc1: warning: command-line option '-fvisibility-inlines-hidden' is valid for C++/ObjC++ but not for C109[48/1871] CXX obj/deps/v8/third_party/zlib/google/v8_zlib.compression_utils_portable.o110[49/1871] CXX obj/deps/v8/src/base/platform/v8_libbase.mutex.o111[50/1871] CXX obj/deps/v8/src/base/platform/v8_libbase.condition-variable.o112[51/1871] CXX obj/deps/v8/src/base/v8_libbase.logging.o113[52/1871] CXX obj/deps/v8/src/base/v8_libbase.virtual-address-space.o114[53/1871] CXX obj/deps/v8/src/base/v8_libbase.bounded-page-allocator.o115[54/1871] CC obj/deps/v8/third_party/zlib/v8_zlib.trees.o116cc1: warning: command-line option '-fvisibility-inlines-hidden' is valid for C++/ObjC++ but not for C117[55/1871] CXX obj/deps/v8/src/base/v8_libbase.virtual-address-space-page-allocator.o118[56/1871] CXX obj/deps/v8/src/base/v8_libbase.emulated-virtual-address-subspace.o119[57/1871] CXX obj/deps/v8/src/base/utils/v8_libbase.random-number-generator.o120[58/1871] CXX obj/deps/v8/src/base/platform/v8_libbase.time.o121[59/1871] CC obj/deps/v8/third_party/zlib/v8_zlib.deflate.o122cc1: warning: command-line option '-fvisibility-inlines-hidden' is valid for C++/ObjC++ but not for C123[60/1871] CXX obj/deps/v8/src/interpreter/bytecode_builtins_list_generator.bytecode-operands.o124[61/1871] CXX obj/deps/v8/src/base/platform/v8_libbase.platform-posix.o125[62/1871] AR obj/tools/v8_gypfiles/libv8_libbase.a126[63/1871] STAMP obj/tools/v8_gypfiles/v8_flags.actions_depends.stamp127[64/1871] CXX obj/deps/v8/src/regexp/gen-regexp-special-case.gen-regexp-special-case.o128[65/1871] CXX obj/deps/v8/src/torque/torque_base.cpp-builder.o129[66/1871] CC obj/deps/v8/third_party/zlib/v8_zlib.inflate.o130cc1: warning: command-line option '-fvisibility-inlines-hidden' is valid for C++/ObjC++ but not for C131[67/1871] AR obj/tools/v8_gypfiles/libv8_zlib.a132[68/1871] CXX obj/deps/v8/src/torque/torque_base.source-positions.o133[69/1871] CXX obj/deps/v8/src/interpreter/bytecode_builtins_list_generator.bytecodes.o134[70/1871] CXX obj/deps/v8/src/builtins/bytecode_builtins_list_generator.generate-bytecodes-builtins-list.o135[71/1871] CXX obj/src/node_js2c.embedded_data.o136[72/1871] LINK gen-regexp-special-case137[73/1871] CXX obj/deps/v8/src/libplatform/v8_libplatform.default-thread-isolated-allocator.o138[74/1871] ACTION run_gen-regexp-special-case: run_gen-regexp-special-case_action_72d03329d19e24c609ee6e65eeeb110034e9261c37b8a8d83522628d574e9fa7139[75/1871] CXX obj/src/node_js2c.builtin_info.o140[76/1871] CXX obj/deps/v8/src/libplatform/tracing/v8_libplatform.trace-object.o141[77/1871] LINK bytecode_builtins_list_generator142[78/1871] CXX obj/deps/inspector_protocol/crdtp/crdtp.error_support.o143[79/1871] CXX obj/deps/v8/src/torque/torque_base.declarable.o144[80/1871] CC obj/test/nop/nop.nop.o145[81/1871] CXX obj/deps/ncrypto/ncrypto_engine.engine.o146[82/1871] AR obj/deps/ncrypto/libncrypto_engine.a147[83/1871] CXX obj/deps/v8/src/libplatform/tracing/v8_libplatform.trace-config.o148[84/1871] ACTION generate_bytecode_builtins_list: generate_bytecode_builtins_list_action_73a03d1964edbe79fc19deb968fa21d5c456544c3d095b62158c8959ed2aeed1149[85/1871] CC obj/test/overlapped-checker/overlapped-checker.main_unix.o150[86/1871] CXX obj/deps/inspector_protocol/crdtp/crdtp.json_platform.o151[87/1871] CXX obj/deps/v8/src/libplatform/tracing/v8_libplatform.trace-writer.o152[88/1871] CXX obj/deps/inspector_protocol/crdtp/crdtp.span.o153[89/1871] CXX obj/deps/v8/src/torque/torque_base.global-context.o154[90/1871] LINK nop155[91/1871] CXX obj/deps/v8/src/torque/torque_base.type-inference.o156[92/1871] LINK overlapped-checker157[93/1871] CXX obj/deps/inspector_protocol/crdtp/crdtp.serializable.o158[94/1871] CXX obj/deps/inspector_protocol/crdtp/crdtp.status.o159[95/1871] CXX obj/deps/v8/src/torque/torque_base.torque-code-generator.o160[96/1871] CXX obj/deps/v8/src/libplatform/v8_libplatform.default-worker-threads-task-runner.o161[97/1871] CXX obj/deps/v8/src/libplatform/v8_libplatform.delayed-task-queue.o162[98/1871] CXX obj/deps/v8/src/torque/torque_base.earley-parser.o163[99/1871] CXX obj/deps/v8/src/libplatform/v8_libplatform.worker-thread.o164[100/1871] CXX obj/deps/v8/src/libplatform/v8_libplatform.task-queue.o165[101/1871] CXX obj/deps/v8/src/libplatform/v8_libplatform.default-job.o166[102/1871] CXX obj/deps/v8/src/torque/torque_base.utils.o167[103/1871] CXX obj/deps/v8/src/libplatform/tracing/v8_libplatform.trace-buffer.o168[104/1871] CXX obj/deps/inspector_protocol/crdtp/crdtp.protocol_core.o169[105/1871] CXX obj/deps/v8/src/torque/torque_base.type-oracle.o170[106/1871] CXX obj/deps/v8/src/torque/torque_base.server-data.o171[107/1871] CXX obj/deps/v8/src/libplatform/v8_libplatform.default-foreground-task-runner.o172[108/1871] CXX obj/deps/v8/src/libplatform/tracing/v8_libplatform.tracing-controller.o173[109/1871] CXX obj/deps/inspector_protocol/crdtp/crdtp.cbor.o174[110/1871] CXX obj/deps/v8/src/torque/torque_base.class-debug-reader-generator.o175[111/1871] CXX obj/deps/v8/src/libplatform/v8_libplatform.default-platform.o176[112/1871] AR obj/tools/v8_gypfiles/libv8_libplatform.a177[113/1871] CXX obj/deps/v8/src/torque/torque_base.kythe-data.o178[114/1871] CXX obj/deps/v8/src/torque/torque_base.cfg.o179[115/1871] CXX obj/deps/inspector_protocol/crdtp/crdtp.dispatch.o180[116/1871] CXX obj/deps/v8/src/torque/torque_base.instance-type-generator.o181[117/1871] CXX obj/deps/v8/src/torque/torque_base.cc-generator.o182[118/1871] CXX obj/deps/v8/src/torque/torque.torque.o183[119/1871] CXX obj/tools/node_js2c.js2c.o184[120/1871] LINK node_js2c185[121/1871] STAMP obj/node_base.actions_depends.stamp186[122/1871] ACTION node_base: node_js2c_f26a10641803f604d1307d23f68bde8b450ad8f073bd43313642df31e7a3478c187[123/1871] ACTION node_base: convert_node_protocol_to_json_f26a10641803f604d1307d23f68bde8b450ad8f073bd43313642df31e7a3478c188[124/1871] CXX obj/deps/v8/src/torque/torque_base.declaration-visitor.o189[125/1871] CXX obj/deps/v8/src/torque/torque_base.csa-generator.o190[126/1871] ACTION node_base: concatenate_protocols_f26a10641803f604d1307d23f68bde8b450ad8f073bd43313642df31e7a3478c191[127/1871] ACTION node_base: v8_inspector_compress_protocol_json_f26a10641803f604d1307d23f68bde8b450ad8f073bd43313642df31e7a3478c192[128/1871] CXX obj/deps/v8/src/torque/torque_base.declarations.o193[129/1871] CXX obj/deps/inspector_protocol/crdtp/crdtp.json.o194[130/1871] AR obj/deps/inspector_protocol/libcrdtp.a195[131/1871] CXX obj/deps/v8/src/torque/torque_base.instructions.o196[132/1871] ACTION Generating node protocol sources from protocol json197[133/1871] STAMP obj/node_base.actions_rules_copies.stamp198[134/1871] CXX obj/deps/v8/src/torque/torque_base.torque-compiler.o199[135/1871] CXX obj/src/node_base.embedded_data.o200[136/1871] CXX obj/deps/v8/src/torque/torque_base.type-visitor.o201[137/1871] CXX obj/src/node_base.builtin_info.o202[138/1871] CXX obj/src/api/node_base.utils.o203[139/1871] CXX obj/src/node_base.json_utils.o204[140/1871] CXX obj/deps/ncrypto/ncrypto.ncrypto.o205[141/1871] CXX obj/src/node_base.internal_only_v8.o206In file included from ../../src/util.h:29,207 from ../../src/util-inl.h:33,208 from ../../src/internal_only_v8.cc:3:209../../deps/v8/include/v8-profiler.h: In constructor 'v8::HeapProfiler::HeapSnapshotOptions::HeapSnapshotOptions()':210../../deps/v8/include/v8-profiler.h:1128:27: warning: 'v8::HeapProfiler::HeapSnapshotOptions::global_object_name_resolver' is deprecated: Use context_name_resolver callback instead. [-Wdeprecated-declarations]211 1128 | HeapSnapshotOptions() {}212 | ^213../../deps/v8/include/v8-profiler.h:1142:25: note: declared here214 1142 | ObjectNameResolver* global_object_name_resolver = nullptr;215 | ^~~~~~~~~~~~~~~~~~~~~~~~~~~216../../deps/v8/include/v8-profiler.h:1128:27: warning: 'v8::HeapProfiler::HeapSnapshotOptions::global_object_name_resolver' is deprecated: Use context_name_resolver callback instead. [-Wdeprecated-declarations]217 1128 | HeapSnapshotOptions() {}218 | ^219../../deps/v8/include/v8-profiler.h:1142:25: note: declared here220 1142 | ObjectNameResolver* global_object_name_resolver = nullptr;221 | ^~~~~~~~~~~~~~~~~~~~~~~~~~~222[142/1871] CXX obj/src/node_base.cleanup_queue.o223In file included from ../../src/memory_tracker.h:6,224 from ../../src/cleanup_queue.h:11,225 from ../../src/cleanup_queue.cc:1:226../../deps/v8/include/v8-profiler.h: In constructor 'v8::HeapProfiler::HeapSnapshotOptions::HeapSnapshotOptions()':227../../deps/v8/include/v8-profiler.h:1128:27: warning: 'v8::HeapProfiler::HeapSnapshotOptions::global_object_name_resolver' is deprecated: Use context_name_resolver callback instead. [-Wdeprecated-declarations]228 1128 | HeapSnapshotOptions() {}229 | ^230../../deps/v8/include/v8-profiler.h:1142:25: note: declared here231 1142 | ObjectNameResolver* global_object_name_resolver = nullptr;232 | ^~~~~~~~~~~~~~~~~~~~~~~~~~~233../../deps/v8/include/v8-profiler.h:1128:27: warning: 'v8::HeapProfiler::HeapSnapshotOptions::global_object_name_resolver' is deprecated: Use context_name_resolver callback instead. [-Wdeprecated-declarations]234 1128 | HeapSnapshotOptions() {}235 | ^236../../deps/v8/include/v8-profiler.h:1142:25: note: declared here237 1142 | ObjectNameResolver* global_object_name_resolver = nullptr;238 | ^~~~~~~~~~~~~~~~~~~~~~~~~~~239[143/1871] CXX obj/gen/src/node/inspector/protocol/node_base.NodeRuntime.o240In file included from ../../src/util.h:29,241 from ../../src/inspector/node_string.h:10,242 from gen/src/node/inspector/protocol/Forward.h:19,243 from gen/src/node/inspector/protocol/Protocol.h:18,244 from gen/src/node/inspector/protocol/NodeRuntime.h:10,245 from gen/src/node/inspector/protocol/NodeRuntime.cpp:7:246../../deps/v8/include/v8-profiler.h: In constructor 'v8::HeapProfiler::HeapSnapshotOptions::HeapSnapshotOptions()':247../../deps/v8/include/v8-profiler.h:1128:27: warning: 'v8::HeapProfiler::HeapSnapshotOptions::global_object_name_resolver' is deprecated: Use context_name_resolver callback instead. [-Wdeprecated-declarations]248 1128 | HeapSnapshotOptions() {}249 | ^250../../deps/v8/include/v8-profiler.h:1142:25: note: declared here251 1142 | ObjectNameResolver* global_object_name_resolver = nullptr;252 | ^~~~~~~~~~~~~~~~~~~~~~~~~~~253../../deps/v8/include/v8-profiler.h:1128:27: warning: 'v8::HeapProfiler::HeapSnapshotOptions::global_object_name_resolver' is deprecated: Use context_name_resolver callback instead. [-Wdeprecated-declarations]254 1128 | HeapSnapshotOptions() {}255 | ^256../../deps/v8/include/v8-profiler.h:1142:25: note: declared here257 1142 | ObjectNameResolver* global_object_name_resolver = nullptr;258 | ^~~~~~~~~~~~~~~~~~~~~~~~~~~259[144/1871] CXX obj/gen/src/node/inspector/protocol/node_base.Storage.o260In file included from ../../src/util.h:29,261 from ../../src/inspector/node_string.h:10,262 from gen/src/node/inspector/protocol/Forward.h:19,263 from gen/src/node/inspector/protocol/Protocol.h:18,264 from gen/src/node/inspector/protocol/Storage.h:10,265 from gen/src/node/inspector/protocol/Storage.cpp:7:266../../deps/v8/include/v8-profiler.h: In constructor 'v8::HeapProfiler::HeapSnapshotOptions::HeapSnapshotOptions()':267../../deps/v8/include/v8-profiler.h:1128:27: warning: 'v8::HeapProfiler::HeapSnapshotOptions::global_object_name_resolver' is deprecated: Use context_name_resolver callback instead. [-Wdeprecated-declarations]268 1128 | HeapSnapshotOptions() {}269 | ^270../../deps/v8/include/v8-profiler.h:1142:25: note: declared here271 1142 | ObjectNameResolver* global_object_name_resolver = nullptr;272 | ^~~~~~~~~~~~~~~~~~~~~~~~~~~273../../deps/v8/include/v8-profiler.h:1128:27: warning: 'v8::HeapProfiler::HeapSnapshotOptions::global_object_name_resolver' is deprecated: Use context_name_resolver callback instead. [-Wdeprecated-declarations]274 1128 | HeapSnapshotOptions() {}275 | ^276../../deps/v8/include/v8-profiler.h:1142:25: note: declared here277 1142 | ObjectNameResolver* global_object_name_resolver = nullptr;278 | ^~~~~~~~~~~~~~~~~~~~~~~~~~~279[145/1871] CXX obj/gen/src/node/inspector/protocol/node_base.IO.o280In file included from ../../src/util.h:29,281 from ../../src/inspector/node_string.h:10,282 from gen/src/node/inspector/protocol/Forward.h:19,283 from gen/src/node/inspector/protocol/Protocol.h:18,284 from gen/src/node/inspector/protocol/IO.h:10,285 from gen/src/node/inspector/protocol/IO.cpp:7:286../../deps/v8/include/v8-profiler.h: In constructor 'v8::HeapProfiler::HeapSnapshotOptions::HeapSnapshotOptions()':287../../deps/v8/include/v8-profiler.h:1128:27: warning: 'v8::HeapProfiler::HeapSnapshotOptions::global_object_name_resolver' is deprecated: Use context_name_resolver callback instead. [-Wdeprecated-declarations]288 1128 | HeapSnapshotOptions() {}289 | ^290../../deps/v8/include/v8-profiler.h:1142:25: note: declared here291 1142 | ObjectNameResolver* global_object_name_resolver = nullptr;292 | ^~~~~~~~~~~~~~~~~~~~~~~~~~~293../../deps/v8/include/v8-profiler.h:1128:27: warning: 'v8::HeapProfiler::HeapSnapshotOptions::global_object_name_resolver' is deprecated: Use context_name_resolver callback instead. [-Wdeprecated-declarations]294 1128 | HeapSnapshotOptions() {}295 | ^296../../deps/v8/include/v8-profiler.h:1142:25: note: declared here297 1142 | ObjectNameResolver* global_object_name_resolver = nullptr;298 | ^~~~~~~~~~~~~~~~~~~~~~~~~~~299[146/1871] CXX obj/gen/src/node/inspector/protocol/node_base.NodeWorker.o300In file included from ../../src/util.h:29,301 from ../../src/inspector/node_string.h:10,302 from gen/src/node/inspector/protocol/Forward.h:19,303 from gen/src/node/inspector/protocol/Protocol.h:18,304 from gen/src/node/inspector/protocol/NodeWorker.h:10,305 from gen/src/node/inspector/protocol/NodeWorker.cpp:7:306../../deps/v8/include/v8-profiler.h: In constructor 'v8::HeapProfiler::HeapSnapshotOptions::HeapSnapshotOptions()':307../../deps/v8/include/v8-profiler.h:1128:27: warning: 'v8::HeapProfiler::HeapSnapshotOptions::global_object_name_resolver' is deprecated: Use context_name_resolver callback instead. [-Wdeprecated-declarations]308 1128 | HeapSnapshotOptions() {}309 | ^310../../deps/v8/include/v8-profiler.h:1142:25: note: declared here311 1142 | ObjectNameResolver* global_object_name_resolver = nullptr;312 | ^~~~~~~~~~~~~~~~~~~~~~~~~~~313../../deps/v8/include/v8-profiler.h:1128:27: warning: 'v8::HeapProfiler::HeapSnapshotOptions::global_object_name_resolver' is deprecated: Use context_name_resolver callback instead. [-Wdeprecated-declarations]314 1128 | HeapSnapshotOptions() {}315 | ^316../../deps/v8/include/v8-profiler.h:1142:25: note: declared here317 1142 | ObjectNameResolver* global_object_name_resolver = nullptr;318 | ^~~~~~~~~~~~~~~~~~~~~~~~~~~319[147/1871] CXX obj/gen/src/node/inspector/protocol/node_base.Target.o320In file included from ../../src/util.h:29,321 from ../../src/inspector/node_string.h:10,322 from gen/src/node/inspector/protocol/Forward.h:19,323 from gen/src/node/inspector/protocol/Protocol.h:18,324 from gen/src/node/inspector/protocol/Target.h:10,325 from gen/src/node/inspector/protocol/Target.cpp:7:326../../deps/v8/include/v8-profiler.h: In constructor 'v8::HeapProfiler::HeapSnapshotOptions::HeapSnapshotOptions()':327../../deps/v8/include/v8-profiler.h:1128:27: warning: 'v8::HeapProfiler::HeapSnapshotOptions::global_object_name_resolver' is deprecated: Use context_name_resolver callback instead. [-Wdeprecated-declarations]328 1128 | HeapSnapshotOptions() {}329 | ^330../../deps/v8/include/v8-profiler.h:1142:25: note: declared here331 1142 | ObjectNameResolver* global_object_name_resolver = nullptr;332 | ^~~~~~~~~~~~~~~~~~~~~~~~~~~333../../deps/v8/include/v8-profiler.h:1128:27: warning: 'v8::HeapProfiler::HeapSnapshotOptions::global_object_name_resolver' is deprecated: Use context_name_resolver callback instead. [-Wdeprecated-declarations]334 1128 | HeapSnapshotOptions() {}335 | ^336../../deps/v8/include/v8-profiler.h:1142:25: note: declared here337 1142 | ObjectNameResolver* global_object_name_resolver = nullptr;338 | ^~~~~~~~~~~~~~~~~~~~~~~~~~~339[148/1871] CXX obj/src/node_base.node_debug.o340[149/1871] CXX obj/gen/src/node/inspector/protocol/node_base.NodeTracing.o341In file included from ../../src/util.h:29,342 from ../../src/inspector/node_string.h:10,343 from gen/src/node/inspector/protocol/Forward.h:19,344 from gen/src/node/inspector/protocol/Protocol.h:18,345 from gen/src/node/inspector/protocol/NodeTracing.h:10,346 from gen/src/node/inspector/protocol/NodeTracing.cpp:7:347../../deps/v8/include/v8-profiler.h: In constructor 'v8::HeapProfiler::HeapSnapshotOptions::HeapSnapshotOptions()':348../../deps/v8/include/v8-profiler.h:1128:27: warning: 'v8::HeapProfiler::HeapSnapshotOptions::global_object_name_resolver' is deprecated: Use context_name_resolver callback instead. [-Wdeprecated-declarations]349 1128 | HeapSnapshotOptions() {}350 | ^351../../deps/v8/include/v8-profiler.h:1142:25: note: declared here352 1142 | ObjectNameResolver* global_object_name_resolver = nullptr;353 | ^~~~~~~~~~~~~~~~~~~~~~~~~~~354../../deps/v8/include/v8-profiler.h:1128:27: warning: 'v8::HeapProfiler::HeapSnapshotOptions::global_object_name_resolver' is deprecated: Use context_name_resolver callback instead. [-Wdeprecated-declarations]355 1128 | HeapSnapshotOptions() {}356 | ^357../../deps/v8/include/v8-profiler.h:1142:25: note: declared here358 1142 | ObjectNameResolver* global_object_name_resolver = nullptr;359 | ^~~~~~~~~~~~~~~~~~~~~~~~~~~360[150/1871] CXX obj/gen/src/node/inspector/protocol/node_base.DOMStorage.o361In file included from ../../src/util.h:29,362 from ../../src/inspector/node_string.h:10,363 from gen/src/node/inspector/protocol/Forward.h:19,364 from gen/src/node/inspector/protocol/Protocol.h:18,365 from gen/src/node/inspector/protocol/DOMStorage.h:10,366 from gen/src/node/inspector/protocol/DOMStorage.cpp:7:367../../deps/v8/include/v8-profiler.h: In constructor 'v8::HeapProfiler::HeapSnapshotOptions::HeapSnapshotOptions()':368../../deps/v8/include/v8-profiler.h:1128:27: warning: 'v8::HeapProfiler::HeapSnapshotOptions::global_object_name_resolver' is deprecated: Use context_name_resolver callback instead. [-Wdeprecated-declarations]369 1128 | HeapSnapshotOptions() {}370 | ^371../../deps/v8/include/v8-profiler.h:1142:25: note: declared here372 1142 | ObjectNameResolver* global_object_name_resolver = nullptr;373 | ^~~~~~~~~~~~~~~~~~~~~~~~~~~374../../deps/v8/include/v8-profiler.h:1128:27: warning: 'v8::HeapProfiler::HeapSnapshotOptions::global_object_name_resolver' is deprecated: Use context_name_resolver callback instead. [-Wdeprecated-declarations]375 1128 | HeapSnapshotOptions() {}376 | ^377../../deps/v8/include/v8-profiler.h:1142:25: note: declared here378 1142 | ObjectNameResolver* global_object_name_resolver = nullptr;379 | ^~~~~~~~~~~~~~~~~~~~~~~~~~~380[151/1871] CXX obj/gen/src/node/inspector/protocol/node_base.Network.o381In file included from ../../src/util.h:29,382 from ../../src/inspector/node_string.h:10,383 from gen/src/node/inspector/protocol/Forward.h:19,384 from gen/src/node/inspector/protocol/Protocol.h:18,385 from gen/src/node/inspector/protocol/Network.h:10,386 from gen/src/node/inspector/protocol/Network.cpp:7:387../../deps/v8/include/v8-profiler.h: In constructor 'v8::HeapProfiler::HeapSnapshotOptions::HeapSnapshotOptions()':388../../deps/v8/include/v8-profiler.h:1128:27: warning: 'v8::HeapProfiler::HeapSnapshotOptions::global_object_name_resolver' is deprecated: Use context_name_resolver callback instead. [-Wdeprecated-declarations]389 1128 | HeapSnapshotOptions() {}390 | ^391../../deps/v8/include/v8-profiler.h:1142:25: note: declared here392 1142 | ObjectNameResolver* global_object_name_resolver = nullptr;393 | ^~~~~~~~~~~~~~~~~~~~~~~~~~~394../../deps/v8/include/v8-profiler.h:1128:27: warning: 'v8::HeapProfiler::HeapSnapshotOptions::global_object_name_resolver' is deprecated: Use context_name_resolver callback instead. [-Wdeprecated-declarations]395 1128 | HeapSnapshotOptions() {}396 | ^397../../deps/v8/include/v8-profiler.h:1142:25: note: declared here398 1142 | ObjectNameResolver* global_object_name_resolver = nullptr;399 | ^~~~~~~~~~~~~~~~~~~~~~~~~~~400[152/1871] CXX obj/deps/v8/src/torque/torque_base.types.o401[153/1871] CXX obj/gen/src/node/inspector/protocol/node_base.Protocol.o402In file included from ../../src/util.h:29,403 from ../../src/inspector/node_string.h:10,404 from gen/src/node/inspector/protocol/Forward.h:19,405 from gen/src/node/inspector/protocol/Protocol.h:18,406 from gen/src/node/inspector/protocol/Protocol.cpp:7:407../../deps/v8/include/v8-profiler.h: In constructor 'v8::HeapProfiler::HeapSnapshotOptions::HeapSnapshotOptions()':408../../deps/v8/include/v8-profiler.h:1128:27: warning: 'v8::HeapProfiler::HeapSnapshotOptions::global_object_name_resolver' is deprecated: Use context_name_resolver callback instead. [-Wdeprecated-declarations]409 1128 | HeapSnapshotOptions() {}410 | ^411../../deps/v8/include/v8-profiler.h:1142:25: note: declared here412 1142 | ObjectNameResolver* global_object_name_resolver = nullptr;413 | ^~~~~~~~~~~~~~~~~~~~~~~~~~~414../../deps/v8/include/v8-profiler.h:1128:27: warning: 'v8::HeapProfiler::HeapSnapshotOptions::global_object_name_resolver' is deprecated: Use context_name_resolver callback instead. [-Wdeprecated-declarations]415 1128 | HeapSnapshotOptions() {}416 | ^417../../deps/v8/include/v8-profiler.h:1142:25: note: declared here418 1142 | ObjectNameResolver* global_object_name_resolver = nullptr;419 | ^~~~~~~~~~~~~~~~~~~~~~~~~~~420[154/1871] CXX obj/src/node_base.debug_utils.o421In file included from ../../src/memory_tracker.h:6,422 from ../../src/base_object.h:29,423 from ../../src/async_wrap.h:27,424 from ../../src/debug_utils.h:6,425 from ../../src/debug_utils-inl.h:6,426 from ../../src/debug_utils.cc:1:427../../deps/v8/include/v8-profiler.h: In constructor 'v8::HeapProfiler::HeapSnapshotOptions::HeapSnapshotOptions()':428../../deps/v8/include/v8-profiler.h:1128:27: warning: 'v8::HeapProfiler::HeapSnapshotOptions::global_object_name_resolver' is deprecated: Use context_name_resolver callback instead. [-Wdeprecated-declarations]429 1128 | HeapSnapshotOptions() {}430 | ^431../../deps/v8/include/v8-profiler.h:1142:25: note: declared here432 1142 | ObjectNameResolver* global_object_name_resolver = nullptr;433 | ^~~~~~~~~~~~~~~~~~~~~~~~~~~434../../deps/v8/include/v8-profiler.h:1128:27: warning: 'v8::HeapProfiler::HeapSnapshotOptions::global_object_name_resolver' is deprecated: Use context_name_resolver callback instead. [-Wdeprecated-declarations]435 1128 | HeapSnapshotOptions() {}436 | ^437../../deps/v8/include/v8-profiler.h:1142:25: note: declared here438 1142 | ObjectNameResolver* global_object_name_resolver = nullptr;439 | ^~~~~~~~~~~~~~~~~~~~~~~~~~~440[155/1871] CXX obj/src/api/node_base.encoding.o441In file included from ../../src/memory_tracker.h:6,442 from ../../src/aliased_buffer.h:7,443 from ../../src/aliased_buffer-inl.h:6,444 from ../../src/env-inl.h:27,445 from ../../src/string_bytes.h:30,446 from ../../src/api/encoding.cc:2:447../../deps/v8/include/v8-profiler.h: In constructor 'v8::HeapProfiler::HeapSnapshotOptions::HeapSnapshotOptions()':448../../deps/v8/include/v8-profiler.h:1128:27: warning: 'v8::HeapProfiler::HeapSnapshotOptions::global_object_name_resolver' is deprecated: Use context_name_resolver callback instead. [-Wdeprecated-declarations]449 1128 | HeapSnapshotOptions() {}450 | ^451../../deps/v8/include/v8-profiler.h:1142:25: note: declared here452 1142 | ObjectNameResolver* global_object_name_resolver = nullptr;453 | ^~~~~~~~~~~~~~~~~~~~~~~~~~~454../../deps/v8/include/v8-profiler.h:1128:27: warning: 'v8::HeapProfiler::HeapSnapshotOptions::global_object_name_resolver' is deprecated: Use context_name_resolver callback instead. [-Wdeprecated-declarations]455 1128 | HeapSnapshotOptions() {}456 | ^457../../deps/v8/include/v8-profiler.h:1142:25: note: declared here458 1142 | ObjectNameResolver* global_object_name_resolver = nullptr;459 | ^~~~~~~~~~~~~~~~~~~~~~~~~~~460[156/1871] CXX obj/src/api/node_base.async_resource.o461In file included from ../../src/memory_tracker.h:6,462 from ../../src/base_object.h:29,463 from ../../src/async_context_frame.h:6,464 from ../../src/api/async_resource.cc:1:465../../deps/v8/include/v8-profiler.h: In constructor 'v8::HeapProfiler::HeapSnapshotOptions::HeapSnapshotOptions()':466../../deps/v8/include/v8-profiler.h:1128:27: warning: 'v8::HeapProfiler::HeapSnapshotOptions::global_object_name_resolver' is deprecated: Use context_name_resolver callback instead. [-Wdeprecated-declarations]467 1128 | HeapSnapshotOptions() {}468 | ^469../../deps/v8/include/v8-profiler.h:1142:25: note: declared here470 1142 | ObjectNameResolver* global_object_name_resolver = nullptr;471 | ^~~~~~~~~~~~~~~~~~~~~~~~~~~472../../deps/v8/include/v8-profiler.h:1128:27: warning: 'v8::HeapProfiler::HeapSnapshotOptions::global_object_name_resolver' is deprecated: Use context_name_resolver callback instead. [-Wdeprecated-declarations]473 1128 | HeapSnapshotOptions() {}474 | ^475../../deps/v8/include/v8-profiler.h:1142:25: note: declared here476 1142 | ObjectNameResolver* global_object_name_resolver = nullptr;477 | ^~~~~~~~~~~~~~~~~~~~~~~~~~~478[157/1871] CXX obj/src/node_base.connect_wrap.o479In file included from ../../src/memory_tracker.h:6,480 from ../../src/base_object.h:29,481 from ../../src/async_wrap.h:27,482 from ../../src/req_wrap.h:6,483 from ../../src/req_wrap-inl.h:6,484 from ../../src/connect_wrap.h:6,485 from ../../src/connect_wrap.cc:1:486../../deps/v8/include/v8-profiler.h: In constructor 'v8::HeapProfiler::HeapSnapshotOptions::HeapSnapshotOptions()':487../../deps/v8/include/v8-profiler.h:1128:27: warning: 'v8::HeapProfiler::HeapSnapshotOptions::global_object_name_resolver' is deprecated: Use context_name_resolver callback instead. [-Wdeprecated-declarations]488 1128 | HeapSnapshotOptions() {}489 | ^490../../deps/v8/include/v8-profiler.h:1142:25: note: declared here491 1142 | ObjectNameResolver* global_object_name_resolver = nullptr;492 | ^~~~~~~~~~~~~~~~~~~~~~~~~~~493../../deps/v8/include/v8-profiler.h:1128:27: warning: 'v8::HeapProfiler::HeapSnapshotOptions::global_object_name_resolver' is deprecated: Use context_name_resolver callback instead. [-Wdeprecated-declarations]494 1128 | HeapSnapshotOptions() {}495 | ^496../../deps/v8/include/v8-profiler.h:1142:25: note: declared here497 1142 | ObjectNameResolver* global_object_name_resolver = nullptr;498 | ^~~~~~~~~~~~~~~~~~~~~~~~~~~499[158/1871] CXX obj/src/api/node_base.exceptions.o500In file included from ../../src/memory_tracker.h:6,501 from ../../src/aliased_buffer.h:7,502 from ../../src/aliased_buffer-inl.h:6,503 from ../../src/env-inl.h:27,504 from ../../src/api/exceptions.cc:3:505../../deps/v8/include/v8-profiler.h: In constructor 'v8::HeapProfiler::HeapSnapshotOptions::HeapSnapshotOptions()':506../../deps/v8/include/v8-profiler.h:1128:27: warning: 'v8::HeapProfiler::HeapSnapshotOptions::global_object_name_resolver' is deprecated: Use context_name_resolver callback instead. [-Wdeprecated-declarations]507 1128 | HeapSnapshotOptions() {}508 | ^509../../deps/v8/include/v8-profiler.h:1142:25: note: declared here510 1142 | ObjectNameResolver* global_object_name_resolver = nullptr;511 | ^~~~~~~~~~~~~~~~~~~~~~~~~~~512../../deps/v8/include/v8-profiler.h:1128:27: warning: 'v8::HeapProfiler::HeapSnapshotOptions::global_object_name_resolver' is deprecated: Use context_name_resolver callback instead. [-Wdeprecated-declarations]513 1128 | HeapSnapshotOptions() {}514 | ^515../../deps/v8/include/v8-profiler.h:1142:25: note: declared here516 1142 | ObjectNameResolver* global_object_name_resolver = nullptr;517 | ^~~~~~~~~~~~~~~~~~~~~~~~~~~518[159/1871] CXX obj/src/api/node_base.callback.o519In file included from ../../src/memory_tracker.h:6,520 from ../../src/base_object.h:29,521 from ../../src/async_context_frame.h:6,522 from ../../src/api/callback.cc:1:523../../deps/v8/include/v8-profiler.h: In constructor 'v8::HeapProfiler::HeapSnapshotOptions::HeapSnapshotOptions()':524../../deps/v8/include/v8-profiler.h:1128:27: warning: 'v8::HeapProfiler::HeapSnapshotOptions::global_object_name_resolver' is deprecated: Use context_name_resolver callback instead. [-Wdeprecated-declarations]525 1128 | HeapSnapshotOptions() {}526 | ^527../../deps/v8/include/v8-profiler.h:1142:25: note: declared here528 1142 | ObjectNameResolver* global_object_name_resolver = nullptr;529 | ^~~~~~~~~~~~~~~~~~~~~~~~~~~530../../deps/v8/include/v8-profiler.h:1128:27: warning: 'v8::HeapProfiler::HeapSnapshotOptions::global_object_name_resolver' is deprecated: Use context_name_resolver callback instead. [-Wdeprecated-declarations]531 1128 | HeapSnapshotOptions() {}532 | ^533../../deps/v8/include/v8-profiler.h:1142:25: note: declared here534 1142 | ObjectNameResolver* global_object_name_resolver = nullptr;535 | ^~~~~~~~~~~~~~~~~~~~~~~~~~~536[160/1871] CXX obj/src/api/node_base.embed_helpers.o537In file included from ../../src/memory_tracker.h:6,538 from ../../src/base_object.h:29,539 from ../../src/async_wrap.h:27,540 from ../../src/debug_utils.h:6,541 from ../../src/debug_utils-inl.h:6,542 from ../../src/api/embed_helpers.cc:1:543../../deps/v8/include/v8-profiler.h: In constructor 'v8::HeapProfiler::HeapSnapshotOptions::HeapSnapshotOptions()':544../../deps/v8/include/v8-profiler.h:1128:27: warning: 'v8::HeapProfiler::HeapSnapshotOptions::global_object_name_resolver' is deprecated: Use context_name_resolver callback instead. [-Wdeprecated-declarations]545 1128 | HeapSnapshotOptions() {}546 | ^547../../deps/v8/include/v8-profiler.h:1142:25: note: declared here548 1142 | ObjectNameResolver* global_object_name_resolver = nullptr;549 | ^~~~~~~~~~~~~~~~~~~~~~~~~~~550../../deps/v8/include/v8-profiler.h:1128:27: warning: 'v8::HeapProfiler::HeapSnapshotOptions::global_object_name_resolver' is deprecated: Use context_name_resolver callback instead. [-Wdeprecated-declarations]551 1128 | HeapSnapshotOptions() {}552 | ^553../../deps/v8/include/v8-profiler.h:1142:25: note: declared here554 1142 | ObjectNameResolver* global_object_name_resolver = nullptr;555 | ^~~~~~~~~~~~~~~~~~~~~~~~~~~556[161/1871] CXX obj/src/node_base.connection_wrap.o557In file included from ../../src/memory_tracker.h:6,558 from ../../src/aliased_buffer.h:7,559 from ../../src/env.h:27,560 from ../../src/stream_base.h:6,561 from ../../src/stream_wrap.h:27,562 from ../../src/connection_wrap.h:6,563 from ../../src/connection_wrap.cc:1:564../../deps/v8/include/v8-profiler.h: In constructor 'v8::HeapProfiler::HeapSnapshotOptions::HeapSnapshotOptions()':565../../deps/v8/include/v8-profiler.h:1128:27: warning: 'v8::HeapProfiler::HeapSnapshotOptions::global_object_name_resolver' is deprecated: Use context_name_resolver callback instead. [-Wdeprecated-declarations]566 1128 | HeapSnapshotOptions() {}567 | ^568../../deps/v8/include/v8-profiler.h:1142:25: note: declared here569 1142 | ObjectNameResolver* global_object_name_resolver = nullptr;570 | ^~~~~~~~~~~~~~~~~~~~~~~~~~~571../../deps/v8/include/v8-profiler.h:1128:27: warning: 'v8::HeapProfiler::HeapSnapshotOptions::global_object_name_resolver' is deprecated: Use context_name_resolver callback instead. [-Wdeprecated-declarations]572 1128 | HeapSnapshotOptions() {}573 | ^574../../deps/v8/include/v8-profiler.h:1142:25: note: declared here575 1142 | ObjectNameResolver* global_object_name_resolver = nullptr;576 | ^~~~~~~~~~~~~~~~~~~~~~~~~~~577[162/1871] CXX obj/src/api/node_base.hooks.o578In file included from ../../src/memory_tracker.h:6,579 from ../../src/aliased_buffer.h:7,580 from ../../src/aliased_buffer-inl.h:6,581 from ../../src/env-inl.h:27,582 from ../../src/api/hooks.cc:1:583../../deps/v8/include/v8-profiler.h: In constructor 'v8::HeapProfiler::HeapSnapshotOptions::HeapSnapshotOptions()':584../../deps/v8/include/v8-profiler.h:1128:27: warning: 'v8::HeapProfiler::HeapSnapshotOptions::global_object_name_resolver' is deprecated: Use context_name_resolver callback instead. [-Wdeprecated-declarations]585 1128 | HeapSnapshotOptions() {}586 | ^587../../deps/v8/include/v8-profiler.h:1142:25: note: declared here588 1142 | ObjectNameResolver* global_object_name_resolver = nullptr;589 | ^~~~~~~~~~~~~~~~~~~~~~~~~~~590../../deps/v8/include/v8-profiler.h:1128:27: warning: 'v8::HeapProfiler::HeapSnapshotOptions::global_object_name_resolver' is deprecated: Use context_name_resolver callback instead. [-Wdeprecated-declarations]591 1128 | HeapSnapshotOptions() {}592 | ^593../../deps/v8/include/v8-profiler.h:1142:25: note: declared here594 1142 | ObjectNameResolver* global_object_name_resolver = nullptr;595 | ^~~~~~~~~~~~~~~~~~~~~~~~~~~596[163/1871] CXX obj/src/node_base.handle_wrap.o597In file included from ../../src/memory_tracker.h:6,598 from ../../src/base_object.h:29,599 from ../../src/async_wrap.h:27,600 from ../../src/handle_wrap.h:27,601 from ../../src/handle_wrap.cc:22:602../../deps/v8/include/v8-profiler.h: In constructor 'v8::HeapProfiler::HeapSnapshotOptions::HeapSnapshotOptions()':603../../deps/v8/include/v8-profiler.h:1128:27: warning: 'v8::HeapProfiler::HeapSnapshotOptions::global_object_name_resolver' is deprecated: Use context_name_resolver callback instead. [-Wdeprecated-declarations]604 1128 | HeapSnapshotOptions() {}605 | ^606../../deps/v8/include/v8-profiler.h:1142:25: note: declared here607 1142 | ObjectNameResolver* global_object_name_resolver = nullptr;608 | ^~~~~~~~~~~~~~~~~~~~~~~~~~~609../../deps/v8/include/v8-profiler.h:1128:27: warning: 'v8::HeapProfiler::HeapSnapshotOptions::global_object_name_resolver' is deprecated: Use context_name_resolver callback instead. [-Wdeprecated-declarations]610 1128 | HeapSnapshotOptions() {}611 | ^612../../deps/v8/include/v8-profiler.h:1142:25: note: declared here613 1142 | ObjectNameResolver* global_object_name_resolver = nullptr;614 | ^~~~~~~~~~~~~~~~~~~~~~~~~~~615[164/1871] CXX obj/src/node_base.js_udp_wrap.o616In file included from ../../src/memory_tracker.h:6,617 from ../../src/base_object.h:29,618 from ../../src/async_wrap.h:27,619 from ../../src/handle_wrap.h:27,620 from ../../src/udp_wrap.h:27,621 from ../../src/js_udp_wrap.cc:1:622../../deps/v8/include/v8-profiler.h: In constructor 'v8::HeapProfiler::HeapSnapshotOptions::HeapSnapshotOptions()':623../../deps/v8/include/v8-profiler.h:1128:27: warning: 'v8::HeapProfiler::HeapSnapshotOptions::global_object_name_resolver' is deprecated: Use context_name_resolver callback instead. [-Wdeprecated-declarations]624 1128 | HeapSnapshotOptions() {}625 | ^626../../deps/v8/include/v8-profiler.h:1142:25: note: declared here627 1142 | ObjectNameResolver* global_object_name_resolver = nullptr;628 | ^~~~~~~~~~~~~~~~~~~~~~~~~~~629../../deps/v8/include/v8-profiler.h:1128:27: warning: 'v8::HeapProfiler::HeapSnapshotOptions::global_object_name_resolver' is deprecated: Use context_name_resolver callback instead. [-Wdeprecated-declarations]630 1128 | HeapSnapshotOptions() {}631 | ^632../../deps/v8/include/v8-profiler.h:1142:25: note: declared here633 1142 | ObjectNameResolver* global_object_name_resolver = nullptr;634 | ^~~~~~~~~~~~~~~~~~~~~~~~~~~635[165/1871] CXX obj/src/node_base.fs_event_wrap.o636In file included from ../../src/memory_tracker.h:6,637 from ../../src/base_object.h:29,638 from ../../src/async_wrap.h:27,639 from ../../src/async_wrap-inl.h:27,640 from ../../src/fs_event_wrap.cc:22:641../../deps/v8/include/v8-profiler.h: In constructor 'v8::HeapProfiler::HeapSnapshotOptions::HeapSnapshotOptions()':642../../deps/v8/include/v8-profiler.h:1128:27: warning: 'v8::HeapProfiler::HeapSnapshotOptions::global_object_name_resolver' is deprecated: Use context_name_resolver callback instead. [-Wdeprecated-declarations]643 1128 | HeapSnapshotOptions() {}644 | ^645../../deps/v8/include/v8-profiler.h:1142:25: note: declared here646 1142 | ObjectNameResolver* global_object_name_resolver = nullptr;647 | ^~~~~~~~~~~~~~~~~~~~~~~~~~~648../../deps/v8/include/v8-profiler.h:1128:27: warning: 'v8::HeapProfiler::HeapSnapshotOptions::global_object_name_resolver' is deprecated: Use context_name_resolver callback instead. [-Wdeprecated-declarations]649 1128 | HeapSnapshotOptions() {}650 | ^651../../deps/v8/include/v8-profiler.h:1142:25: note: declared here652 1142 | ObjectNameResolver* global_object_name_resolver = nullptr;653 | ^~~~~~~~~~~~~~~~~~~~~~~~~~~654[166/1871] CXX obj/src/node_base.async_context_frame.o655In file included from ../../src/memory_tracker.h:6,656 from ../../src/base_object.h:29,657 from ../../src/async_context_frame.h:6,658 from ../../src/async_context_frame.cc:1:659../../deps/v8/include/v8-profiler.h: In constructor 'v8::HeapProfiler::HeapSnapshotOptions::HeapSnapshotOptions()':660../../deps/v8/include/v8-profiler.h:1128:27: warning: 'v8::HeapProfiler::HeapSnapshotOptions::global_object_name_resolver' is deprecated: Use context_name_resolver callback instead. [-Wdeprecated-declarations]661 1128 | HeapSnapshotOptions() {}662 | ^663../../deps/v8/include/v8-profiler.h:1142:25: note: declared here664 1142 | ObjectNameResolver* global_object_name_resolver = nullptr;665 | ^~~~~~~~~~~~~~~~~~~~~~~~~~~666../../deps/v8/include/v8-profiler.h:1128:27: warning: 'v8::HeapProfiler::HeapSnapshotOptions::global_object_name_resolver' is deprecated: Use context_name_resolver callback instead. [-Wdeprecated-declarations]667 1128 | HeapSnapshotOptions() {}668 | ^669../../deps/v8/include/v8-profiler.h:1142:25: note: declared here670 1142 | ObjectNameResolver* global_object_name_resolver = nullptr;671 | ^~~~~~~~~~~~~~~~~~~~~~~~~~~672[167/1871] CXX obj/src/node_base.heap_utils.o673In file included from ../../src/memory_tracker.h:6,674 from ../../src/aliased_buffer.h:7,675 from ../../src/env.h:27,676 from ../../src/node_internals.h:27,677 from ../../src/diagnosticfilename-inl.h:6,678 from ../../src/heap_utils.cc:1:679../../deps/v8/include/v8-profiler.h: In constructor 'v8::HeapProfiler::HeapSnapshotOptions::HeapSnapshotOptions()':680../../deps/v8/include/v8-profiler.h:1128:27: warning: 'v8::HeapProfiler::HeapSnapshotOptions::global_object_name_resolver' is deprecated: Use context_name_resolver callback instead. [-Wdeprecated-declarations]681 1128 | HeapSnapshotOptions() {}682 | ^683../../deps/v8/include/v8-profiler.h:1142:25: note: declared here684 1142 | ObjectNameResolver* global_object_name_resolver = nullptr;685 | ^~~~~~~~~~~~~~~~~~~~~~~~~~~686../../deps/v8/include/v8-profiler.h:1128:27: warning: 'v8::HeapProfiler::HeapSnapshotOptions::global_object_name_resolver' is deprecated: Use context_name_resolver callback instead. [-Wdeprecated-declarations]687 1128 | HeapSnapshotOptions() {}688 | ^689../../deps/v8/include/v8-profiler.h:1142:25: note: declared here690 1142 | ObjectNameResolver* global_object_name_resolver = nullptr;691 | ^~~~~~~~~~~~~~~~~~~~~~~~~~~692[168/1871] CXX obj/src/node_base.js_stream.o693In file included from ../../src/memory_tracker.h:6,694 from ../../src/base_object.h:29,695 from ../../src/async_wrap.h:27,696 from ../../src/js_stream.h:6,697 from ../../src/js_stream.cc:1:698../../deps/v8/include/v8-profiler.h: In constructor 'v8::HeapProfiler::HeapSnapshotOptions::HeapSnapshotOptions()':699../../deps/v8/include/v8-profiler.h:1128:27: warning: 'v8::HeapProfiler::HeapSnapshotOptions::global_object_name_resolver' is deprecated: Use context_name_resolver callback instead. [-Wdeprecated-declarations]700 1128 | HeapSnapshotOptions() {}701 | ^702../../deps/v8/include/v8-profiler.h:1142:25: note: declared here703 1142 | ObjectNameResolver* global_object_name_resolver = nullptr;704 | ^~~~~~~~~~~~~~~~~~~~~~~~~~~705../../deps/v8/include/v8-profiler.h:1128:27: warning: 'v8::HeapProfiler::HeapSnapshotOptions::global_object_name_resolver' is deprecated: Use context_name_resolver callback instead. [-Wdeprecated-declarations]706 1128 | HeapSnapshotOptions() {}707 | ^708../../deps/v8/include/v8-profiler.h:1142:25: note: declared here709 1142 | ObjectNameResolver* global_object_name_resolver = nullptr;710 | ^~~~~~~~~~~~~~~~~~~~~~~~~~~711[169/1871] CXX obj/src/node_base.base_object.o712In file included from ../../src/memory_tracker.h:6,713 from ../../src/base_object.h:29,714 from ../../src/base_object.cc:1:715../../deps/v8/include/v8-profiler.h: In constructor 'v8::HeapProfiler::HeapSnapshotOptions::HeapSnapshotOptions()':716../../deps/v8/include/v8-profiler.h:1128:27: warning: 'v8::HeapProfiler::HeapSnapshotOptions::global_object_name_resolver' is deprecated: Use context_name_resolver callback instead. [-Wdeprecated-declarations]717 1128 | HeapSnapshotOptions() {}718 | ^719../../deps/v8/include/v8-profiler.h:1142:25: note: declared here720 1142 | ObjectNameResolver* global_object_name_resolver = nullptr;721 | ^~~~~~~~~~~~~~~~~~~~~~~~~~~722../../deps/v8/include/v8-profiler.h:1128:27: warning: 'v8::HeapProfiler::HeapSnapshotOptions::global_object_name_resolver' is deprecated: Use context_name_resolver callback instead. [-Wdeprecated-declarations]723 1128 | HeapSnapshotOptions() {}724 | ^725../../deps/v8/include/v8-profiler.h:1142:25: note: declared here726 1142 | ObjectNameResolver* global_object_name_resolver = nullptr;727 | ^~~~~~~~~~~~~~~~~~~~~~~~~~~728[170/1871] CXX obj/src/api/node_base.environment.o729In file included from ../../src/memory_tracker.h:6,730 from ../../src/base_object.h:29,731 from ../../src/async_wrap.h:27,732 from ../../src/crypto/crypto_util.h:6,733 from ../../src/api/environment.cc:3:734../../deps/v8/include/v8-profiler.h: In constructor 'v8::HeapProfiler::HeapSnapshotOptions::HeapSnapshotOptions()':735../../deps/v8/include/v8-profiler.h:1128:27: warning: 'v8::HeapProfiler::HeapSnapshotOptions::global_object_name_resolver' is deprecated: Use context_name_resolver callback instead. [-Wdeprecated-declarations]736 1128 | HeapSnapshotOptions() {}737 | ^738../../deps/v8/include/v8-profiler.h:1142:25: note: declared here739 1142 | ObjectNameResolver* global_object_name_resolver = nullptr;740 | ^~~~~~~~~~~~~~~~~~~~~~~~~~~741../../deps/v8/include/v8-profiler.h:1128:27: warning: 'v8::HeapProfiler::HeapSnapshotOptions::global_object_name_resolver' is deprecated: Use context_name_resolver callback instead. [-Wdeprecated-declarations]742 1128 | HeapSnapshotOptions() {}743 | ^744../../deps/v8/include/v8-profiler.h:1142:25: note: declared here745 1142 | ObjectNameResolver* global_object_name_resolver = nullptr;746 | ^~~~~~~~~~~~~~~~~~~~~~~~~~~747[171/1871] CXX obj/src/node_base.async_wrap.o748In file included from ../../src/memory_tracker.h:6,749 from ../../src/base_object.h:29,750 from ../../src/async_wrap.h:27,751 from ../../src/async_wrap.cc:22:752../../deps/v8/include/v8-profiler.h: In constructor 'v8::HeapProfiler::HeapSnapshotOptions::HeapSnapshotOptions()':753../../deps/v8/include/v8-profiler.h:1128:27: warning: 'v8::HeapProfiler::HeapSnapshotOptions::global_object_name_resolver' is deprecated: Use context_name_resolver callback instead. [-Wdeprecated-declarations]754 1128 | HeapSnapshotOptions() {}755 | ^756../../deps/v8/include/v8-profiler.h:1142:25: note: declared here757 1142 | ObjectNameResolver* global_object_name_resolver = nullptr;758 | ^~~~~~~~~~~~~~~~~~~~~~~~~~~759../../deps/v8/include/v8-profiler.h:1128:27: warning: 'v8::HeapProfiler::HeapSnapshotOptions::global_object_name_resolver' is deprecated: Use context_name_resolver callback instead. [-Wdeprecated-declarations]760 1128 | HeapSnapshotOptions() {}761 | ^762../../deps/v8/include/v8-profiler.h:1142:25: note: declared here763 1142 | ObjectNameResolver* global_object_name_resolver = nullptr;764 | ^~~~~~~~~~~~~~~~~~~~~~~~~~~765[172/1871] CXX obj/src/node_base.encoding_binding.o766In file included from ../../src/memory_tracker.h:6,767 from ../../src/aliased_buffer.h:7,768 from ../../src/encoding_binding.h:7,769 from ../../src/encoding_binding.cc:1:770../../deps/v8/include/v8-profiler.h: In constructor 'v8::HeapProfiler::HeapSnapshotOptions::HeapSnapshotOptions()':771../../deps/v8/include/v8-profiler.h:1128:27: warning: 'v8::HeapProfiler::HeapSnapshotOptions::global_object_name_resolver' is deprecated: Use context_name_resolver callback instead. [-Wdeprecated-declarations]772 1128 | HeapSnapshotOptions() {}773 | ^774../../deps/v8/include/v8-profiler.h:1142:25: note: declared here775 1142 | ObjectNameResolver* global_object_name_resolver = nullptr;776 | ^~~~~~~~~~~~~~~~~~~~~~~~~~~777../../deps/v8/include/v8-profiler.h:1128:27: warning: 'v8::HeapProfiler::HeapSnapshotOptions::global_object_name_resolver' is deprecated: Use context_name_resolver callback instead. [-Wdeprecated-declarations]778 1128 | HeapSnapshotOptions() {}779 | ^780../../deps/v8/include/v8-profiler.h:1142:25: note: declared here781 1142 | ObjectNameResolver* global_object_name_resolver = nullptr;782 | ^~~~~~~~~~~~~~~~~~~~~~~~~~~783[173/1871] CXX obj/src/node_base.compile_cache.o784In file included from ../../src/memory_tracker.h:6,785 from ../../src/base_object.h:29,786 from ../../src/async_wrap.h:27,787 from ../../src/debug_utils.h:6,788 from ../../src/debug_utils-inl.h:6,789 from ../../src/compile_cache.cc:3:790../../deps/v8/include/v8-profiler.h: In constructor 'v8::HeapProfiler::HeapSnapshotOptions::HeapSnapshotOptions()':791../../deps/v8/include/v8-profiler.h:1128:27: warning: 'v8::HeapProfiler::HeapSnapshotOptions::global_object_name_resolver' is deprecated: Use context_name_resolver callback instead. [-Wdeprecated-declarations]792 1128 | HeapSnapshotOptions() {}793 | ^794../../deps/v8/include/v8-profiler.h:1142:25: note: declared here795 1142 | ObjectNameResolver* global_object_name_resolver = nullptr;796 | ^~~~~~~~~~~~~~~~~~~~~~~~~~~797../../deps/v8/include/v8-profiler.h:1128:27: warning: 'v8::HeapProfiler::HeapSnapshotOptions::global_object_name_resolver' is deprecated: Use context_name_resolver callback instead. [-Wdeprecated-declarations]798 1128 | HeapSnapshotOptions() {}799 | ^800../../deps/v8/include/v8-profiler.h:1142:25: note: declared here801 1142 | ObjectNameResolver* global_object_name_resolver = nullptr;802 | ^~~~~~~~~~~~~~~~~~~~~~~~~~~803[174/1871] CXX obj/src/node_base.node_file_utils.o804In file included from ../../src/util.h:29,805 from ../../src/util-inl.h:33,806 from ../../src/node_file_utils.cc:10:807../../deps/v8/include/v8-profiler.h: In constructor 'v8::HeapProfiler::HeapSnapshotOptions::HeapSnapshotOptions()':808../../deps/v8/include/v8-profiler.h:1128:27: warning: 'v8::HeapProfiler::HeapSnapshotOptions::global_object_name_resolver' is deprecated: Use context_name_resolver callback instead. [-Wdeprecated-declarations]809 1128 | HeapSnapshotOptions() {}810 | ^811../../deps/v8/include/v8-profiler.h:1142:25: note: declared here812 1142 | ObjectNameResolver* global_object_name_resolver = nullptr;813 | ^~~~~~~~~~~~~~~~~~~~~~~~~~~814../../deps/v8/include/v8-profiler.h:1128:27: warning: 'v8::HeapProfiler::HeapSnapshotOptions::global_object_name_resolver' is deprecated: Use context_name_resolver callback instead. [-Wdeprecated-declarations]815 1128 | HeapSnapshotOptions() {}816 | ^817../../deps/v8/include/v8-profiler.h:1142:25: note: declared here818 1142 | ObjectNameResolver* global_object_name_resolver = nullptr;819 | ^~~~~~~~~~~~~~~~~~~~~~~~~~~820../../src/node_file_utils.cc: In function 'int node::WriteFileSync(const char*, uv_buf_t*, size_t)':821../../src/node_file_utils.cc:62:32: warning: enumerated and non-enumerated type in conditional expression [-Wextra]822 62 | int err = req.result < 0 ? req.result : UV_EIO;823 | ~~~~~~~~~~~~~~~^~~~~~~~~~~~~~~~~~~~~824[175/1871] CXX obj/src/node_base.histogram.o825In file included from ../../src/memory_tracker.h:6,826 from ../../src/base_object.h:29,827 from ../../src/histogram.h:7,828 from ../../src/histogram.cc:1:829../../deps/v8/include/v8-profiler.h: In constructor 'v8::HeapProfiler::HeapSnapshotOptions::HeapSnapshotOptions()':830../../deps/v8/include/v8-profiler.h:1128:27: warning: 'v8::HeapProfiler::HeapSnapshotOptions::global_object_name_resolver' is deprecated: Use context_name_resolver callback instead. [-Wdeprecated-declarations]831 1128 | HeapSnapshotOptions() {}832 | ^833../../deps/v8/include/v8-profiler.h:1142:25: note: declared here834 1142 | ObjectNameResolver* global_object_name_resolver = nullptr;835 | ^~~~~~~~~~~~~~~~~~~~~~~~~~~836../../deps/v8/include/v8-profiler.h:1128:27: warning: 'v8::HeapProfiler::HeapSnapshotOptions::global_object_name_resolver' is deprecated: Use context_name_resolver callback instead. [-Wdeprecated-declarations]837 1128 | HeapSnapshotOptions() {}838 | ^839../../deps/v8/include/v8-profiler.h:1142:25: note: declared here840 1142 | ObjectNameResolver* global_object_name_resolver = nullptr;841 | ^~~~~~~~~~~~~~~~~~~~~~~~~~~842[176/1871] CXX obj/src/dataqueue/node_base.queue.o843In file included from ../../src/memory_tracker.h:6,844 from ../../src/base_object.h:29,845 from ../../src/dataqueue/queue.h:5,846 from ../../src/dataqueue/queue.cc:1:847../../deps/v8/include/v8-profiler.h: In constructor 'v8::HeapProfiler::HeapSnapshotOptions::HeapSnapshotOptions()':848../../deps/v8/include/v8-profiler.h:1128:27: warning: 'v8::HeapProfiler::HeapSnapshotOptions::global_object_name_resolver' is deprecated: Use context_name_resolver callback instead. [-Wdeprecated-declarations]849 1128 | HeapSnapshotOptions() {}850 | ^851../../deps/v8/include/v8-profiler.h:1142:25: note: declared here852 1142 | ObjectNameResolver* global_object_name_resolver = nullptr;853 | ^~~~~~~~~~~~~~~~~~~~~~~~~~~854../../deps/v8/include/v8-profiler.h:1128:27: warning: 'v8::HeapProfiler::HeapSnapshotOptions::global_object_name_resolver' is deprecated: Use context_name_resolver callback instead. [-Wdeprecated-declarations]855 1128 | HeapSnapshotOptions() {}856 | ^857../../deps/v8/include/v8-profiler.h:1142:25: note: declared here858 1142 | ObjectNameResolver* global_object_name_resolver = nullptr;859 | ^~~~~~~~~~~~~~~~~~~~~~~~~~~860[177/1871] CXX obj/src/node_base.node_config.o861In file included from ../../src/memory_tracker.h:6,862 from ../../src/aliased_buffer.h:7,863 from ../../src/aliased_buffer-inl.h:6,864 from ../../src/env-inl.h:27,865 from ../../src/node_config.cc:1:866../../deps/v8/include/v8-profiler.h: In constructor 'v8::HeapProfiler::HeapSnapshotOptions::HeapSnapshotOptions()':867../../deps/v8/include/v8-profiler.h:1128:27: warning: 'v8::HeapProfiler::HeapSnapshotOptions::global_object_name_resolver' is deprecated: Use context_name_resolver callback instead. [-Wdeprecated-declarations]868 1128 | HeapSnapshotOptions() {}869 | ^870../../deps/v8/include/v8-profiler.h:1142:25: note: declared here871 1142 | ObjectNameResolver* global_object_name_resolver = nullptr;872 | ^~~~~~~~~~~~~~~~~~~~~~~~~~~873../../deps/v8/include/v8-profiler.h:1128:27: warning: 'v8::HeapProfiler::HeapSnapshotOptions::global_object_name_resolver' is deprecated: Use context_name_resolver callback instead. [-Wdeprecated-declarations]874 1128 | HeapSnapshotOptions() {}875 | ^876../../deps/v8/include/v8-profiler.h:1142:25: note: declared here877 1142 | ObjectNameResolver* global_object_name_resolver = nullptr;878 | ^~~~~~~~~~~~~~~~~~~~~~~~~~~879[178/1871] CXX obj/src/node_base.node_constants.o880In file included from ../../src/memory_tracker.h:6,881 from ../../src/aliased_buffer.h:7,882 from ../../src/aliased_buffer-inl.h:6,883 from ../../src/env-inl.h:27,884 from ../../src/node_constants.cc:22:885../../deps/v8/include/v8-profiler.h: In constructor 'v8::HeapProfiler::HeapSnapshotOptions::HeapSnapshotOptions()':886../../deps/v8/include/v8-profiler.h:1128:27: warning: 'v8::HeapProfiler::HeapSnapshotOptions::global_object_name_resolver' is deprecated: Use context_name_resolver callback instead. [-Wdeprecated-declarations]887 1128 | HeapSnapshotOptions() {}888 | ^889../../deps/v8/include/v8-profiler.h:1142:25: note: declared here890 1142 | ObjectNameResolver* global_object_name_resolver = nullptr;891 | ^~~~~~~~~~~~~~~~~~~~~~~~~~~892../../deps/v8/include/v8-profiler.h:1128:27: warning: 'v8::HeapProfiler::HeapSnapshotOptions::global_object_name_resolver' is deprecated: Use context_name_resolver callback instead. [-Wdeprecated-declarations]893 1128 | HeapSnapshotOptions() {}894 | ^895../../deps/v8/include/v8-profiler.h:1142:25: note: declared here896 1142 | ObjectNameResolver* global_object_name_resolver = nullptr;897 | ^~~~~~~~~~~~~~~~~~~~~~~~~~~898[179/1871] CXX obj/src/node_base.node_binding.o899In file included from ../../src/memory_tracker.h:6,900 from ../../src/aliased_buffer.h:7,901 from ../../src/aliased_buffer-inl.h:6,902 from ../../src/env-inl.h:27,903 from ../../src/node_binding.cc:3:904../../deps/v8/include/v8-profiler.h: In constructor 'v8::HeapProfiler::HeapSnapshotOptions::HeapSnapshotOptions()':905../../deps/v8/include/v8-profiler.h:1128:27: warning: 'v8::HeapProfiler::HeapSnapshotOptions::global_object_name_resolver' is deprecated: Use context_name_resolver callback instead. [-Wdeprecated-declarations]906 1128 | HeapSnapshotOptions() {}907 | ^908../../deps/v8/include/v8-profiler.h:1142:25: note: declared here909 1142 | ObjectNameResolver* global_object_name_resolver = nullptr;910 | ^~~~~~~~~~~~~~~~~~~~~~~~~~~911../../deps/v8/include/v8-profiler.h:1128:27: warning: 'v8::HeapProfiler::HeapSnapshotOptions::global_object_name_resolver' is deprecated: Use context_name_resolver callback instead. [-Wdeprecated-declarations]912 1128 | HeapSnapshotOptions() {}913 | ^914../../deps/v8/include/v8-profiler.h:1142:25: note: declared here915 1142 | ObjectNameResolver* global_object_name_resolver = nullptr;916 | ^~~~~~~~~~~~~~~~~~~~~~~~~~~917[180/1871] CXX obj/src/node_base.node_cjs_lexer.o918In file included from ../../src/memory_tracker.h:6,919 from ../../src/aliased_buffer.h:7,920 from ../../src/aliased_buffer-inl.h:6,921 from ../../src/env-inl.h:27,922 from ../../src/node_cjs_lexer.cc:1:923../../deps/v8/include/v8-profiler.h: In constructor 'v8::HeapProfiler::HeapSnapshotOptions::HeapSnapshotOptions()':924../../deps/v8/include/v8-profiler.h:1128:27: warning: 'v8::HeapProfiler::HeapSnapshotOptions::global_object_name_resolver' is deprecated: Use context_name_resolver callback instead. [-Wdeprecated-declarations]925 1128 | HeapSnapshotOptions() {}926 | ^927../../deps/v8/include/v8-profiler.h:1142:25: note: declared here928 1142 | ObjectNameResolver* global_object_name_resolver = nullptr;929 | ^~~~~~~~~~~~~~~~~~~~~~~~~~~930../../deps/v8/include/v8-profiler.h:1128:27: warning: 'v8::HeapProfiler::HeapSnapshotOptions::global_object_name_resolver' is deprecated: Use context_name_resolver callback instead. [-Wdeprecated-declarations]931 1128 | HeapSnapshotOptions() {}932 | ^933../../deps/v8/include/v8-profiler.h:1142:25: note: declared here934 1142 | ObjectNameResolver* global_object_name_resolver = nullptr;935 | ^~~~~~~~~~~~~~~~~~~~~~~~~~~936[181/1871] CXX obj/src/node_base.node_credentials.o937In file included from ../../src/memory_tracker.h:6,938 from ../../src/aliased_buffer.h:7,939 from ../../src/aliased_buffer-inl.h:6,940 from ../../src/env-inl.h:27,941 from ../../src/node_credentials.cc:1:942../../deps/v8/include/v8-profiler.h: In constructor 'v8::HeapProfiler::HeapSnapshotOptions::HeapSnapshotOptions()':943../../deps/v8/include/v8-profiler.h:1128:27: warning: 'v8::HeapProfiler::HeapSnapshotOptions::global_object_name_resolver' is deprecated: Use context_name_resolver callback instead. [-Wdeprecated-declarations]944 1128 | HeapSnapshotOptions() {}945 | ^946../../deps/v8/include/v8-profiler.h:1142:25: note: declared here947 1142 | ObjectNameResolver* global_object_name_resolver = nullptr;948 | ^~~~~~~~~~~~~~~~~~~~~~~~~~~949../../deps/v8/include/v8-profiler.h:1128:27: warning: 'v8::HeapProfiler::HeapSnapshotOptions::global_object_name_resolver' is deprecated: Use context_name_resolver callback instead. [-Wdeprecated-declarations]950 1128 | HeapSnapshotOptions() {}951 | ^952../../deps/v8/include/v8-profiler.h:1142:25: note: declared here953 1142 | ObjectNameResolver* global_object_name_resolver = nullptr;954 | ^~~~~~~~~~~~~~~~~~~~~~~~~~~955[182/1871] CXX obj/src/node_base.node_profiling.o956In file included from ../../src/node_profiling.h:6,957 from ../../src/node_profiling.cc:1:958../../deps/v8/include/v8-profiler.h: In constructor 'v8::HeapProfiler::HeapSnapshotOptions::HeapSnapshotOptions()':959../../deps/v8/include/v8-profiler.h:1128:27: warning: 'v8::HeapProfiler::HeapSnapshotOptions::global_object_name_resolver' is deprecated: Use context_name_resolver callback instead. [-Wdeprecated-declarations]960 1128 | HeapSnapshotOptions() {}961 | ^962../../deps/v8/include/v8-profiler.h:1142:25: note: declared here963 1142 | ObjectNameResolver* global_object_name_resolver = nullptr;964 | ^~~~~~~~~~~~~~~~~~~~~~~~~~~965../../deps/v8/include/v8-profiler.h:1128:27: warning: 'v8::HeapProfiler::HeapSnapshotOptions::global_object_name_resolver' is deprecated: Use context_name_resolver callback instead. [-Wdeprecated-declarations]966 1128 | HeapSnapshotOptions() {}967 | ^968../../deps/v8/include/v8-profiler.h:1142:25: note: declared here969 1142 | ObjectNameResolver* global_object_name_resolver = nullptr;970 | ^~~~~~~~~~~~~~~~~~~~~~~~~~~971[183/1871] CXX obj/src/node_base.js_native_api_v8.o972In file included from ../../src/memory_tracker.h:6,973 from ../../src/aliased_buffer.h:7,974 from ../../src/aliased_buffer-inl.h:6,975 from ../../src/env-inl.h:27,976 from ../../src/js_native_api_v8.cc:7:977../../deps/v8/include/v8-profiler.h: In constructor 'v8::HeapProfiler::HeapSnapshotOptions::HeapSnapshotOptions()':978../../deps/v8/include/v8-profiler.h:1128:27: warning: 'v8::HeapProfiler::HeapSnapshotOptions::global_object_name_resolver' is deprecated: Use context_name_resolver callback instead. [-Wdeprecated-declarations]979 1128 | HeapSnapshotOptions() {}980 | ^981../../deps/v8/include/v8-profiler.h:1142:25: note: declared here982 1142 | ObjectNameResolver* global_object_name_resolver = nullptr;983 | ^~~~~~~~~~~~~~~~~~~~~~~~~~~984../../deps/v8/include/v8-profiler.h:1128:27: warning: 'v8::HeapProfiler::HeapSnapshotOptions::global_object_name_resolver' is deprecated: Use context_name_resolver callback instead. [-Wdeprecated-declarations]985 1128 | HeapSnapshotOptions() {}986 | ^987../../deps/v8/include/v8-profiler.h:1142:25: note: declared here988 1142 | ObjectNameResolver* global_object_name_resolver = nullptr;989 | ^~~~~~~~~~~~~~~~~~~~~~~~~~~990[184/1871] CXX obj/src/node_base.node_api.o991In file included from ../../src/memory_tracker.h:6,992 from ../../src/base_object.h:29,993 from ../../src/async_context_frame.h:6,994 from ../../src/node_api.cc:1:995../../deps/v8/include/v8-profiler.h: In constructor 'v8::HeapProfiler::HeapSnapshotOptions::HeapSnapshotOptions()':996../../deps/v8/include/v8-profiler.h:1128:27: warning: 'v8::HeapProfiler::HeapSnapshotOptions::global_object_name_resolver' is deprecated: Use context_name_resolver callback instead. [-Wdeprecated-declarations]997 1128 | HeapSnapshotOptions() {}998 | ^999../../deps/v8/include/v8-profiler.h:1142:25: note: declared here1000 1142 | ObjectNameResolver* global_object_name_resolver = nullptr;1001 | ^~~~~~~~~~~~~~~~~~~~~~~~~~~1002../../deps/v8/include/v8-profiler.h:1128:27: warning: 'v8::HeapProfiler::HeapSnapshotOptions::global_object_name_resolver' is deprecated: Use context_name_resolver callback instead. [-Wdeprecated-declarations]1003 1128 | HeapSnapshotOptions() {}1004 | ^1005../../deps/v8/include/v8-profiler.h:1142:25: note: declared here1006 1142 | ObjectNameResolver* global_object_name_resolver = nullptr;1007 | ^~~~~~~~~~~~~~~~~~~~~~~~~~~1008[185/1871] CXX obj/src/node_base.node_dotenv.o1009In file included from ../../src/util.h:29,1010 from ../../src/util-inl.h:33,1011 from ../../src/node_dotenv.h:6,1012 from ../../src/node_dotenv.cc:1:1013../../deps/v8/include/v8-profiler.h: In constructor 'v8::HeapProfiler::HeapSnapshotOptions::HeapSnapshotOptions()':1014../../deps/v8/include/v8-profiler.h:1128:27: warning: 'v8::HeapProfiler::HeapSnapshotOptions::global_object_name_resolver' is deprecated: Use context_name_resolver callback instead. [-Wdeprecated-declarations]1015 1128 | HeapSnapshotOptions() {}1016 | ^1017../../deps/v8/include/v8-profiler.h:1142:25: note: declared here1018 1142 | ObjectNameResolver* global_object_name_resolver = nullptr;1019 | ^~~~~~~~~~~~~~~~~~~~~~~~~~~1020../../deps/v8/include/v8-profiler.h:1128:27: warning: 'v8::HeapProfiler::HeapSnapshotOptions::global_object_name_resolver' is deprecated: Use context_name_resolver callback instead. [-Wdeprecated-declarations]1021 1128 | HeapSnapshotOptions() {}1022 | ^1023../../deps/v8/include/v8-profiler.h:1142:25: note: declared here1024 1142 | ObjectNameResolver* global_object_name_resolver = nullptr;1025 | ^~~~~~~~~~~~~~~~~~~~~~~~~~~1026[186/1871] CXX obj/src/node_base.node_config_file.o1027In file included from ../../src/memory_tracker.h:6,1028 from ../../src/aliased_buffer.h:7,1029 from ../../src/env.h:27,1030 from ../../src/node_internals.h:27,1031 from ../../src/node_config_file.h:12,1032 from ../../src/node_config_file.cc:1:1033../../deps/v8/include/v8-profiler.h: In constructor 'v8::HeapProfiler::HeapSnapshotOptions::HeapSnapshotOptions()':1034../../deps/v8/include/v8-profiler.h:1128:27: warning: 'v8::HeapProfiler::HeapSnapshotOptions::global_object_name_resolver' is deprecated: Use context_name_resolver callback instead. [-Wdeprecated-declarations]1035 1128 | HeapSnapshotOptions() {}1036 | ^1037../../deps/v8/include/v8-profiler.h:1142:25: note: declared here1038 1142 | ObjectNameResolver* global_object_name_resolver = nullptr;1039 | ^~~~~~~~~~~~~~~~~~~~~~~~~~~1040../../deps/v8/include/v8-profiler.h:1128:27: warning: 'v8::HeapProfiler::HeapSnapshotOptions::global_object_name_resolver' is deprecated: Use context_name_resolver callback instead. [-Wdeprecated-declarations]1041 1128 | HeapSnapshotOptions() {}1042 | ^1043../../deps/v8/include/v8-profiler.h:1142:25: note: declared here1044 1142 | ObjectNameResolver* global_object_name_resolver = nullptr;1045 | ^~~~~~~~~~~~~~~~~~~~~~~~~~~1046[187/1871] CXX obj/src/node_base.node_env_var.o1047In file included from ../../src/memory_tracker.h:6,1048 from ../../src/base_object.h:29,1049 from ../../src/async_wrap.h:27,1050 from ../../src/debug_utils.h:6,1051 from ../../src/debug_utils-inl.h:6,1052 from ../../src/node_env_var.cc:1:1053../../deps/v8/include/v8-profiler.h: In constructor 'v8::HeapProfiler::HeapSnapshotOptions::HeapSnapshotOptions()':1054../../deps/v8/include/v8-profiler.h:1128:27: warning: 'v8::HeapProfiler::HeapSnapshotOptions::global_object_name_resolver' is deprecated: Use context_name_resolver callback instead. [-Wdeprecated-declarations]1055 1128 | HeapSnapshotOptions() {}1056 | ^1057../../deps/v8/include/v8-profiler.h:1142:25: note: declared here1058 1142 | ObjectNameResolver* global_object_name_resolver = nullptr;1059 | ^~~~~~~~~~~~~~~~~~~~~~~~~~~1060../../deps/v8/include/v8-profiler.h:1128:27: warning: 'v8::HeapProfiler::HeapSnapshotOptions::global_object_name_resolver' is deprecated: Use context_name_resolver callback instead. [-Wdeprecated-declarations]1061 1128 | HeapSnapshotOptions() {}1062 | ^1063../../deps/v8/include/v8-profiler.h:1142:25: note: declared here1064 1142 | ObjectNameResolver* global_object_name_resolver = nullptr;1065 | ^~~~~~~~~~~~~~~~~~~~~~~~~~~1066[188/1871] CXX obj/src/node_base.node_dir.o1067In file included from ../../src/memory_tracker.h:6,1068 from ../../src/aliased_buffer.h:7,1069 from ../../src/node_file.h:7,1070 from ../../src/node_dir.h:6,1071 from ../../src/node_dir.cc:1:1072../../deps/v8/include/v8-profiler.h: In constructor 'v8::HeapProfiler::HeapSnapshotOptions::HeapSnapshotOptions()':1073../../deps/v8/include/v8-profiler.h:1128:27: warning: 'v8::HeapProfiler::HeapSnapshotOptions::global_object_name_resolver' is deprecated: Use context_name_resolver callback instead. [-Wdeprecated-declarations]1074 1128 | HeapSnapshotOptions() {}1075 | ^1076../../deps/v8/include/v8-profiler.h:1142:25: note: declared here1077 1142 | ObjectNameResolver* global_object_name_resolver = nullptr;1078 | ^~~~~~~~~~~~~~~~~~~~~~~~~~~1079../../deps/v8/include/v8-profiler.h:1128:27: warning: 'v8::HeapProfiler::HeapSnapshotOptions::global_object_name_resolver' is deprecated: Use context_name_resolver callback instead. [-Wdeprecated-declarations]1080 1128 | HeapSnapshotOptions() {}1081 | ^1082../../deps/v8/include/v8-profiler.h:1142:25: note: declared here1083 1142 | ObjectNameResolver* global_object_name_resolver = nullptr;1084 | ^~~~~~~~~~~~~~~~~~~~~~~~~~~1085[189/1871] CXX obj/src/node_base.node_external_reference.o1086In file included from ../../src/memory_tracker.h:6,1087 from ../../src/base_object.h:29,1088 from ../../src/base_object-inl.h:27,1089 from ../../src/node_external_reference.cc:4:1090../../deps/v8/include/v8-profiler.h: In constructor 'v8::HeapProfiler::HeapSnapshotOptions::HeapSnapshotOptions()':1091../../deps/v8/include/v8-profiler.h:1128:27: warning: 'v8::HeapProfiler::HeapSnapshotOptions::global_object_name_resolver' is deprecated: Use context_name_resolver callback instead. [-Wdeprecated-declarations]1092 1128 | HeapSnapshotOptions() {}1093 | ^1094../../deps/v8/include/v8-profiler.h:1142:25: note: declared here1095 1142 | ObjectNameResolver* global_object_name_resolver = nullptr;1096 | ^~~~~~~~~~~~~~~~~~~~~~~~~~~1097../../deps/v8/include/v8-profiler.h:1128:27: warning: 'v8::HeapProfiler::HeapSnapshotOptions::global_object_name_resolver' is deprecated: Use context_name_resolver callback instead. [-Wdeprecated-declarations]1098 1128 | HeapSnapshotOptions() {}1099 | ^1100../../deps/v8/include/v8-profiler.h:1142:25: note: declared here1101 1142 | ObjectNameResolver* global_object_name_resolver = nullptr;1102 | ^~~~~~~~~~~~~~~~~~~~~~~~~~~1103[190/1871] CXX obj/src/node_base.node_blob.o1104In file included from ../../src/memory_tracker.h:6,1105 from ../../src/base_object.h:29,1106 from ../../src/async_wrap.h:27,1107 from ../../src/node_blob.h:8,1108 from ../../src/node_blob.cc:1:1109../../deps/v8/include/v8-profiler.h: In constructor 'v8::HeapProfiler::HeapSnapshotOptions::HeapSnapshotOptions()':1110../../deps/v8/include/v8-profiler.h:1128:27: warning: 'v8::HeapProfiler::HeapSnapshotOptions::global_object_name_resolver' is deprecated: Use context_name_resolver callback instead. [-Wdeprecated-declarations]1111 1128 | HeapSnapshotOptions() {}1112 | ^1113../../deps/v8/include/v8-profiler.h:1142:25: note: declared here1114 1142 | ObjectNameResolver* global_object_name_resolver = nullptr;1115 | ^~~~~~~~~~~~~~~~~~~~~~~~~~~1116../../deps/v8/include/v8-profiler.h:1128:27: warning: 'v8::HeapProfiler::HeapSnapshotOptions::global_object_name_resolver' is deprecated: Use context_name_resolver callback instead. [-Wdeprecated-declarations]1117 1128 | HeapSnapshotOptions() {}1118 | ^1119../../deps/v8/include/v8-profiler.h:1142:25: note: declared here1120 1142 | ObjectNameResolver* global_object_name_resolver = nullptr;1121 | ^~~~~~~~~~~~~~~~~~~~~~~~~~~1122[191/1871] CXX obj/src/node_base.node.o1123In file included from ../../src/memory_tracker.h:6,1124 from ../../src/aliased_buffer.h:7,1125 from ../../src/env.h:27,1126 from ../../src/node_internals.h:27,1127 from ../../src/node_config_file.h:12,1128 from ../../src/node.cc:23:1129../../deps/v8/include/v8-profiler.h: In constructor 'v8::HeapProfiler::HeapSnapshotOptions::HeapSnapshotOptions()':1130../../deps/v8/include/v8-profiler.h:1128:27: warning: 'v8::HeapProfiler::HeapSnapshotOptions::global_object_name_resolver' is deprecated: Use context_name_resolver callback instead. [-Wdeprecated-declarations]1131 1128 | HeapSnapshotOptions() {}1132 | ^1133../../deps/v8/include/v8-profiler.h:1142:25: note: declared here1134 1142 | ObjectNameResolver* global_object_name_resolver = nullptr;1135 | ^~~~~~~~~~~~~~~~~~~~~~~~~~~1136../../deps/v8/include/v8-profiler.h:1128:27: warning: 'v8::HeapProfiler::HeapSnapshotOptions::global_object_name_resolver' is deprecated: Use context_name_resolver callback instead. [-Wdeprecated-declarations]1137 1128 | HeapSnapshotOptions() {}1138 | ^1139../../deps/v8/include/v8-profiler.h:1142:25: note: declared here1140 1142 | ObjectNameResolver* global_object_name_resolver = nullptr;1141 | ^~~~~~~~~~~~~~~~~~~~~~~~~~~1142[192/1871] CXX obj/src/node_base.module_wrap.o1143In file included from ../../src/memory_tracker.h:6,1144 from ../../src/base_object.h:29,1145 from ../../src/module_wrap.h:10,1146 from ../../src/module_wrap.cc:1:1147../../deps/v8/include/v8-profiler.h: In constructor 'v8::HeapProfiler::HeapSnapshotOptions::HeapSnapshotOptions()':1148../../deps/v8/include/v8-profiler.h:1128:27: warning: 'v8::HeapProfiler::HeapSnapshotOptions::global_object_name_resolver' is deprecated: Use context_name_resolver callback instead. [-Wdeprecated-declarations]1149 1128 | HeapSnapshotOptions() {}1150 | ^1151../../deps/v8/include/v8-profiler.h:1142:25: note: declared here1152 1142 | ObjectNameResolver* global_object_name_resolver = nullptr;1153 | ^~~~~~~~~~~~~~~~~~~~~~~~~~~1154../../deps/v8/include/v8-profiler.h:1128:27: warning: 'v8::HeapProfiler::HeapSnapshotOptions::global_object_name_resolver' is deprecated: Use context_name_resolver callback instead. [-Wdeprecated-declarations]1155 1128 | HeapSnapshotOptions() {}1156 | ^1157../../deps/v8/include/v8-profiler.h:1142:25: note: declared here1158 1142 | ObjectNameResolver* global_object_name_resolver = nullptr;1159 | ^~~~~~~~~~~~~~~~~~~~~~~~~~~1160[193/1871] CXX obj/src/node_base.node_errors.o1161In file included from ../../src/memory_tracker.h:6,1162 from ../../src/base_object.h:29,1163 from ../../src/async_wrap.h:27,1164 from ../../src/debug_utils.h:6,1165 from ../../src/debug_utils-inl.h:6,1166 from ../../src/node_errors.cc:6:1167../../deps/v8/include/v8-profiler.h: In constructor 'v8::HeapProfiler::HeapSnapshotOptions::HeapSnapshotOptions()':1168../../deps/v8/include/v8-profiler.h:1128:27: warning: 'v8::HeapProfiler::HeapSnapshotOptions::global_object_name_resolver' is deprecated: Use context_name_resolver callback instead. [-Wdeprecated-declarations]1169 1128 | HeapSnapshotOptions() {}1170 | ^1171../../deps/v8/include/v8-profiler.h:1142:25: note: declared here1172 1142 | ObjectNameResolver* global_object_name_resolver = nullptr;1173 | ^~~~~~~~~~~~~~~~~~~~~~~~~~~1174../../deps/v8/include/v8-profiler.h:1128:27: warning: 'v8::HeapProfiler::HeapSnapshotOptions::global_object_name_resolver' is deprecated: Use context_name_resolver callback instead. [-Wdeprecated-declarations]1175 1128 | HeapSnapshotOptions() {}1176 | ^1177../../deps/v8/include/v8-profiler.h:1142:25: note: declared here1178 1142 | ObjectNameResolver* global_object_name_resolver = nullptr;1179 | ^~~~~~~~~~~~~~~~~~~~~~~~~~~1180[194/1871] CXX obj/src/node_base.node_buffer.o1181In file included from ../../src/memory_tracker.h:6,1182 from ../../src/base_object.h:29,1183 from ../../src/async_wrap.h:27,1184 from ../../src/node_blob.h:8,1185 from ../../src/node_buffer.cc:24:1186../../deps/v8/include/v8-profiler.h: In constructor 'v8::HeapProfiler::HeapSnapshotOptions::HeapSnapshotOptions()':1187../../deps/v8/include/v8-profiler.h:1128:27: warning: 'v8::HeapProfiler::HeapSnapshotOptions::global_object_name_resolver' is deprecated: Use context_name_resolver callback instead. [-Wdeprecated-declarations]1188 1128 | HeapSnapshotOptions() {}1189 | ^1190../../deps/v8/include/v8-profiler.h:1142:25: note: declared here1191 1142 | ObjectNameResolver* global_object_name_resolver = nullptr;1192 | ^~~~~~~~~~~~~~~~~~~~~~~~~~~1193../../deps/v8/include/v8-profiler.h:1128:27: warning: 'v8::HeapProfiler::HeapSnapshotOptions::global_object_name_resolver' is deprecated: Use context_name_resolver callback instead. [-Wdeprecated-declarations]1194 1128 | HeapSnapshotOptions() {}1195 | ^1196../../deps/v8/include/v8-profiler.h:1142:25: note: declared here1197 1142 | ObjectNameResolver* global_object_name_resolver = nullptr;1198 | ^~~~~~~~~~~~~~~~~~~~~~~~~~~1199[195/1871] CXX obj/src/node_base.node_builtins.o1200In file included from ../../src/util.h:29,1201 from ../../src/node_mutex.h:6,1202 from ../../src/node_builtins.h:16,1203 from ../../src/node_builtins.cc:1:1204../../deps/v8/include/v8-profiler.h: In constructor 'v8::HeapProfiler::HeapSnapshotOptions::HeapSnapshotOptions()':1205../../deps/v8/include/v8-profiler.h:1128:27: warning: 'v8::HeapProfiler::HeapSnapshotOptions::global_object_name_resolver' is deprecated: Use context_name_resolver callback instead. [-Wdeprecated-declarations]1206 1128 | HeapSnapshotOptions() {}1207 | ^1208../../deps/v8/include/v8-profiler.h:1142:25: note: declared here1209 1142 | ObjectNameResolver* global_object_name_resolver = nullptr;1210 | ^~~~~~~~~~~~~~~~~~~~~~~~~~~1211../../deps/v8/include/v8-profiler.h:1128:27: warning: 'v8::HeapProfiler::HeapSnapshotOptions::global_object_name_resolver' is deprecated: Use context_name_resolver callback instead. [-Wdeprecated-declarations]1212 1128 | HeapSnapshotOptions() {}1213 | ^1214../../deps/v8/include/v8-profiler.h:1142:25: note: declared here1215 1142 | ObjectNameResolver* global_object_name_resolver = nullptr;1216 | ^~~~~~~~~~~~~~~~~~~~~~~~~~~1217[196/1871] CXX obj/src/node_base.node_contextify.o1218In file included from ../../src/memory_tracker.h:6,1219 from ../../src/base_object.h:29,1220 from ../../src/base_object-inl.h:27,1221 from ../../src/node_contextify.h:6,1222 from ../../src/node_contextify.cc:22:1223../../deps/v8/include/v8-profiler.h: In constructor 'v8::HeapProfiler::HeapSnapshotOptions::HeapSnapshotOptions()':1224../../deps/v8/include/v8-profiler.h:1128:27: warning: 'v8::HeapProfiler::HeapSnapshotOptions::global_object_name_resolver' is deprecated: Use context_name_resolver callback instead. [-Wdeprecated-declarations]1225 1128 | HeapSnapshotOptions() {}1226 | ^1227../../deps/v8/include/v8-profiler.h:1142:25: note: declared here1228 1142 | ObjectNameResolver* global_object_name_resolver = nullptr;1229 | ^~~~~~~~~~~~~~~~~~~~~~~~~~~1230../../deps/v8/include/v8-profiler.h:1128:27: warning: 'v8::HeapProfiler::HeapSnapshotOptions::global_object_name_resolver' is deprecated: Use context_name_resolver callback instead. [-Wdeprecated-declarations]1231 1128 | HeapSnapshotOptions() {}1232 | ^1233../../deps/v8/include/v8-profiler.h:1142:25: note: declared here1234 1142 | ObjectNameResolver* global_object_name_resolver = nullptr;1235 | ^~~~~~~~~~~~~~~~~~~~~~~~~~~1236[197/1871] CXX obj/gen/node_base.node_javascript.o1237In file included from ../../src/memory_tracker.h:6,1238 from ../../src/aliased_buffer.h:7,1239 from ../../src/aliased_buffer-inl.h:6,1240 from ../../src/env-inl.h:27,1241 from gen/node_javascript.cc:2:1242../../deps/v8/include/v8-profiler.h: In constructor 'v8::HeapProfiler::HeapSnapshotOptions::HeapSnapshotOptions()':1243../../deps/v8/include/v8-profiler.h:1128:27: warning: 'v8::HeapProfiler::HeapSnapshotOptions::global_object_name_resolver' is deprecated: Use context_name_resolver callback instead. [-Wdeprecated-declarations]1244 1128 | HeapSnapshotOptions() {}1245 | ^1246../../deps/v8/include/v8-profiler.h:1142:25: note: declared here1247 1142 | ObjectNameResolver* global_object_name_resolver = nullptr;1248 | ^~~~~~~~~~~~~~~~~~~~~~~~~~~1249../../deps/v8/include/v8-profiler.h:1128:27: warning: 'v8::HeapProfiler::HeapSnapshotOptions::global_object_name_resolver' is deprecated: Use context_name_resolver callback instead. [-Wdeprecated-declarations]1250 1128 | HeapSnapshotOptions() {}1251 | ^1252../../deps/v8/include/v8-profiler.h:1142:25: note: declared here1253 1142 | ObjectNameResolver* global_object_name_resolver = nullptr;1254 | ^~~~~~~~~~~~~~~~~~~~~~~~~~~1255[198/1871] CXX obj/src/node_base.cares_wrap.o1256In file included from ../../src/memory_tracker.h:6,1257 from ../../src/base_object.h:29,1258 from ../../src/async_wrap.h:27,1259 from ../../src/cares_wrap.h:8,1260 from ../../src/cares_wrap.cc:22:1261../../deps/v8/include/v8-profiler.h: In constructor 'v8::HeapProfiler::HeapSnapshotOptions::HeapSnapshotOptions()':1262../../deps/v8/include/v8-profiler.h:1128:27: warning: 'v8::HeapProfiler::HeapSnapshotOptions::global_object_name_resolver' is deprecated: Use context_name_resolver callback instead. [-Wdeprecated-declarations]1263 1128 | HeapSnapshotOptions() {}1264 | ^1265../../deps/v8/include/v8-profiler.h:1142:25: note: declared here1266 1142 | ObjectNameResolver* global_object_name_resolver = nullptr;1267 | ^~~~~~~~~~~~~~~~~~~~~~~~~~~1268../../deps/v8/include/v8-profiler.h:1128:27: warning: 'v8::HeapProfiler::HeapSnapshotOptions::global_object_name_resolver' is deprecated: Use context_name_resolver callback instead. [-Wdeprecated-declarations]1269 1128 | HeapSnapshotOptions() {}1270 | ^1271../../deps/v8/include/v8-profiler.h:1142:25: note: declared here1272 1142 | ObjectNameResolver* global_object_name_resolver = nullptr;1273 | ^~~~~~~~~~~~~~~~~~~~~~~~~~~1274../../src/cares_wrap.cc: In function 'v8::Maybe<int> node::cares_wrap::{anonymous}::ParseGeneralReply(node::Environment*, const unsigned char*, int, int*, v8::Local<v8::Array>, void*, int*)':1275../../src/cares_wrap.cc:244:34: warning: 'int ares_parse_a_reply(const unsigned char*, int, hostent**, ares_addrttl*, int*)' is deprecated: Use ares_dns_parse instead [-Wdeprecated-declarations]1276 244 | status = ares_parse_a_reply(buf,1277 | ~~~~~~~~~~~~~~~~~~^~~~~1278 245 | len,1279 | ~~~~1280 246 | &host,1281 | ~~~~~~1282 247 | static_cast<ares_addrttl*>(addrttls),1283 | ~~~~~~~~~~~~~~~~~~~~~~~~~~~~~~~~~~~~~1284 248 | naddrttls);1285 | ~~~~~~~~~~1286In file included from ../../src/cares_wrap.h:17:1287/nix/store/j239p458yixap89j6wpfib9yjypd3ii5-c-ares-1.34.8-dev/include/ares.h:1106:55: note: declared here1288 1106 | CARES_EXTERN CARES_DEPRECATED_FOR(ares_dns_parse) int ares_parse_a_reply(1289 | ^~~~~~~~~~~~~~~~~~1290../../src/cares_wrap.cc:251:37: warning: 'int ares_parse_aaaa_reply(const unsigned char*, int, hostent**, ares_addr6ttl*, int*)' is deprecated: Use ares_dns_parse instead [-Wdeprecated-declarations]1291 251 | status = ares_parse_aaaa_reply(buf,1292 | ~~~~~~~~~~~~~~~~~~~~~^~~~~1293 252 | len,1294 | ~~~~1295 253 | &host,1296 | ~~~~~~1297 254 | static_cast<ares_addr6ttl*>(addrttls),1298 | ~~~~~~~~~~~~~~~~~~~~~~~~~~~~~~~~~~~~~~1299 255 | naddrttls);1300 | ~~~~~~~~~~1301/nix/store/j239p458yixap89j6wpfib9yjypd3ii5-c-ares-1.34.8-dev/include/ares.h:1110:55: note: declared here1302 1110 | CARES_EXTERN CARES_DEPRECATED_FOR(ares_dns_parse) int ares_parse_aaaa_reply(1303 | ^~~~~~~~~~~~~~~~~~~~~1304../../src/cares_wrap.cc:258:35: warning: 'int ares_parse_ns_reply(const unsigned char*, int, hostent**)' is deprecated: Use ares_dns_parse instead [-Wdeprecated-declarations]1305 258 | status = ares_parse_ns_reply(buf, len, &host);1306 | ~~~~~~~~~~~~~~~~~~~^~~~~~~~~~~~~~~~~1307/nix/store/j239p458yixap89j6wpfib9yjypd3ii5-c-ares-1.34.8-dev/include/ares.h:1121:55: note: declared here1308 1121 | CARES_EXTERN CARES_DEPRECATED_FOR(ares_dns_parse) int ares_parse_ns_reply(1309 | ^~~~~~~~~~~~~~~~~~~1310../../src/cares_wrap.cc:261:36: warning: 'int ares_parse_ptr_reply(const unsigned char*, int, const void*, int, int, hostent**)' is deprecated: Use ares_dns_parse instead [-Wdeprecated-declarations]1311 261 | status = ares_parse_ptr_reply(buf, len, nullptr, 0, AF_INET, &host);1312 | ~~~~~~~~~~~~~~~~~~~~^~~~~~~~~~~~~~~~~~~~~~~~~~~~~~~~~~~~~~1313/nix/store/j239p458yixap89j6wpfib9yjypd3ii5-c-ares-1.34.8-dev/include/ares.h:1117:55: note: declared here1314 1117 | CARES_EXTERN CARES_DEPRECATED_FOR(ares_dns_parse) int ares_parse_ptr_reply(1315 | ^~~~~~~~~~~~~~~~~~~~1316../../src/cares_wrap.cc: In function 'v8::Maybe<int> node::cares_wrap::{anonymous}::ParseMxReply(node::Environment*, const unsigned char*, int, v8::Local<v8::Array>, bool)':1317../../src/cares_wrap.cc:337:35: warning: 'int ares_parse_mx_reply(const unsigned char*, int, ares_mx_reply**)' is deprecated: Use ares_dns_parse instead [-Wdeprecated-declarations]1318 337 | int status = ares_parse_mx_reply(buf, len, &mx_start);1319 | ~~~~~~~~~~~~~~~~~~~^~~~~~~~~~~~~~~~~~~~~1320/nix/store/j239p458yixap89j6wpfib9yjypd3ii5-c-ares-1.34.8-dev/include/ares.h:1127:55: note: declared here1321 1127 | CARES_EXTERN CARES_DEPRECATED_FOR(ares_dns_parse) int ares_parse_mx_reply(1322 | ^~~~~~~~~~~~~~~~~~~1323../../src/cares_wrap.cc: In function 'v8::Maybe<int> node::cares_wrap::{anonymous}::ParseCaaReply(node::Environment*, const unsigned char*, int, v8::Local<v8::Array>, bool)':1324../../src/cares_wrap.cc:383:36: warning: 'int ares_parse_caa_reply(const unsigned char*, int, ares_caa_reply**)' is deprecated: Use ares_dns_parse instead [-Wdeprecated-declarations]1325 383 | int status = ares_parse_caa_reply(buf, len, &caa_start);1326 | ~~~~~~~~~~~~~~~~~~~~^~~~~~~~~~~~~~~~~~~~~~1327/nix/store/j239p458yixap89j6wpfib9yjypd3ii5-c-ares-1.34.8-dev/include/ares.h:1114:55: note: declared here1328 1114 | CARES_EXTERN CARES_DEPRECATED_FOR(ares_dns_parse) int ares_parse_caa_reply(1329 | ^~~~~~~~~~~~~~~~~~~~1330../../src/cares_wrap.cc: In function 'v8::Maybe<int> node::cares_wrap::{anonymous}::ParseTxtReply(node::Environment*, const unsigned char*, int, v8::Local<v8::Array>, bool)':1331../../src/cares_wrap.cc:511:40: warning: 'int ares_parse_txt_reply_ext(const unsigned char*, int, ares_txt_ext**)' is deprecated: Use ares_dns_parse instead [-Wdeprecated-declarations]1332 511 | int status = ares_parse_txt_reply_ext(buf, len, &txt_out);1333 | ~~~~~~~~~~~~~~~~~~~~~~~~^~~~~~~~~~~~~~~~~~~~1334/nix/store/j239p458yixap89j6wpfib9yjypd3ii5-c-ares-1.34.8-dev/include/ares.h:1133:55: note: declared here1335 1133 | CARES_EXTERN CARES_DEPRECATED_FOR(ares_dns_parse) int ares_parse_txt_reply_ext(1336 | ^~~~~~~~~~~~~~~~~~~~~~~~1337../../src/cares_wrap.cc: In function 'v8::Maybe<int> node::cares_wrap::{anonymous}::ParseSrvReply(node::Environment*, const unsigned char*, int, v8::Local<v8::Array>, bool)':1338../../src/cares_wrap.cc:598:36: warning: 'int ares_parse_srv_reply(const unsigned char*, int, ares_srv_reply**)' is deprecated: Use ares_dns_parse instead [-Wdeprecated-declarations]1339 598 | int status = ares_parse_srv_reply(buf, len, &srv_start);1340 | ~~~~~~~~~~~~~~~~~~~~^~~~~~~~~~~~~~~~~~~~~~1341/nix/store/j239p458yixap89j6wpfib9yjypd3ii5-c-ares-1.34.8-dev/include/ares.h:1124:55: note: declared here1342 1124 | CARES_EXTERN CARES_DEPRECATED_FOR(ares_dns_parse) int ares_parse_srv_reply(1343 | ^~~~~~~~~~~~~~~~~~~~1344../../src/cares_wrap.cc: In function 'v8::Maybe<int> node::cares_wrap::{anonymous}::ParseNaptrReply(node::Environment*, const unsigned char*, int, v8::Local<v8::Array>, bool)':1345../../src/cares_wrap.cc:653:38: warning: 'int ares_parse_naptr_reply(const unsigned char*, int, ares_naptr_reply**)' is deprecated: Use ares_dns_parse instead [-Wdeprecated-declarations]1346 653 | int status = ares_parse_naptr_reply(buf, len, &naptr_start);1347 | ~~~~~~~~~~~~~~~~~~~~~~^~~~~~~~~~~~~~~~~~~~~~~~1348/nix/store/j239p458yixap89j6wpfib9yjypd3ii5-c-ares-1.34.8-dev/include/ares.h:1136:55: note: declared here1349 1136 | CARES_EXTERN CARES_DEPRECATED_FOR(ares_dns_parse) int ares_parse_naptr_reply(1350 | ^~~~~~~~~~~~~~~~~~~~~~1351../../src/cares_wrap.cc: In member function 'void node::cares_wrap::ChannelWrap::EnsureServers()':1352../../src/cares_wrap.cc:1000:25: warning: 'int ares_get_servers_ports(const ares_channel_t*, ares_addr_port_node**)' is deprecated: Use ares_get_servers_csv instead [-Wdeprecated-declarations]1353 1000 | ares_get_servers_ports(channel_, &servers);1354 | ~~~~~~~~~~~~~~~~~~~~~~^~~~~~~~~~~~~~~~~~~~1355/nix/store/j239p458yixap89j6wpfib9yjypd3ii5-c-ares-1.34.8-dev/include/ares.h:1196:28: note: declared here1356 1196 | int ares_get_servers_ports(const ares_channel_t *channel,1357 | ^~~~~~~~~~~~~~~~~~~~~~1358../../src/cares_wrap.cc: In static member function 'static v8::Maybe<int> node::cares_wrap::SoaTraits::Parse(node::cares_wrap::QuerySoaWrap*, const std::unique_ptr<node::cares_wrap::ResponseData>&)':1359../../src/cares_wrap.cc:1711:36: warning: 'int ares_parse_soa_reply(const unsigned char*, int, ares_soa_reply**)' is deprecated: Use ares_dns_parse instead [-Wdeprecated-declarations]1360 1711 | int status = ares_parse_soa_reply(buf, len, &soa_out);1361 | ~~~~~~~~~~~~~~~~~~~~^~~~~~~~~~~~~~~~~~~~1362/nix/store/j239p458yixap89j6wpfib9yjypd3ii5-c-ares-1.34.8-dev/include/ares.h:1139:55: note: declared here1363 1139 | CARES_EXTERN CARES_DEPRECATED_FOR(ares_dns_parse) int ares_parse_soa_reply(1364 | ^~~~~~~~~~~~~~~~~~~~1365../../src/cares_wrap.cc: In function 'void node::cares_wrap::{anonymous}::GetServers(const v8::FunctionCallbackInfo<v8::Value>&)':1366../../src/cares_wrap.cc:2092:33: warning: 'int ares_get_servers_ports(const ares_channel_t*, ares_addr_port_node**)' is deprecated: Use ares_get_servers_csv instead [-Wdeprecated-declarations]1367 2092 | int r = ares_get_servers_ports(channel->cares_channel(), &servers);1368 | ~~~~~~~~~~~~~~~~~~~~~~^~~~~~~~~~~~~~~~~~~~~~~~~~~~~~~~~~~~1369/nix/store/j239p458yixap89j6wpfib9yjypd3ii5-c-ares-1.34.8-dev/include/ares.h:1196:28: note: declared here1370 1196 | int ares_get_servers_ports(const ares_channel_t *channel,1371 | ^~~~~~~~~~~~~~~~~~~~~~1372../../src/cares_wrap.cc: In function 'void node::cares_wrap::{anonymous}::SetServers(const v8::FunctionCallbackInfo<v8::Value>&)':1373../../src/cares_wrap.cc:2137:30: warning: 'int ares_set_servers(ares_channel_t*, const ares_addr_node*)' is deprecated: Use ares_set_servers_csv instead [-Wdeprecated-declarations]1374 2137 | int rv = ares_set_servers(channel->cares_channel(), nullptr);1375 | ~~~~~~~~~~~~~~~~^~~~~~~~~~~~~~~~~~~~~~~~~~~~~~~~~~~1376/nix/store/j239p458yixap89j6wpfib9yjypd3ii5-c-ares-1.34.8-dev/include/ares.h:1176:61: note: declared here1377 1176 | CARES_EXTERN CARES_DEPRECATED_FOR(ares_set_servers_csv) int ares_set_servers(1378 | ^~~~~~~~~~~~~~~~1379../../src/cares_wrap.cc:2197:33: warning: 'int ares_set_servers_ports(ares_channel_t*, const ares_addr_port_node*)' is deprecated: Use ares_set_servers_ports_csv instead [-Wdeprecated-declarations]1380 2197 | err = ares_set_servers_ports(channel->cares_channel(), servers.data());1381 | ~~~~~~~~~~~~~~~~~~~~~~^~~~~~~~~~~~~~~~~~~~~~~~~~~~~~~~~~~~~~~~~~1382/nix/store/j239p458yixap89j6wpfib9yjypd3ii5-c-ares-1.34.8-dev/include/ares.h:1181:20: note: declared here1383 1181 | int ares_set_servers_ports(ares_channel_t *channel,1384 | ^~~~~~~~~~~~~~~~~~~~~~1385[199/1871] CXX obj/src/node_base.node_os.o1386In file included from ../../src/memory_tracker.h:6,1387 from ../../src/aliased_buffer.h:7,1388 from ../../src/aliased_buffer-inl.h:6,1389 from ../../src/env-inl.h:27,1390 from ../../src/node_os.cc:22:1391../../deps/v8/include/v8-profiler.h: In constructor 'v8::HeapProfiler::HeapSnapshotOptions::HeapSnapshotOptions()':1392../../deps/v8/include/v8-profiler.h:1128:27: warning: 'v8::HeapProfiler::HeapSnapshotOptions::global_object_name_resolver' is deprecated: Use context_name_resolver callback instead. [-Wdeprecated-declarations]1393 1128 | HeapSnapshotOptions() {}1394 | ^1395../../deps/v8/include/v8-profiler.h:1142:25: note: declared here1396 1142 | ObjectNameResolver* global_object_name_resolver = nullptr;1397 | ^~~~~~~~~~~~~~~~~~~~~~~~~~~1398../../deps/v8/include/v8-profiler.h:1128:27: warning: 'v8::HeapProfiler::HeapSnapshotOptions::global_object_name_resolver' is deprecated: Use context_name_resolver callback instead. [-Wdeprecated-declarations]1399 1128 | HeapSnapshotOptions() {}1400 | ^1401../../deps/v8/include/v8-profiler.h:1142:25: note: declared here1402 1142 | ObjectNameResolver* global_object_name_resolver = nullptr;1403 | ^~~~~~~~~~~~~~~~~~~~~~~~~~~1404[200/1871] CXX obj/src/node_base.node_http_parser.o1405In file included from ../../src/util.h:29,1406 from ../../src/node_http_parser.cc:24:1407../../deps/v8/include/v8-profiler.h: In constructor 'v8::HeapProfiler::HeapSnapshotOptions::HeapSnapshotOptions()':1408../../deps/v8/include/v8-profiler.h:1128:27: warning: 'v8::HeapProfiler::HeapSnapshotOptions::global_object_name_resolver' is deprecated: Use context_name_resolver callback instead. [-Wdeprecated-declarations]1409 1128 | HeapSnapshotOptions() {}1410 | ^1411../../deps/v8/include/v8-profiler.h:1142:25: note: declared here1412 1142 | ObjectNameResolver* global_object_name_resolver = nullptr;1413 | ^~~~~~~~~~~~~~~~~~~~~~~~~~~1414../../deps/v8/include/v8-profiler.h:1128:27: warning: 'v8::HeapProfiler::HeapSnapshotOptions::global_object_name_resolver' is deprecated: Use context_name_resolver callback instead. [-Wdeprecated-declarations]1415 1128 | HeapSnapshotOptions() {}1416 | ^1417../../deps/v8/include/v8-profiler.h:1142:25: note: declared here1418 1142 | ObjectNameResolver* global_object_name_resolver = nullptr;1419 | ^~~~~~~~~~~~~~~~~~~~~~~~~~~1420[201/1871] CXX obj/src/node_base.node_ipc_serdes.o1421In file included from ../../src/memory_tracker.h:6,1422 from ../../src/aliased_buffer.h:7,1423 from ../../src/aliased_buffer-inl.h:6,1424 from ../../src/env-inl.h:27,1425 from ../../src/node_ipc_serdes.cc:1:1426../../deps/v8/include/v8-profiler.h: In constructor 'v8::HeapProfiler::HeapSnapshotOptions::HeapSnapshotOptions()':1427../../deps/v8/include/v8-profiler.h:1128:27: warning: 'v8::HeapProfiler::HeapSnapshotOptions::global_object_name_resolver' is deprecated: Use context_name_resolver callback instead. [-Wdeprecated-declarations]1428 1128 | HeapSnapshotOptions() {}1429 | ^1430../../deps/v8/include/v8-profiler.h:1142:25: note: declared here1431 1142 | ObjectNameResolver* global_object_name_resolver = nullptr;1432 | ^~~~~~~~~~~~~~~~~~~~~~~~~~~1433../../deps/v8/include/v8-profiler.h:1128:27: warning: 'v8::HeapProfiler::HeapSnapshotOptions::global_object_name_resolver' is deprecated: Use context_name_resolver callback instead. [-Wdeprecated-declarations]1434 1128 | HeapSnapshotOptions() {}1435 | ^1436../../deps/v8/include/v8-profiler.h:1142:25: note: declared here1437 1142 | ObjectNameResolver* global_object_name_resolver = nullptr;1438 | ^~~~~~~~~~~~~~~~~~~~~~~~~~~1439[202/1871] CXX obj/src/node_base.node_metadata.o1440In file included from ../../src/util.h:29,1441 from ../../src/node_metadata.cc:22:1442../../deps/v8/include/v8-profiler.h: In constructor 'v8::HeapProfiler::HeapSnapshotOptions::HeapSnapshotOptions()':1443../../deps/v8/include/v8-profiler.h:1128:27: warning: 'v8::HeapProfiler::HeapSnapshotOptions::global_object_name_resolver' is deprecated: Use context_name_resolver callback instead. [-Wdeprecated-declarations]1444 1128 | HeapSnapshotOptions() {}1445 | ^1446../../deps/v8/include/v8-profiler.h:1142:25: note: declared here1447 1142 | ObjectNameResolver* global_object_name_resolver = nullptr;1448 | ^~~~~~~~~~~~~~~~~~~~~~~~~~~1449../../deps/v8/include/v8-profiler.h:1128:27: warning: 'v8::HeapProfiler::HeapSnapshotOptions::global_object_name_resolver' is deprecated: Use context_name_resolver callback instead. [-Wdeprecated-declarations]1450 1128 | HeapSnapshotOptions() {}1451 | ^1452../../deps/v8/include/v8-profiler.h:1142:25: note: declared here1453 1142 | ObjectNameResolver* global_object_name_resolver = nullptr;1454 | ^~~~~~~~~~~~~~~~~~~~~~~~~~~1455[203/1871] CXX obj/src/node_base.node_perf.o1456In file included from ../../src/memory_tracker.h:6,1457 from ../../src/base_object.h:29,1458 from ../../src/base_object-inl.h:27,1459 from ../../src/node_perf.h:6,1460 from ../../src/node_perf.cc:1:1461../../deps/v8/include/v8-profiler.h: In constructor 'v8::HeapProfiler::HeapSnapshotOptions::HeapSnapshotOptions()':1462../../deps/v8/include/v8-profiler.h:1128:27: warning: 'v8::HeapProfiler::HeapSnapshotOptions::global_object_name_resolver' is deprecated: Use context_name_resolver callback instead. [-Wdeprecated-declarations]1463 1128 | HeapSnapshotOptions() {}1464 | ^1465../../deps/v8/include/v8-profiler.h:1142:25: note: declared here1466 1142 | ObjectNameResolver* global_object_name_resolver = nullptr;1467 | ^~~~~~~~~~~~~~~~~~~~~~~~~~~1468../../deps/v8/include/v8-profiler.h:1128:27: warning: 'v8::HeapProfiler::HeapSnapshotOptions::global_object_name_resolver' is deprecated: Use context_name_resolver callback instead. [-Wdeprecated-declarations]1469 1128 | HeapSnapshotOptions() {}1470 | ^1471../../deps/v8/include/v8-profiler.h:1142:25: note: declared here1472 1142 | ObjectNameResolver* global_object_name_resolver = nullptr;1473 | ^~~~~~~~~~~~~~~~~~~~~~~~~~~1474[204/1871] CXX obj/src/node_base.node_i18n.o1475In file included from ../../src/memory_tracker.h:6,1476 from ../../src/base_object.h:29,1477 from ../../src/node_i18n.h:29,1478 from ../../src/node_i18n.cc:43:1479../../deps/v8/include/v8-profiler.h: In constructor 'v8::HeapProfiler::HeapSnapshotOptions::HeapSnapshotOptions()':1480../../deps/v8/include/v8-profiler.h:1128:27: warning: 'v8::HeapProfiler::HeapSnapshotOptions::global_object_name_resolver' is deprecated: Use context_name_resolver callback instead. [-Wdeprecated-declarations]1481 1128 | HeapSnapshotOptions() {}1482 | ^1483../../deps/v8/include/v8-profiler.h:1142:25: note: declared here1484 1142 | ObjectNameResolver* global_object_name_resolver = nullptr;1485 | ^~~~~~~~~~~~~~~~~~~~~~~~~~~1486../../deps/v8/include/v8-profiler.h:1128:27: warning: 'v8::HeapProfiler::HeapSnapshotOptions::global_object_name_resolver' is deprecated: Use context_name_resolver callback instead. [-Wdeprecated-declarations]1487 1128 | HeapSnapshotOptions() {}1488 | ^1489../../deps/v8/include/v8-profiler.h:1142:25: note: declared here1490 1142 | ObjectNameResolver* global_object_name_resolver = nullptr;1491 | ^~~~~~~~~~~~~~~~~~~~~~~~~~~1492[205/1871] CXX obj/src/node_base.node_diagnostics_channel.o1493In file included from ../../src/memory_tracker.h:6,1494 from ../../src/aliased_buffer.h:7,1495 from ../../src/node_diagnostics_channel.h:11,1496 from ../../src/node_diagnostics_channel.cc:1:1497../../deps/v8/include/v8-profiler.h: In constructor 'v8::HeapProfiler::HeapSnapshotOptions::HeapSnapshotOptions()':1498../../deps/v8/include/v8-profiler.h:1128:27: warning: 'v8::HeapProfiler::HeapSnapshotOptions::global_object_name_resolver' is deprecated: Use context_name_resolver callback instead. [-Wdeprecated-declarations]1499 1128 | HeapSnapshotOptions() {}1500 | ^1501../../deps/v8/include/v8-profiler.h:1142:25: note: declared here1502 1142 | ObjectNameResolver* global_object_name_resolver = nullptr;1503 | ^~~~~~~~~~~~~~~~~~~~~~~~~~~1504../../deps/v8/include/v8-profiler.h:1128:27: warning: 'v8::HeapProfiler::HeapSnapshotOptions::global_object_name_resolver' is deprecated: Use context_name_resolver callback instead. [-Wdeprecated-declarations]1505 1128 | HeapSnapshotOptions() {}1506 | ^1507../../deps/v8/include/v8-profiler.h:1142:25: note: declared here1508 1142 | ObjectNameResolver* global_object_name_resolver = nullptr;1509 | ^~~~~~~~~~~~~~~~~~~~~~~~~~~1510[206/1871] CXX obj/src/node_base.node_main_instance.o1511In file included from ../../src/util.h:29,1512 from ../../src/node_main_instance.h:11,1513 from ../../src/node_main_instance.cc:1:1514../../deps/v8/include/v8-profiler.h: In constructor 'v8::HeapProfiler::HeapSnapshotOptions::HeapSnapshotOptions()':1515../../deps/v8/include/v8-profiler.h:1128:27: warning: 'v8::HeapProfiler::HeapSnapshotOptions::global_object_name_resolver' is deprecated: Use context_name_resolver callback instead. [-Wdeprecated-declarations]1516 1128 | HeapSnapshotOptions() {}1517 | ^1518../../deps/v8/include/v8-profiler.h:1142:25: note: declared here1519 1142 | ObjectNameResolver* global_object_name_resolver = nullptr;1520 | ^~~~~~~~~~~~~~~~~~~~~~~~~~~1521../../deps/v8/include/v8-profiler.h:1128:27: warning: 'v8::HeapProfiler::HeapSnapshotOptions::global_object_name_resolver' is deprecated: Use context_name_resolver callback instead. [-Wdeprecated-declarations]1522 1128 | HeapSnapshotOptions() {}1523 | ^1524../../deps/v8/include/v8-profiler.h:1142:25: note: declared here1525 1142 | ObjectNameResolver* global_object_name_resolver = nullptr;1526 | ^~~~~~~~~~~~~~~~~~~~~~~~~~~1527[207/1871] CXX obj/src/node_base.node_postmortem_metadata.o1528In file included from ../../src/memory_tracker.h:6,1529 from ../../src/base_object.h:29,1530 from ../../src/base_object-inl.h:27,1531 from ../../src/node_postmortem_metadata.cc:1:1532../../deps/v8/include/v8-profiler.h: In constructor 'v8::HeapProfiler::HeapSnapshotOptions::HeapSnapshotOptions()':1533../../deps/v8/include/v8-profiler.h:1128:27: warning: 'v8::HeapProfiler::HeapSnapshotOptions::global_object_name_resolver' is deprecated: Use context_name_resolver callback instead. [-Wdeprecated-declarations]1534 1128 | HeapSnapshotOptions() {}1535 | ^1536../../deps/v8/include/v8-profiler.h:1142:25: note: declared here1537 1142 | ObjectNameResolver* global_object_name_resolver = nullptr;1538 | ^~~~~~~~~~~~~~~~~~~~~~~~~~~1539../../deps/v8/include/v8-profiler.h:1128:27: warning: 'v8::HeapProfiler::HeapSnapshotOptions::global_object_name_resolver' is deprecated: Use context_name_resolver callback instead. [-Wdeprecated-declarations]1540 1128 | HeapSnapshotOptions() {}1541 | ^1542../../deps/v8/include/v8-profiler.h:1142:25: note: declared here1543 1142 | ObjectNameResolver* global_object_name_resolver = nullptr;1544 | ^~~~~~~~~~~~~~~~~~~~~~~~~~~1545[208/1871] CXX obj/src/node_base.node_process_object.o1546In file included from ../../src/memory_tracker.h:6,1547 from ../../src/aliased_buffer.h:7,1548 from ../../src/aliased_buffer-inl.h:6,1549 from ../../src/env-inl.h:27,1550 from ../../src/node_process_object.cc:1:1551../../deps/v8/include/v8-profiler.h: In constructor 'v8::HeapProfiler::HeapSnapshotOptions::HeapSnapshotOptions()':1552../../deps/v8/include/v8-profiler.h:1128:27: warning: 'v8::HeapProfiler::HeapSnapshotOptions::global_object_name_resolver' is deprecated: Use context_name_resolver callback instead. [-Wdeprecated-declarations]1553 1128 | HeapSnapshotOptions() {}1554 | ^1555../../deps/v8/include/v8-profiler.h:1142:25: note: declared here1556 1142 | ObjectNameResolver* global_object_name_resolver = nullptr;1557 | ^~~~~~~~~~~~~~~~~~~~~~~~~~~1558../../deps/v8/include/v8-profiler.h:1128:27: warning: 'v8::HeapProfiler::HeapSnapshotOptions::global_object_name_resolver' is deprecated: Use context_name_resolver callback instead. [-Wdeprecated-declarations]1559 1128 | HeapSnapshotOptions() {}1560 | ^1561../../deps/v8/include/v8-profiler.h:1142:25: note: declared here1562 1142 | ObjectNameResolver* global_object_name_resolver = nullptr;1563 | ^~~~~~~~~~~~~~~~~~~~~~~~~~~1564[209/1871] CXX obj/src/node_base.node_platform.o1565In file included from ../../src/util.h:29,1566 from ../../src/node_mutex.h:6,1567 from ../../src/node_platform.h:15,1568 from ../../src/node_platform.cc:1:1569../../deps/v8/include/v8-profiler.h: In constructor 'v8::HeapProfiler::HeapSnapshotOptions::HeapSnapshotOptions()':1570../../deps/v8/include/v8-profiler.h:1128:27: warning: 'v8::HeapProfiler::HeapSnapshotOptions::global_object_name_resolver' is deprecated: Use context_name_resolver callback instead. [-Wdeprecated-declarations]1571 1128 | HeapSnapshotOptions() {}1572 | ^1573../../deps/v8/include/v8-profiler.h:1142:25: note: declared here1574 1142 | ObjectNameResolver* global_object_name_resolver = nullptr;1575 | ^~~~~~~~~~~~~~~~~~~~~~~~~~~1576../../deps/v8/include/v8-profiler.h:1128:27: warning: 'v8::HeapProfiler::HeapSnapshotOptions::global_object_name_resolver' is deprecated: Use context_name_resolver callback instead. [-Wdeprecated-declarations]1577 1128 | HeapSnapshotOptions() {}1578 | ^1579../../deps/v8/include/v8-profiler.h:1142:25: note: declared here1580 1142 | ObjectNameResolver* global_object_name_resolver = nullptr;1581 | ^~~~~~~~~~~~~~~~~~~~~~~~~~~1582[210/1871] CXX obj/src/node_base.node_report_utils.o1583In file included from ../../src/memory_tracker.h:6,1584 from ../../src/aliased_buffer.h:7,1585 from ../../src/env.h:27,1586 from ../../src/node_internals.h:27,1587 from ../../src/node_report_utils.cc:2:1588../../deps/v8/include/v8-profiler.h: In constructor 'v8::HeapProfiler::HeapSnapshotOptions::HeapSnapshotOptions()':1589../../deps/v8/include/v8-profiler.h:1128:27: warning: 'v8::HeapProfiler::HeapSnapshotOptions::global_object_name_resolver' is deprecated: Use context_name_resolver callback instead. [-Wdeprecated-declarations]1590 1128 | HeapSnapshotOptions() {}1591 | ^1592../../deps/v8/include/v8-profiler.h:1142:25: note: declared here1593 1142 | ObjectNameResolver* global_object_name_resolver = nullptr;1594 | ^~~~~~~~~~~~~~~~~~~~~~~~~~~1595../../deps/v8/include/v8-profiler.h:1128:27: warning: 'v8::HeapProfiler::HeapSnapshotOptions::global_object_name_resolver' is deprecated: Use context_name_resolver callback instead. [-Wdeprecated-declarations]1596 1128 | HeapSnapshotOptions() {}1597 | ^1598../../deps/v8/include/v8-profiler.h:1142:25: note: declared here1599 1142 | ObjectNameResolver* global_object_name_resolver = nullptr;1600 | ^~~~~~~~~~~~~~~~~~~~~~~~~~~1601[211/1871] CXX obj/src/node_base.node_locks.o1602In file included from ../../src/memory_tracker.h:6,1603 from ../../src/base_object.h:29,1604 from ../../src/node_locks.h:11,1605 from ../../src/node_locks.cc:1:1606../../deps/v8/include/v8-profiler.h: In constructor 'v8::HeapProfiler::HeapSnapshotOptions::HeapSnapshotOptions()':1607../../deps/v8/include/v8-profiler.h:1128:27: warning: 'v8::HeapProfiler::HeapSnapshotOptions::global_object_name_resolver' is deprecated: Use context_name_resolver callback instead. [-Wdeprecated-declarations]1608 1128 | HeapSnapshotOptions() {}1609 | ^1610../../deps/v8/include/v8-profiler.h:1142:25: note: declared here1611 1142 | ObjectNameResolver* global_object_name_resolver = nullptr;1612 | ^~~~~~~~~~~~~~~~~~~~~~~~~~~1613../../deps/v8/include/v8-profiler.h:1128:27: warning: 'v8::HeapProfiler::HeapSnapshotOptions::global_object_name_resolver' is deprecated: Use context_name_resolver callback instead. [-Wdeprecated-declarations]1614 1128 | HeapSnapshotOptions() {}1615 | ^1616../../deps/v8/include/v8-profiler.h:1142:25: note: declared here1617 1142 | ObjectNameResolver* global_object_name_resolver = nullptr;1618 | ^~~~~~~~~~~~~~~~~~~~~~~~~~~1619[212/1871] CXX obj/src/node_base.node_report_module.o1620In file included from ../../src/memory_tracker.h:6,1621 from ../../src/aliased_buffer.h:7,1622 from ../../src/env.h:27,1623 from ../../src/node_report_module.cc:1:1624../../deps/v8/include/v8-profiler.h: In constructor 'v8::HeapProfiler::HeapSnapshotOptions::HeapSnapshotOptions()':1625../../deps/v8/include/v8-profiler.h:1128:27: warning: 'v8::HeapProfiler::HeapSnapshotOptions::global_object_name_resolver' is deprecated: Use context_name_resolver callback instead. [-Wdeprecated-declarations]1626 1128 | HeapSnapshotOptions() {}1627 | ^1628../../deps/v8/include/v8-profiler.h:1142:25: note: declared here1629 1142 | ObjectNameResolver* global_object_name_resolver = nullptr;1630 | ^~~~~~~~~~~~~~~~~~~~~~~~~~~1631../../deps/v8/include/v8-profiler.h:1128:27: warning: 'v8::HeapProfiler::HeapSnapshotOptions::global_object_name_resolver' is deprecated: Use context_name_resolver callback instead. [-Wdeprecated-declarations]1632 1128 | HeapSnapshotOptions() {}1633 | ^1634../../deps/v8/include/v8-profiler.h:1142:25: note: declared here1635 1142 | ObjectNameResolver* global_object_name_resolver = nullptr;1636 | ^~~~~~~~~~~~~~~~~~~~~~~~~~~1637[213/1871] CXX obj/src/node_base.node_process_events.o1638In file included from ../../src/memory_tracker.h:6,1639 from ../../src/aliased_buffer.h:7,1640 from ../../src/aliased_buffer-inl.h:6,1641 from ../../src/env-inl.h:27,1642 from ../../src/node_process_events.cc:3:1643../../deps/v8/include/v8-profiler.h: In constructor 'v8::HeapProfiler::HeapSnapshotOptions::HeapSnapshotOptions()':1644../../deps/v8/include/v8-profiler.h:1128:27: warning: 'v8::HeapProfiler::HeapSnapshotOptions::global_object_name_resolver' is deprecated: Use context_name_resolver callback instead. [-Wdeprecated-declarations]1645 1128 | HeapSnapshotOptions() {}1646 | ^1647../../deps/v8/include/v8-profiler.h:1142:25: note: declared here1648 1142 | ObjectNameResolver* global_object_name_resolver = nullptr;1649 | ^~~~~~~~~~~~~~~~~~~~~~~~~~~1650../../deps/v8/include/v8-profiler.h:1128:27: warning: 'v8::HeapProfiler::HeapSnapshotOptions::global_object_name_resolver' is deprecated: Use context_name_resolver callback instead. [-Wdeprecated-declarations]1651 1128 | HeapSnapshotOptions() {}1652 | ^1653../../deps/v8/include/v8-profiler.h:1142:25: note: declared here1654 1142 | ObjectNameResolver* global_object_name_resolver = nullptr;1655 | ^~~~~~~~~~~~~~~~~~~~~~~~~~~1656[214/1871] CXX obj/src/node_base.node_serdes.o1657In file included from ../../src/memory_tracker.h:6,1658 from ../../src/base_object.h:29,1659 from ../../src/base_object-inl.h:27,1660 from ../../src/node_serdes.cc:1:1661../../deps/v8/include/v8-profiler.h: In constructor 'v8::HeapProfiler::HeapSnapshotOptions::HeapSnapshotOptions()':1662../../deps/v8/include/v8-profiler.h:1128:27: warning: 'v8::HeapProfiler::HeapSnapshotOptions::global_object_name_resolver' is deprecated: Use context_name_resolver callback instead. [-Wdeprecated-declarations]1663 1128 | HeapSnapshotOptions() {}1664 | ^1665../../deps/v8/include/v8-profiler.h:1142:25: note: declared here1666 1142 | ObjectNameResolver* global_object_name_resolver = nullptr;1667 | ^~~~~~~~~~~~~~~~~~~~~~~~~~~1668../../deps/v8/include/v8-profiler.h:1128:27: warning: 'v8::HeapProfiler::HeapSnapshotOptions::global_object_name_resolver' is deprecated: Use context_name_resolver callback instead. [-Wdeprecated-declarations]1669 1128 | HeapSnapshotOptions() {}1670 | ^1671../../deps/v8/include/v8-profiler.h:1142:25: note: declared here1672 1142 | ObjectNameResolver* global_object_name_resolver = nullptr;1673 | ^~~~~~~~~~~~~~~~~~~~~~~~~~~1674[215/1871] CXX obj/src/node_base.node_process_methods.o1675In file included from ../../src/memory_tracker.h:6,1676 from ../../src/base_object.h:29,1677 from ../../src/async_wrap.h:27,1678 from ../../src/async_wrap-inl.h:27,1679 from ../../src/node_process_methods.cc:1:1680../../deps/v8/include/v8-profiler.h: In constructor 'v8::HeapProfiler::HeapSnapshotOptions::HeapSnapshotOptions()':1681../../deps/v8/include/v8-profiler.h:1128:27: warning: 'v8::HeapProfiler::HeapSnapshotOptions::global_object_name_resolver' is deprecated: Use context_name_resolver callback instead. [-Wdeprecated-declarations]1682 1128 | HeapSnapshotOptions() {}1683 | ^1684../../deps/v8/include/v8-profiler.h:1142:25: note: declared here1685 1142 | ObjectNameResolver* global_object_name_resolver = nullptr;1686 | ^~~~~~~~~~~~~~~~~~~~~~~~~~~1687../../deps/v8/include/v8-profiler.h:1128:27: warning: 'v8::HeapProfiler::HeapSnapshotOptions::global_object_name_resolver' is deprecated: Use context_name_resolver callback instead. [-Wdeprecated-declarations]1688 1128 | HeapSnapshotOptions() {}1689 | ^1690../../deps/v8/include/v8-profiler.h:1142:25: note: declared here1691 1142 | ObjectNameResolver* global_object_name_resolver = nullptr;1692 | ^~~~~~~~~~~~~~~~~~~~~~~~~~~1693[216/1871] CXX obj/src/node_base.node_symbols.o1694In file included from ../../src/memory_tracker.h:6,1695 from ../../src/aliased_buffer.h:7,1696 from ../../src/aliased_buffer-inl.h:6,1697 from ../../src/env-inl.h:27,1698 from ../../src/node_symbols.cc:1:1699../../deps/v8/include/v8-profiler.h: In constructor 'v8::HeapProfiler::HeapSnapshotOptions::HeapSnapshotOptions()':1700../../deps/v8/include/v8-profiler.h:1128:27: warning: 'v8::HeapProfiler::HeapSnapshotOptions::global_object_name_resolver' is deprecated: Use context_name_resolver callback instead. [-Wdeprecated-declarations]1701 1128 | HeapSnapshotOptions() {}1702 | ^1703../../deps/v8/include/v8-profiler.h:1142:25: note: declared here1704 1142 | ObjectNameResolver* global_object_name_resolver = nullptr;1705 | ^~~~~~~~~~~~~~~~~~~~~~~~~~~1706../../deps/v8/include/v8-profiler.h:1128:27: warning: 'v8::HeapProfiler::HeapSnapshotOptions::global_object_name_resolver' is deprecated: Use context_name_resolver callback instead. [-Wdeprecated-declarations]1707 1128 | HeapSnapshotOptions() {}1708 | ^1709../../deps/v8/include/v8-profiler.h:1142:25: note: declared here1710 1142 | ObjectNameResolver* global_object_name_resolver = nullptr;1711 | ^~~~~~~~~~~~~~~~~~~~~~~~~~~1712[217/1871] CXX obj/src/node_base.node_report.o1713In file included from ../../src/util.h:29,1714 from ../../src/node_report.h:9,1715 from ../../src/node_report.cc:1:1716../../deps/v8/include/v8-profiler.h: In constructor 'v8::HeapProfiler::HeapSnapshotOptions::HeapSnapshotOptions()':1717../../deps/v8/include/v8-profiler.h:1128:27: warning: 'v8::HeapProfiler::HeapSnapshotOptions::global_object_name_resolver' is deprecated: Use context_name_resolver callback instead. [-Wdeprecated-declarations]1718 1128 | HeapSnapshotOptions() {}1719 | ^1720../../deps/v8/include/v8-profiler.h:1142:25: note: declared here1721 1142 | ObjectNameResolver* global_object_name_resolver = nullptr;1722 | ^~~~~~~~~~~~~~~~~~~~~~~~~~~1723../../deps/v8/include/v8-profiler.h:1128:27: warning: 'v8::HeapProfiler::HeapSnapshotOptions::global_object_name_resolver' is deprecated: Use context_name_resolver callback instead. [-Wdeprecated-declarations]1724 1128 | HeapSnapshotOptions() {}1725 | ^1726../../deps/v8/include/v8-profiler.h:1142:25: note: declared here1727 1142 | ObjectNameResolver* global_object_name_resolver = nullptr;1728 | ^~~~~~~~~~~~~~~~~~~~~~~~~~~1729[218/1871] CXX obj/src/node_base.node_stat_watcher.o1730In file included from ../../src/memory_tracker.h:6,1731 from ../../src/base_object.h:29,1732 from ../../src/async_wrap.h:27,1733 from ../../src/handle_wrap.h:27,1734 from ../../src/node_stat_watcher.h:28,1735 from ../../src/node_stat_watcher.cc:22:1736../../deps/v8/include/v8-profiler.h: In constructor 'v8::HeapProfiler::HeapSnapshotOptions::HeapSnapshotOptions()':1737../../deps/v8/include/v8-profiler.h:1128:27: warning: 'v8::HeapProfiler::HeapSnapshotOptions::global_object_name_resolver' is deprecated: Use context_name_resolver callback instead. [-Wdeprecated-declarations]1738 1128 | HeapSnapshotOptions() {}1739 | ^1740../../deps/v8/include/v8-profiler.h:1142:25: note: declared here1741 1142 | ObjectNameResolver* global_object_name_resolver = nullptr;1742 | ^~~~~~~~~~~~~~~~~~~~~~~~~~~1743../../deps/v8/include/v8-profiler.h:1128:27: warning: 'v8::HeapProfiler::HeapSnapshotOptions::global_object_name_resolver' is deprecated: Use context_name_resolver callback instead. [-Wdeprecated-declarations]1744 1128 | HeapSnapshotOptions() {}1745 | ^1746../../deps/v8/include/v8-profiler.h:1142:25: note: declared here1747 1142 | ObjectNameResolver* global_object_name_resolver = nullptr;1748 | ^~~~~~~~~~~~~~~~~~~~~~~~~~~1749[219/1871] CXX obj/src/node_base.node_trace_events.o1750In file included from ../../src/memory_tracker.h:6,1751 from ../../src/base_object.h:29,1752 from ../../src/base_object-inl.h:27,1753 from ../../src/node_trace_events.cc:1:1754../../deps/v8/include/v8-profiler.h: In constructor 'v8::HeapProfiler::HeapSnapshotOptions::HeapSnapshotOptions()':1755../../deps/v8/include/v8-profiler.h:1128:27: warning: 'v8::HeapProfiler::HeapSnapshotOptions::global_object_name_resolver' is deprecated: Use context_name_resolver callback instead. [-Wdeprecated-declarations]1756 1128 | HeapSnapshotOptions() {}1757 | ^1758../../deps/v8/include/v8-profiler.h:1142:25: note: declared here1759 1142 | ObjectNameResolver* global_object_name_resolver = nullptr;1760 | ^~~~~~~~~~~~~~~~~~~~~~~~~~~1761../../deps/v8/include/v8-profiler.h:1128:27: warning: 'v8::HeapProfiler::HeapSnapshotOptions::global_object_name_resolver' is deprecated: Use context_name_resolver callback instead. [-Wdeprecated-declarations]1762 1128 | HeapSnapshotOptions() {}1763 | ^1764../../deps/v8/include/v8-profiler.h:1142:25: note: declared here1765 1142 | ObjectNameResolver* global_object_name_resolver = nullptr;1766 | ^~~~~~~~~~~~~~~~~~~~~~~~~~~1767[220/1871] CXX obj/src/node_base.node_modules.o1768In file included from ../../src/memory_tracker.h:6,1769 from ../../src/aliased_buffer.h:7,1770 from ../../src/node_snapshotable.h:7,1771 from ../../src/node_modules.h:7,1772 from ../../src/node_modules.cc:1:1773../../deps/v8/include/v8-profiler.h: In constructor 'v8::HeapProfiler::HeapSnapshotOptions::HeapSnapshotOptions()':1774../../deps/v8/include/v8-profiler.h:1128:27: warning: 'v8::HeapProfiler::HeapSnapshotOptions::global_object_name_resolver' is deprecated: Use context_name_resolver callback instead. [-Wdeprecated-declarations]1775 1128 | HeapSnapshotOptions() {}1776 | ^1777../../deps/v8/include/v8-profiler.h:1142:25: note: declared here1778 1142 | ObjectNameResolver* global_object_name_resolver = nullptr;1779 | ^~~~~~~~~~~~~~~~~~~~~~~~~~~1780../../deps/v8/include/v8-profiler.h:1128:27: warning: 'v8::HeapProfiler::HeapSnapshotOptions::global_object_name_resolver' is deprecated: Use context_name_resolver callback instead. [-Wdeprecated-declarations]1781 1128 | HeapSnapshotOptions() {}1782 | ^1783../../deps/v8/include/v8-profiler.h:1142:25: note: declared here1784 1142 | ObjectNameResolver* global_object_name_resolver = nullptr;1785 | ^~~~~~~~~~~~~~~~~~~~~~~~~~~1786[221/1871] CXX obj/src/node_base.node_task_queue.o1787In file included from ../../src/memory_tracker.h:6,1788 from ../../src/base_object.h:29,1789 from ../../src/async_wrap.h:27,1790 from ../../src/node_task_queue.cc:1:1791../../deps/v8/include/v8-profiler.h: In constructor 'v8::HeapProfiler::HeapSnapshotOptions::HeapSnapshotOptions()':1792../../deps/v8/include/v8-profiler.h:1128:27: warning: 'v8::HeapProfiler::HeapSnapshotOptions::global_object_name_resolver' is deprecated: Use context_name_resolver callback instead. [-Wdeprecated-declarations]1793 1128 | HeapSnapshotOptions() {}1794 | ^1795../../deps/v8/include/v8-profiler.h:1142:25: note: declared here1796 1142 | ObjectNameResolver* global_object_name_resolver = nullptr;1797 | ^~~~~~~~~~~~~~~~~~~~~~~~~~~1798../../deps/v8/include/v8-profiler.h:1128:27: warning: 'v8::HeapProfiler::HeapSnapshotOptions::global_object_name_resolver' is deprecated: Use context_name_resolver callback instead. [-Wdeprecated-declarations]1799 1128 | HeapSnapshotOptions() {}1800 | ^1801../../deps/v8/include/v8-profiler.h:1142:25: note: declared here1802 1142 | ObjectNameResolver* global_object_name_resolver = nullptr;1803 | ^~~~~~~~~~~~~~~~~~~~~~~~~~~1804[222/1871] CXX obj/src/node_base.node_shadow_realm.o1805In file included from ../../src/memory_tracker.h:6,1806 from ../../src/cleanup_queue.h:11,1807 from ../../src/node_realm.h:8,1808 from ../../src/node_shadow_realm.h:6,1809 from ../../src/node_shadow_realm.cc:1:1810../../deps/v8/include/v8-profiler.h: In constructor 'v8::HeapProfiler::HeapSnapshotOptions::HeapSnapshotOptions()':1811../../deps/v8/include/v8-profiler.h:1128:27: warning: 'v8::HeapProfiler::HeapSnapshotOptions::global_object_name_resolver' is deprecated: Use context_name_resolver callback instead. [-Wdeprecated-declarations]1812 1128 | HeapSnapshotOptions() {}1813 | ^1814../../deps/v8/include/v8-profiler.h:1142:25: note: declared here1815 1142 | ObjectNameResolver* global_object_name_resolver = nullptr;1816 | ^~~~~~~~~~~~~~~~~~~~~~~~~~~1817../../deps/v8/include/v8-profiler.h:1128:27: warning: 'v8::HeapProfiler::HeapSnapshotOptions::global_object_name_resolver' is deprecated: Use context_name_resolver callback instead. [-Wdeprecated-declarations]1818 1128 | HeapSnapshotOptions() {}1819 | ^1820../../deps/v8/include/v8-profiler.h:1142:25: note: declared here1821 1142 | ObjectNameResolver* global_object_name_resolver = nullptr;1822 | ^~~~~~~~~~~~~~~~~~~~~~~~~~~1823[223/1871] CXX obj/src/node_base.node_types.o1824In file included from ../../src/memory_tracker.h:6,1825 from ../../src/aliased_buffer.h:7,1826 from ../../src/aliased_buffer-inl.h:6,1827 from ../../src/env-inl.h:27,1828 from ../../src/node_types.cc:1:1829../../deps/v8/include/v8-profiler.h: In constructor 'v8::HeapProfiler::HeapSnapshotOptions::HeapSnapshotOptions()':1830../../deps/v8/include/v8-profiler.h:1128:27: warning: 'v8::HeapProfiler::HeapSnapshotOptions::global_object_name_resolver' is deprecated: Use context_name_resolver callback instead. [-Wdeprecated-declarations]1831 1128 | HeapSnapshotOptions() {}1832 | ^1833../../deps/v8/include/v8-profiler.h:1142:25: note: declared here1834 1142 | ObjectNameResolver* global_object_name_resolver = nullptr;1835 | ^~~~~~~~~~~~~~~~~~~~~~~~~~~1836../../deps/v8/include/v8-profiler.h:1128:27: warning: 'v8::HeapProfiler::HeapSnapshotOptions::global_object_name_resolver' is deprecated: Use context_name_resolver callback instead. [-Wdeprecated-declarations]1837 1128 | HeapSnapshotOptions() {}1838 | ^1839../../deps/v8/include/v8-profiler.h:1142:25: note: declared here1840 1142 | ObjectNameResolver* global_object_name_resolver = nullptr;1841 | ^~~~~~~~~~~~~~~~~~~~~~~~~~~1842[224/1871] CXX obj/src/node_base.node_realm.o1843In file included from ../../src/memory_tracker.h:6,1844 from ../../src/cleanup_queue.h:11,1845 from ../../src/node_realm.h:8,1846 from ../../src/node_realm.cc:1:1847../../deps/v8/include/v8-profiler.h: In constructor 'v8::HeapProfiler::HeapSnapshotOptions::HeapSnapshotOptions()':1848../../deps/v8/include/v8-profiler.h:1128:27: warning: 'v8::HeapProfiler::HeapSnapshotOptions::global_object_name_resolver' is deprecated: Use context_name_resolver callback instead. [-Wdeprecated-declarations]1849 1128 | HeapSnapshotOptions() {}1850 | ^1851../../deps/v8/include/v8-profiler.h:1142:25: note: declared here1852 1142 | ObjectNameResolver* global_object_name_resolver = nullptr;1853 | ^~~~~~~~~~~~~~~~~~~~~~~~~~~1854../../deps/v8/include/v8-profiler.h:1128:27: warning: 'v8::HeapProfiler::HeapSnapshotOptions::global_object_name_resolver' is deprecated: Use context_name_resolver callback instead. [-Wdeprecated-declarations]1855 1128 | HeapSnapshotOptions() {}1856 | ^1857../../deps/v8/include/v8-profiler.h:1142:25: note: declared here1858 1142 | ObjectNameResolver* global_object_name_resolver = nullptr;1859 | ^~~~~~~~~~~~~~~~~~~~~~~~~~~1860[225/1871] CXX obj/src/node_base.node_messaging.o1861In file included from ../../src/memory_tracker.h:6,1862 from ../../src/aliased_buffer.h:7,1863 from ../../src/env.h:27,1864 from ../../src/node_messaging.h:6,1865 from ../../src/node_messaging.cc:1:1866../../deps/v8/include/v8-profiler.h: In constructor 'v8::HeapProfiler::HeapSnapshotOptions::HeapSnapshotOptions()':1867../../deps/v8/include/v8-profiler.h:1128:27: warning: 'v8::HeapProfiler::HeapSnapshotOptions::global_object_name_resolver' is deprecated: Use context_name_resolver callback instead. [-Wdeprecated-declarations]1868 1128 | HeapSnapshotOptions() {}1869 | ^1870../../deps/v8/include/v8-profiler.h:1142:25: note: declared here1871 1142 | ObjectNameResolver* global_object_name_resolver = nullptr;1872 | ^~~~~~~~~~~~~~~~~~~~~~~~~~~1873../../deps/v8/include/v8-profiler.h:1128:27: warning: 'v8::HeapProfiler::HeapSnapshotOptions::global_object_name_resolver' is deprecated: Use context_name_resolver callback instead. [-Wdeprecated-declarations]1874 1128 | HeapSnapshotOptions() {}1875 | ^1876../../deps/v8/include/v8-profiler.h:1142:25: note: declared here1877 1142 | ObjectNameResolver* global_object_name_resolver = nullptr;1878 | ^~~~~~~~~~~~~~~~~~~~~~~~~~~1879[226/1871] CXX obj/src/tracing/node_base.trace_event_helper.o1880[227/1871] CXX obj/src/node_base.node_util.o1881In file included from ../../src/memory_tracker.h:6,1882 from ../../src/base_object.h:29,1883 from ../../src/base_object-inl.h:27,1884 from ../../src/node_util.cc:1:1885../../deps/v8/include/v8-profiler.h: In constructor 'v8::HeapProfiler::HeapSnapshotOptions::HeapSnapshotOptions()':1886../../deps/v8/include/v8-profiler.h:1128:27: warning: 'v8::HeapProfiler::HeapSnapshotOptions::global_object_name_resolver' is deprecated: Use context_name_resolver callback instead. [-Wdeprecated-declarations]1887 1128 | HeapSnapshotOptions() {}1888 | ^1889../../deps/v8/include/v8-profiler.h:1142:25: note: declared here1890 1142 | ObjectNameResolver* global_object_name_resolver = nullptr;1891 | ^~~~~~~~~~~~~~~~~~~~~~~~~~~1892../../deps/v8/include/v8-profiler.h:1128:27: warning: 'v8::HeapProfiler::HeapSnapshotOptions::global_object_name_resolver' is deprecated: Use context_name_resolver callback instead. [-Wdeprecated-declarations]1893 1128 | HeapSnapshotOptions() {}1894 | ^1895../../deps/v8/include/v8-profiler.h:1142:25: note: declared here1896 1142 | ObjectNameResolver* global_object_name_resolver = nullptr;1897 | ^~~~~~~~~~~~~~~~~~~~~~~~~~~1898[228/1871] CXX obj/src/tracing/node_base.agent.o1899In file included from ../../src/util.h:29,1900 from ../../src/node_mutex.h:6,1901 from ../../src/tracing/agent_legacy.h:14,1902 from ../../src/tracing/agent.cc:6:1903../../deps/v8/include/v8-profiler.h: In constructor 'v8::HeapProfiler::HeapSnapshotOptions::HeapSnapshotOptions()':1904../../deps/v8/include/v8-profiler.h:1128:27: warning: 'v8::HeapProfiler::HeapSnapshotOptions::global_object_name_resolver' is deprecated: Use context_name_resolver callback instead. [-Wdeprecated-declarations]1905 1128 | HeapSnapshotOptions() {}1906 | ^1907../../deps/v8/include/v8-profiler.h:1142:25: note: declared here1908 1142 | ObjectNameResolver* global_object_name_resolver = nullptr;1909 | ^~~~~~~~~~~~~~~~~~~~~~~~~~~1910../../deps/v8/include/v8-profiler.h:1128:27: warning: 'v8::HeapProfiler::HeapSnapshotOptions::global_object_name_resolver' is deprecated: Use context_name_resolver callback instead. [-Wdeprecated-declarations]1911 1128 | HeapSnapshotOptions() {}1912 | ^1913../../deps/v8/include/v8-profiler.h:1142:25: note: declared here1914 1142 | ObjectNameResolver* global_object_name_resolver = nullptr;1915 | ^~~~~~~~~~~~~~~~~~~~~~~~~~~1916[229/1871] CXX obj/src/node_base.node_sockaddr.o1917In file included from ../../src/memory_tracker.h:6,1918 from ../../src/base_object.h:29,1919 from ../../src/node_sockaddr.h:6,1920 from ../../src/node_sockaddr.cc:1:1921../../deps/v8/include/v8-profiler.h: In constructor 'v8::HeapProfiler::HeapSnapshotOptions::HeapSnapshotOptions()':1922../../deps/v8/include/v8-profiler.h:1128:27: warning: 'v8::HeapProfiler::HeapSnapshotOptions::global_object_name_resolver' is deprecated: Use context_name_resolver callback instead. [-Wdeprecated-declarations]1923 1128 | HeapSnapshotOptions() {}1924 | ^1925../../deps/v8/include/v8-profiler.h:1142:25: note: declared here1926 1142 | ObjectNameResolver* global_object_name_resolver = nullptr;1927 | ^~~~~~~~~~~~~~~~~~~~~~~~~~~1928../../deps/v8/include/v8-profiler.h:1128:27: warning: 'v8::HeapProfiler::HeapSnapshotOptions::global_object_name_resolver' is deprecated: Use context_name_resolver callback instead. [-Wdeprecated-declarations]1929 1128 | HeapSnapshotOptions() {}1930 | ^1931../../deps/v8/include/v8-profiler.h:1142:25: note: declared here1932 1142 | ObjectNameResolver* global_object_name_resolver = nullptr;1933 | ^~~~~~~~~~~~~~~~~~~~~~~~~~~1934[230/1871] CXX obj/src/ffi/platforms/node_base.loong64.o1935[231/1871] CXX obj/src/ffi/platforms/node_base.arm64.o1936[232/1871] CXX obj/deps/v8/src/torque/torque_base.torque-parser.o1937[233/1871] CXX obj/src/node_base.node_wasm_web_api.o1938In file included from ../../src/memory_tracker.h:6,1939 from ../../src/base_object.h:29,1940 from ../../src/base_object-inl.h:27,1941 from ../../src/node_wasm_web_api.h:6,1942 from ../../src/node_wasm_web_api.cc:1:1943../../deps/v8/include/v8-profiler.h: In constructor 'v8::HeapProfiler::HeapSnapshotOptions::HeapSnapshotOptions()':1944../../deps/v8/include/v8-profiler.h:1128:27: warning: 'v8::HeapProfiler::HeapSnapshotOptions::global_object_name_resolver' is deprecated: Use context_name_resolver callback instead. [-Wdeprecated-declarations]1945 1128 | HeapSnapshotOptions() {}1946 | ^1947../../deps/v8/include/v8-profiler.h:1142:25: note: declared here1948 1142 | ObjectNameResolver* global_object_name_resolver = nullptr;1949 | ^~~~~~~~~~~~~~~~~~~~~~~~~~~1950../../deps/v8/include/v8-profiler.h:1128:27: warning: 'v8::HeapProfiler::HeapSnapshotOptions::global_object_name_resolver' is deprecated: Use context_name_resolver callback instead. [-Wdeprecated-declarations]1951 1128 | HeapSnapshotOptions() {}1952 | ^1953../../deps/v8/include/v8-profiler.h:1142:25: note: declared here1954 1142 | ObjectNameResolver* global_object_name_resolver = nullptr;1955 | ^~~~~~~~~~~~~~~~~~~~~~~~~~~1956[234/1871] CXX obj/src/ffi/platforms/node_base.ppc64.o1957[235/1871] CXX obj/src/ffi/node_base.jit_memory.o1958[236/1871] CXX obj/src/node_base.node_v8.o1959In file included from ../../src/memory_tracker.h:6,1960 from ../../src/aliased_buffer.h:7,1961 from ../../src/node_v8.h:7,1962 from ../../src/node_v8.cc:22:1963../../deps/v8/include/v8-profiler.h: In constructor 'v8::HeapProfiler::HeapSnapshotOptions::HeapSnapshotOptions()':1964../../deps/v8/include/v8-profiler.h:1128:27: warning: 'v8::HeapProfiler::HeapSnapshotOptions::global_object_name_resolver' is deprecated: Use context_name_resolver callback instead. [-Wdeprecated-declarations]1965 1128 | HeapSnapshotOptions() {}1966 | ^1967../../deps/v8/include/v8-profiler.h:1142:25: note: declared here1968 1142 | ObjectNameResolver* global_object_name_resolver = nullptr;1969 | ^~~~~~~~~~~~~~~~~~~~~~~~~~~1970../../deps/v8/include/v8-profiler.h:1128:27: warning: 'v8::HeapProfiler::HeapSnapshotOptions::global_object_name_resolver' is deprecated: Use context_name_resolver callback instead. [-Wdeprecated-declarations]1971 1128 | HeapSnapshotOptions() {}1972 | ^1973../../deps/v8/include/v8-profiler.h:1142:25: note: declared here1974 1142 | ObjectNameResolver* global_object_name_resolver = nullptr;1975 | ^~~~~~~~~~~~~~~~~~~~~~~~~~~1976[237/1871] CXX obj/src/ffi/platforms/node_base.riscv64.o1977[238/1871] CXX obj/src/tracing/node_base.traced_value.o1978In file included from ../../src/util.h:29,1979 from ../../src/tracing/traced_value.cc:16:1980../../deps/v8/include/v8-profiler.h: In constructor 'v8::HeapProfiler::HeapSnapshotOptions::HeapSnapshotOptions()':1981../../deps/v8/include/v8-profiler.h:1128:27: warning: 'v8::HeapProfiler::HeapSnapshotOptions::global_object_name_resolver' is deprecated: Use context_name_resolver callback instead. [-Wdeprecated-declarations]1982 1128 | HeapSnapshotOptions() {}1983 | ^1984../../deps/v8/include/v8-profiler.h:1142:25: note: declared here1985 1142 | ObjectNameResolver* global_object_name_resolver = nullptr;1986 | ^~~~~~~~~~~~~~~~~~~~~~~~~~~1987../../deps/v8/include/v8-profiler.h:1128:27: warning: 'v8::HeapProfiler::HeapSnapshotOptions::global_object_name_resolver' is deprecated: Use context_name_resolver callback instead. [-Wdeprecated-declarations]1988 1128 | HeapSnapshotOptions() {}1989 | ^1990../../deps/v8/include/v8-profiler.h:1142:25: note: declared here1991 1142 | ObjectNameResolver* global_object_name_resolver = nullptr;1992 | ^~~~~~~~~~~~~~~~~~~~~~~~~~~1993[239/1871] CXX obj/deps/v8/third_party/simdutf/simdutf.simdutf.o1994[240/1871] AR obj/tools/v8_gypfiles/libsimdutf.a1995[241/1871] CXX obj/deps/v8/src/torque/torque_base.implementation-visitor.o1996[242/1871] CXX obj/src/ffi/platforms/node_base.s390x.o1997[243/1871] AR obj/tools/v8_gypfiles/libtorque_base.a1998[244/1871] STAMP obj/tools/v8_gypfiles/torque.actions_depends.stamp1999[245/1871] CXX obj/src/node_base.node_url.o2000In file included from ../../src/memory_tracker.h:6,loading 24,277 hidden lines…
26278ok 5022 es-module/test-esm-type-field-errors-226279 ---26280 duration_ms: 169.7360026281 ...26282ok 5023 es-module/test-esm-undefined-cjs-global-like-variables26283 ---26284 duration_ms: 170.5870026285 ...26286ok 5024 es-module/test-esm-loader-thenable26287 ---26288 duration_ms: 609.2270026289 ...26290ok 5025 es-module/test-esm-symlink26291 ---26292 duration_ms: 263.5490026293 ...26294ok 5026 es-module/test-esm-symlink-type26295 ---26296 duration_ms: 262.9700026297 ...26298ok 5027 es-module/test-esm-symlink-main26299 ---26300 duration_ms: 264.9490026301 ...26302ok 5028 es-module/test-esm-syntax-error26303 ---26304 duration_ms: 271.1560026305 ...26306ok 5029 parallel/test-v8-collect-gc-profile26307 ---26308 duration_ms: 5307.7200026309 ...26310ok 5030 parallel/test-v8-collect-gc-profile-in-worker26311 ---26312 duration_ms: 5307.1820026313 ...26314ok 5031 es-module/test-esm-virtual-json26315 ---26316 duration_ms: 215.2850026317 ...26318ok 5032 es-module/test-esm-preserve-symlinks-main26319 ---26320 duration_ms: 508.7890026321 ...26322ok 5033 es-module/test-esm-wasm-globals-all-types26323 ---26324 duration_ms: 263.3420026325 ...26326ok 5034 es-module/test-esm-wasm-js-string-builtins26327 ---26328 duration_ms: 262.9480026329 ...26330ok 5035 es-module/test-esm-wasm-escape-import-names26331 ---26332 duration_ms: 266.5850026333 ...26334ok 5036 es-module/test-esm-package-map-paths26335 ---26336 duration_ms: 608.3040026337 ...26338ok 5037 es-module/test-esm-type-field-errors26339 ---26340 duration_ms: 326.9710026341 ...26342ok 5038 es-module/test-esm-wasm-load-exports26343 ---26344 duration_ms: 263.0840026345 ...26346ok 5039 es-module/test-esm-wasm-module-instances-warning26347 ---26348 duration_ms: 266.3300026349 ...26350ok 5040 es-module/test-esm-wasm-no-code-injection26351 ---26352 duration_ms: 266.7760026353 ...26354ok 5041 es-module/test-esm-wasm-reject-wasm-import-names26355 ---26356 duration_ms: 263.9930026357 ...26358ok 5042 es-module/test-esm-wasm-non-identifier-exports26359 ---26360 duration_ms: 266.6030026361 ...26362ok 5043 es-module/test-esm-import-meta-main-eval26363 ---26364 duration_ms: 1008.7990026365 ...26366ok 5044 es-module/test-esm-wasm-reject-wasm-js-export-names26367 ---26368 duration_ms: 270.7210026369 ...26370ok 5045 es-module/test-esm-tla26371 ---26372 duration_ms: 409.5380026373 ...26374ok 5046 es-module/test-esm-windows26375 ---26376 duration_ms: 168.2960026377 ...26378ok 5047 es-module/test-import-module-retry-require-errored26379 ---26380 duration_ms: 135.3100026381 ...26382ok 5048 es-module/test-esm-wasm-reject-wasm-js-import-module26383 ---26384 duration_ms: 265.1440026385 ...26386ok 5049 es-module/test-import-cjs-jitless26387 ---26388 duration_ms: 168.7190026389 ...26390ok 5050 es-module/test-import-module-conditional-exports-module26391 ---26392 duration_ms: 168.5940026393 ...26394ok 5051 es-module/test-esm-wasm-reject-wasm-js-import-names26395 ---26396 duration_ms: 269.4520026397 ...26398ok 5052 es-module/test-esm-unknown-extension26399 ---26400 duration_ms: 408.3800026401 ...26402ok 5053 es-module/test-esm-wasm-reject-wasm-export-names26403 ---26404 duration_ms: 329.7630026405 ...26406ok 5054 es-module/test-esm-module-not-found-commonjs-hint26407 ---26408 duration_ms: 809.2700026409 ...26410ok 5055 es-module/test-esm-wasm-source-phase-dynamic26411 ---26412 duration_ms: 270.8160026413 ...26414ok 5056 es-module/test-esm-wasm-source-phase-identity26415 ---26416 duration_ms: 266.9760026417 ...26418ok 5057 es-module/test-esm-wasm-source-phase-no-execute26419 ---26420 duration_ms: 267.6420026421 ...26422ok 5058 es-module/test-esm-wasm-source-phase-no-execute-dynamic26423 ---26424 duration_ms: 263.0360026425 ...26426ok 5059 es-module/test-loaders-hidden-from-users26427 ---26428 duration_ms: 135.7940026429 ...26430ok 5060 es-module/test-esm-wasm-source-phase-not-defined-dynamic26431 ---26432 duration_ms: 264.7160026433 ...26434ok 5061 es-module/test-esm-wasm-source-phase-not-defined-static26435 ---26436 duration_ms: 262.0140026437 ...26438ok 5062 es-module/test-esm-wasm-source-phase-static26439 ---26440 duration_ms: 262.0380026441 ...26442ok 5063 es-module/test-esm-wasm-top-level-execution26443 ---26444 duration_ms: 261.0860026445 ...26446ok 5064 es-module/test-esm-wasm-vm-source-phase-dynamic26447 ---26448 duration_ms: 263.0340026449 ...26450ok 5065 es-module/test-esm-wasm-vm-source-phase-static26451 ---26452 duration_ms: 262.7610026453 ...26454ok 5066 es-module/test-loaders-unknown-builtin-module26455 ---26456 duration_ms: 169.3960026457 ...26458ok 5067 es-module/test-require-module26459 ---26460 duration_ms: 135.4150026461 ...26462ok 5068 es-module/test-require-module-cached-tla26463 ---26464 duration_ms: 135.6380026465 ...26466ok 5069 es-module/test-require-module-conditional-exports26467 ---26468 duration_ms: 136.4390026469 ...26470ok 5070 es-module/test-require-as-esm-interop26471 ---26472 duration_ms: 168.7090026473 ...26474ok 5071 es-module/test-esm-package-map-errors26475 ---26476 duration_ms: 810.0850026477 ...26478ok 5072 es-module/test-import-preload-require-cycle26479 ---26480 duration_ms: 212.2180026481 ...26482ok 5073 es-module/test-import-require-tla-twice26483 ---26484 duration_ms: 211.1520026485 ...26486ok 5074 es-module/test-esm-register-deprecation26487 ---26488 duration_ms: 707.8250026489 ...26490ok 5075 es-module/test-require-module-cycle-cjs-esm-esm26491 ---26492 duration_ms: 135.4720026493 ...26494ok 5076 es-module/test-require-module-conditional-exports-module26495 ---26496 duration_ms: 168.2940026497 ...26498ok 5077 es-module/test-require-module-default-extension26499 ---26500 duration_ms: 135.0720026501 ...26502ok 5078 es-module/test-esm-import-flag26503 ---26504 duration_ms: 1210.0780026505 ...26506ok 5079 es-module/test-require-module-dont-detect-cjs26507 ---26508 duration_ms: 136.0770026509 ...26510ok 5080 es-module/test-require-module-dynamic-import-126511 ---26512 duration_ms: 136.2840026513 ...26514ok 5081 es-module/test-require-module-dynamic-import-226515 ---26516 duration_ms: 136.8110026517 ...26518ok 5082 es-module/test-require-module-dynamic-import-426519 ---26520 duration_ms: 137.3610026521 ...26522ok 5083 es-module/test-require-module-dynamic-import-326523 ---26524 duration_ms: 138.5670026525 ...26526ok 5084 es-module/test-extensionless-esm-type-commonjs26527 ---26528 duration_ms: 328.3410026529 ...26530ok 5085 es-module/test-require-module-implicit26531 ---26532 duration_ms: 135.5860026533 ...26534ok 5086 es-module/test-require-module-defined-esmodule26535 ---26536 duration_ms: 168.5670026537 ...26538ok 5087 es-module/test-require-module-instantiated26539 ---26540 duration_ms: 134.9880026541 ...26542ok 5088 es-module/test-require-module-detect-entry-point26543 ---26544 duration_ms: 169.6630026545 ...26546ok 5089 es-module/test-require-module-error-catching26547 ---26548 duration_ms: 169.4800026549 ...26550ok 5090 es-module/test-require-module-retry-import-errored26551 ---26552 duration_ms: 136.4690026553 ...26554ok 5091 es-module/test-require-module-retry-import-errored-226555 ---26556 duration_ms: 136.9840026557 ...26558ok 5092 es-module/test-require-module-retry-import-evaluating26559 ---26560 duration_ms: 135.6860026561 ...26562ok 5093 es-module/test-require-module-tla-error-metadata26563 ---26564 duration_ms: 137.0720026565 ...26566ok 5094 es-module/test-require-module-detect-entry-point-aou26567 ---26568 duration_ms: 210.9630026569 ...26570ok 5095 es-module/test-require-module-tla-instantiation-error26571 ---26572 duration_ms: 135.2570026573 ...26574ok 5096 es-module/test-require-module-synchronous-rejection-handling26575 ---26576 duration_ms: 171.0800026577 ...26578ok 5097 es-module/test-require-module-tla-retry-import26579 ---26580 duration_ms: 137.6730026581 ...26582ok 5098 es-module/test-require-module-tla-nested26583 ---26584 duration_ms: 169.6450026585 ...26586ok 5099 es-module/test-require-module-tla-rejected26587 ---26588 duration_ms: 169.7620026589 ...26590ok 5100 es-module/test-require-module-tla-resolved26591 ---26592 duration_ms: 169.5250026593 ...26594ok 5101 es-module/test-require-module-tla-retry-require26595 ---26596 duration_ms: 137.1190026597 ...26598ok 5102 es-module/test-require-module-tla-retry-import-226599 ---26600 duration_ms: 169.3260026601 ...26602ok 5103 es-module/test-require-module-tla-unresolved26603 ---26604 duration_ms: 171.4320026605 ...26606ok 5104 es-module/test-require-module-twice26607 ---26608 duration_ms: 170.1850026609 ...26610ok 5105 es-module/test-require-module-with-detection26611 ---26612 duration_ms: 170.3620026613 ...26614ok 5106 es-module/test-esm-source-map26615 ---26616 duration_ms: 812.4210026617 ...26618ok 5107 es-module/test-vm-compile-function-lineoffset26619 ---26620 duration_ms: 137.5560026621 ...26622ok 5108 es-module/test-require-esm-from-imported-cjs26623 ---26624 duration_ms: 407.7650026625 ...26626ok 5109 es-module/test-require-module-tla-execution26627 ---26628 duration_ms: 263.5170026629 ...26630ok 5110 es-module/test-vm-main-context-default-loader26631 ---26632 duration_ms: 168.7750026633 ...26634ok 5111 es-module/test-vm-main-context-default-loader-eval26635 ---26636 duration_ms: 170.7590026637 ...26638ok 5112 es-module/test-require-module-cycle-esm-cjs-esm-esm26639 ---26640 duration_ms: 407.4850026641 ...26642ok 5113 es-module/test-vm-synthetic-module-leak26643 ---26644 duration_ms: 170.1720026645 ...26646ok 5114 es-module/test-vm-compile-function-leak26647 ---26648 duration_ms: 210.6440026649 ...26650ok 5115 es-module/test-wasm-simple26651 ---26652 duration_ms: 139.3240026653 ...26654ok 5116 sea/test-build-sea # skip Running the resultant binary fails with `/home/iojs/node-tmp/.tmp.2379/sea: error while loading shared libraries: libicui18n.so.71: cannot open shared object file: No such file or directory`.26655 ---26656 duration_ms: 137.4780026657 ...26658ok 5117 sea/test-build-sea-already-exists # skip Running the resultant binary fails with `/home/iojs/node-tmp/.tmp.2379/sea: error while loading shared libraries: libicui18n.so.71: cannot open shared object file: No such file or directory`.26659 ---26660 duration_ms: 136.2660026661 ...26662ok 5118 es-module/test-wasm-memory-out-of-bound26663 ---26664 duration_ms: 169.9480026665 ...26666ok 5119 es-module/test-require-module-tla-print-execution26667 ---26668 duration_ms: 327.5880026669 ...26670ok 5120 sea/test-build-sea-custom-argv0 # skip Running the resultant binary fails with `/home/iojs/node-tmp/.tmp.2379/sea: error while loading shared libraries: libicui18n.so.71: cannot open shared object file: No such file or directory`.26671 ---26672 duration_ms: 142.4450026673 ...26674ok 5121 sea/test-build-sea-config-not-found # skip Running the resultant binary fails with `/home/iojs/node-tmp/.tmp.2379/sea: error while loading shared libraries: libicui18n.so.71: cannot open shared object file: No such file or directory`.26675 ---26676 duration_ms: 170.9740026677 ...26678ok 5122 sea/test-build-sea-elf-segments # skip Running the resultant binary fails with `/home/iojs/node-tmp/.tmp.2379/sea: error while loading shared libraries: libicui18n.so.71: cannot open shared object file: No such file or directory`.26679 ---26680 duration_ms: 139.4800026681 ...26682ok 5123 es-module/test-vm-contextified-script-leak26683 ---26684 duration_ms: 262.7490026685 ...26686ok 5124 sea/test-build-sea-executable-field # skip Running the resultant binary fails with `/home/iojs/node-tmp/.tmp.2379/sea: error while loading shared libraries: libicui18n.so.71: cannot open shared object file: No such file or directory`.26687 ---26688 duration_ms: 139.4950026689 ...26690ok 5125 sea/test-build-sea-invalid-assets # skip Running the resultant binary fails with `/home/iojs/node-tmp/.tmp.2379/sea: error while loading shared libraries: libicui18n.so.71: cannot open shared object file: No such file or directory`.26691 ---26692 duration_ms: 138.8560026693 ...26694ok 5126 sea/test-build-sea-invalid-boolean-fields # skip Running the resultant binary fails with `/home/iojs/node-tmp/.tmp.2379/sea: error while loading shared libraries: libicui18n.so.71: cannot open shared object file: No such file or directory`.26695 ---26696 duration_ms: 137.8140026697 ...26698ok 5127 es-module/test-require-module-cycle-esm-cjs-esm26699 ---26700 duration_ms: 507.0980026701 ...26702ok 5128 sea/test-build-sea-invalid-json # skip Running the resultant binary fails with `/home/iojs/node-tmp/.tmp.2379/sea: error while loading shared libraries: libicui18n.so.71: cannot open shared object file: No such file or directory`.26703 ---26704 duration_ms: 135.7830026705 ...26706ok 5129 es-module/test-require-module-warning26707 ---26708 duration_ms: 329.7800026709 ...26710ok 5130 sea/test-build-sea-invalid-exec-argv # skip Running the resultant binary fails with `/home/iojs/node-tmp/.tmp.2379/sea: error while loading shared libraries: libicui18n.so.71: cannot open shared object file: No such file or directory`.26711 ---26712 duration_ms: 170.3300026713 ...26714ok 5131 es-module/test-require-module-cycle-esm-esm-cjs-esm-esm26715 ---26716 duration_ms: 508.0920026717 ...26718ok 5132 sea/test-build-sea-missing-main # skip Running the resultant binary fails with `/home/iojs/node-tmp/.tmp.2379/sea: error while loading shared libraries: libicui18n.so.71: cannot open shared object file: No such file or directory`.26719 ---26720 duration_ms: 135.8890026721 ...26722ok 5133 sea/test-build-sea-invalid-executable # skip Running the resultant binary fails with `/home/iojs/node-tmp/.tmp.2379/sea: error while loading shared libraries: libicui18n.so.71: cannot open shared object file: No such file or directory`.26723 ---26724 duration_ms: 168.8960026725 ...26726ok 5134 sea/test-build-sea-missing-output # skip Running the resultant binary fails with `/home/iojs/node-tmp/.tmp.2379/sea: error while loading shared libraries: libicui18n.so.71: cannot open shared object file: No such file or directory`.26727 ---26728 duration_ms: 137.3080026729 ...26730ok 5135 sea/test-single-executable-application # skip Running the resultant binary fails with `/home/iojs/node-tmp/.tmp.2379/sea: error while loading shared libraries: libicui18n.so.71: cannot open shared object file: No such file or directory`.26731 ---26732 duration_ms: 135.6270026733 ...26734ok 5136 es-module/test-require-module-errors26735 ---26736 duration_ms: 509.3550026737 ...26738ok 5137 es-module/test-require-module-feature-detect26739 ---26740 duration_ms: 508.2740026741 ...26742ok 5138 sea/test-single-executable-application-asset-keys # skip Running the resultant binary fails with `/home/iojs/node-tmp/.tmp.2379/sea: error while loading shared libraries: libicui18n.so.71: cannot open shared object file: No such file or directory`.26743 ---26744 duration_ms: 135.3960026745 ...26746ok 5139 es-module/test-esm-loader-programmatically26747 ---26748 duration_ms: 1411.0970026749 ...26750ok 5140 sea/test-single-executable-application-assets # skip Running the resultant binary fails with `/home/iojs/node-tmp/.tmp.2379/sea: error while loading shared libraries: libicui18n.so.71: cannot open shared object file: No such file or directory`.26751 ---26752 duration_ms: 136.3620026753 ...26754ok 5141 sea/test-build-sea-vfs-incompatible-options # skip Running the resultant binary fails with `/home/iojs/node-tmp/.tmp.2379/sea: error while loading shared libraries: libicui18n.so.71: cannot open shared object file: No such file or directory`.26755 ---26756 duration_ms: 168.9410026757 ...26758ok 5142 sea/test-single-executable-application-asset-keys-empty # skip Running the resultant binary fails with `/home/iojs/node-tmp/.tmp.2379/sea: error while loading shared libraries: libicui18n.so.71: cannot open shared object file: No such file or directory`.26759 ---26760 duration_ms: 169.9950026761 ...26762ok 5143 sea/test-single-executable-application-assets-invalid-type26763 ---26764 duration_ms: 168.9150026765 ...26766ok 5144 sea/test-single-executable-application-disable-experimental-sea-warning # skip Running the resultant binary fails with `/home/iojs/node-tmp/.tmp.2379/sea: error while loading shared libraries: libicui18n.so.71: cannot open shared object file: No such file or directory`.26767 ---26768 duration_ms: 134.9730026769 ...26770ok 5145 es-module/test-require-module-cycle-esm-esm-cjs-esm26771 ---26772 duration_ms: 607.6620026773 ...26774ok 5146 sea/test-single-executable-application-assets-raw # skip Running the resultant binary fails with `/home/iojs/node-tmp/.tmp.2379/sea: error while loading shared libraries: libicui18n.so.71: cannot open shared object file: No such file or directory`.26775 ---26776 duration_ms: 168.8930026777 ...26778ok 5147 sea/test-single-executable-application-esm # skip Running the resultant binary fails with `/home/iojs/node-tmp/.tmp.2379/sea: error while loading shared libraries: libicui18n.so.71: cannot open shared object file: No such file or directory`.26779 ---26780 duration_ms: 136.6510026781 ...26782ok 5148 sea/test-single-executable-application-esm-code-cache # skip Running the resultant binary fails with `/home/iojs/node-tmp/.tmp.2379/sea: error while loading shared libraries: libicui18n.so.71: cannot open shared object file: No such file or directory`.26783 ---26784 duration_ms: 137.7450026785 ...26786ok 5149 sea/test-single-executable-application-exec-argv # skip Running the resultant binary fails with `/home/iojs/node-tmp/.tmp.2379/sea: error while loading shared libraries: libicui18n.so.71: cannot open shared object file: No such file or directory`.26787 ---26788 duration_ms: 136.4300026789 ...26790ok 5150 sea/test-single-executable-application-inspect # skip Running the resultant binary fails with `/home/iojs/node-tmp/.tmp.2379/sea: error while loading shared libraries: libicui18n.so.71: cannot open shared object file: No such file or directory`.26791 ---26792 duration_ms: 135.8410026793 ...26794ok 5151 sea/test-single-executable-application-exec-argv-extension-none # skip Running the resultant binary fails with `/home/iojs/node-tmp/.tmp.2379/sea: error while loading shared libraries: libicui18n.so.71: cannot open shared object file: No such file or directory`.26795 ---26796 duration_ms: 138.3750026797 ...26798ok 5152 sea/test-single-executable-application-empty # skip Running the resultant binary fails with `/home/iojs/node-tmp/.tmp.2379/sea: error while loading shared libraries: libicui18n.so.71: cannot open shared object file: No such file or directory`.26799 ---26800 duration_ms: 170.5900026801 ...26802ok 5153 sea/test-single-executable-application-assets-nonexistent-file26803 ---26804 duration_ms: 210.4210026805 ...26806ok 5154 sea/test-single-executable-application-exec-argv-empty # skip Running the resultant binary fails with `/home/iojs/node-tmp/.tmp.2379/sea: error while loading shared libraries: libicui18n.so.71: cannot open shared object file: No such file or directory`.26807 ---26808 duration_ms: 168.7860026809 ...26810ok 5155 sea/test-single-executable-application-exec-argv-extension-cli # skip Running the resultant binary fails with `/home/iojs/node-tmp/.tmp.2379/sea: error while loading shared libraries: libicui18n.so.71: cannot open shared object file: No such file or directory`.26811 ---26812 duration_ms: 169.3690026813 ...26814ok 5156 sea/test-single-executable-application-inspect-in-sea-flags # skip Running the resultant binary fails with `/home/iojs/node-tmp/.tmp.2379/sea: error while loading shared libraries: libicui18n.so.71: cannot open shared object file: No such file or directory`.26815 ---26816 duration_ms: 136.0520026817 ...26818ok 5157 sea/test-single-executable-application-exec-argv-extension-env # skip Running the resultant binary fails with `/home/iojs/node-tmp/.tmp.2379/sea: error while loading shared libraries: libicui18n.so.71: cannot open shared object file: No such file or directory`.26819 ---26820 duration_ms: 169.3650026821 ...26822ok 5158 sea/test-single-executable-application-snapshot-and-code-cache # skip Running the resultant binary fails with `/home/iojs/node-tmp/.tmp.2379/sea: error while loading shared libraries: libicui18n.so.71: cannot open shared object file: No such file or directory`.26823 ---26824 duration_ms: 136.8210026825 ...26826ok 5159 sea/test-single-executable-application-snapshot # skip Running the resultant binary fails with `/home/iojs/node-tmp/.tmp.2379/sea: error while loading shared libraries: libicui18n.so.71: cannot open shared object file: No such file or directory`.26827 ---26828 duration_ms: 137.2050026829 ...26830ok 5160 es-module/test-require-module-transpiled26831 ---26832 duration_ms: 510.5170026833 ...26834ok 5161 sea/test-single-executable-application-vfs # skip Running the resultant binary fails with `/home/iojs/node-tmp/.tmp.2379/sea: error while loading shared libraries: libicui18n.so.71: cannot open shared object file: No such file or directory`.26835 ---26836 duration_ms: 137.3020026837 ...26838ok 5162 sea/test-single-executable-application-vfs-esm # skip Running the resultant binary fails with `/home/iojs/node-tmp/.tmp.2379/sea: error while loading shared libraries: libicui18n.so.71: cannot open shared object file: No such file or directory`.26839 ---26840 duration_ms: 136.5230026841 ...26842ok 5163 sea/test-single-executable-application-snapshot-worker # skip Running the resultant binary fails with `/home/iojs/node-tmp/.tmp.2379/sea: error while loading shared libraries: libicui18n.so.71: cannot open shared object file: No such file or directory`.26843 ---26844 duration_ms: 172.0120026845 ...26846ok 5164 es-module/test-require-module-tla-error-snapshot26847 ---26848 duration_ms: 610.5750026849 ...26850ok 5165 sea/test-single-executable-application-use-code-cache # skip Running the resultant binary fails with `/home/iojs/node-tmp/.tmp.2379/sea: error while loading shared libraries: libicui18n.so.71: cannot open shared object file: No such file or directory`.26851 ---26852 duration_ms: 171.4390026853 ...26854ok 5166 test-runner/test-output-arbitrary-output-colored # skip Forced colors not supported in this build26855 ---26856 duration_ms: 135.2600026857 ...26858ok 5167 es-module/test-vm-source-text-module-leak26859 ---26860 duration_ms: 509.1570026861 ...26862ok 5168 es-module/test-require-node-modules-warning26863 ---26864 duration_ms: 608.9430026865 ...26866ok 5169 test-runner/test-output-abort-hooks26867 ---26868 duration_ms: 328.4770026869 ...26870ok 5170 test-runner/test-output-abort-runs-after-hook26871 ---26872 duration_ms: 326.6510026873 ...26874ok 5171 test-runner/test-output-before-and-after-each-too-many-listeners26875 ---26876 duration_ms: 328.0570026877 ...26878ok 5172 test-runner/test-output-before-and-after-each-with-timeout-too-many-listeners26879 ---26880 duration_ms: 327.9640026881 ...26882ok 5173 sea/test-single-executable-blob-config26883 ---26884 duration_ms: 412.5390026885 ...26886ok 5174 test-runner/test-output-coverage-short-filename26887 ---26888 duration_ms: 331.6350026889 ...26890ok 5175 es-module/test-require-module-preload26891 ---26892 duration_ms: 908.6950026893 ...26894ok 5176 es-module/test-esm-tla-unfinished26895 ---26896 duration_ms: 1409.0770026897 ...26898ok 5177 test-runner/test-output-arbitrary-output26899 ---26900 duration_ms: 407.4690026901 ...26902ok 5178 test-runner/test-output-async-test-scheduling26903 ---26904 duration_ms: 409.0920026905 ...26906ok 5179 test-runner/test-output-coverage-failure26907 ---26908 duration_ms: 408.2380026909 ...26910ok 5180 es-module/test-loaders-workers-spawned26911 ---26912 duration_ms: 1109.0100026913 ...26914ok 5181 test-runner/test-output-coverage-width-10026915 ---26916 duration_ms: 411.0700026917 ...26918ok 5182 test-runner/test-output-coverage-width-15026919 ---26920 duration_ms: 408.4680026921 ...26922ok 5183 test-runner/test-output-coverage-width-100-uncovered-lines26923 ---26924 duration_ms: 413.0850026925 ...26926ok 5184 test-runner/test-output-coverage-width-150-uncovered-lines26927 ---26928 duration_ms: 408.3030026929 ...26930ok 5185 test-runner/test-output-coverage-width-4026931 ---26932 duration_ms: 408.3670026933 ...26934ok 5186 wasi/test-wasi-pthread26935 ---26936 duration_ms: 2615.2990026937 ...26938ok 5187 test-runner/test-output-coverage-width-8026939 ---26940 duration_ms: 409.7710026941 ...26942ok 5188 test-runner/test-output-describe-nested26943 ---26944 duration_ms: 333.7650026945 ...26946ok 5189 test-runner/test-output-coverage-width-80-uncovered-lines26947 ---26948 duration_ms: 409.4560026949 ...26950ok 5190 test-runner/test-output-coverage-width-80-color26951 ---26952 duration_ms: 411.2690026953 ...26954ok 5191 test-runner/test-output-coverage-width-80-uncovered-lines-color26955 ---26956 duration_ms: 408.8740026957 ...26958ok 5192 es-module/test-esm-loader-spawn-promisified26959 ---26960 duration_ms: 1911.6450026961 ...26962ok 5193 test-runner/test-output-coverage-width-infinity26963 ---26964 duration_ms: 407.7620026965 ...26966ok 5194 test-runner/test-output-coverage-with-mock26967 ---26968 duration_ms: 407.6580026969 ...26970ok 5195 test-runner/test-output-coverage-width-infinity-uncovered-lines26971 ---26972 duration_ms: 409.4730026973 ...26974ok 5196 test-runner/test-output-coverage-with-mock-cjs26975 ---26976 duration_ms: 407.9660026977 ...26978ok 5197 test-runner/test-output-default-output26979 ---26980 duration_ms: 409.0190026981 ...26982ok 5198 test-runner/test-output-dot-output-custom-columns26983 ---26984 duration_ms: 408.1900026985 ...26986ok 5199 test-runner/test-output-eval-spec26987 ---26988 duration_ms: 263.2270026989 ...26990ok 5200 test-runner/test-output-eval-tap26991 ---26992 duration_ms: 263.3740026993 ...26994ok 5201 test-runner/test-output-assertion-color-tty26995 ---26996 duration_ms: 612.5850026997 ...26998ok 5202 test-runner/test-output-eval-dot26999 ---27000 duration_ms: 326.5810027001 ...27002ok 5203 sea/test-single-executable-blob-config-errors27003 ---27004 duration_ms: 707.9770027005 ...27006ok 5204 test-runner/test-output-force-exit27007 ---27008 duration_ms: 263.3860027009 ...27010ok 5205 test-runner/test-output-global-after-should-fail-the-test27011 ---27012 duration_ms: 261.5060027013 ...27014ok 5206 test-runner/test-output-filtered-suite-delayed-build27015 ---27016 duration_ms: 326.7270027017 ...27018ok 5207 test-runner/test-output-filtered-suite-throws27019 ---27020 duration_ms: 326.9510027021 ...27022ok 5208 test-runner/test-output-filtered-suite-order27023 ---27024 duration_ms: 328.7580027025 ...27026ok 5209 test-runner/test-output-hooks-with-no-global-test27027 ---27028 duration_ms: 264.5230027029 ...27030ok 5210 test-runner/test-output-no-tests27031 ---27032 duration_ms: 262.8800027033 ...27034ok 5211 test-runner/test-output-non-tty-forced-color-output27035 ---27036 duration_ms: 263.1800027037 ...27038ok 5212 test-runner/test-output-global-hooks-with-no-tests27039 ---27040 duration_ms: 326.5510027041 ...27042ok 5213 test-runner/test-output-junit-classname-hierarchy27043 ---27044 duration_ms: 331.2810027045 ...27046ok 5214 test-runner/test-output-name-pattern27047 ---27048 duration_ms: 327.5690027049 ...27050ok 5215 test-runner/test-output-dot-reporter-coverage-threshold27051 ---27052 duration_ms: 509.2350027053 ...27054ok 5216 test-runner/test-output-name-pattern-with-only27055 ---27056 duration_ms: 329.2970027057 ...27058ok 5217 test-runner/test-output-spec-reporter-watch-restart27059 ---27060 duration_ms: 136.3590027061 ...27062ok 5218 test-runner/test-output-only-tests27063 ---27064 duration_ms: 327.5290027065 ...27066ok 5219 test-runner/test-output-junit-empty-diagnostic27067 ---27068 duration_ms: 407.7610027069 ...27070ok 5220 test-runner/test-output-skip-each-hooks27071 ---27072 duration_ms: 262.4900027073 ...27074ok 5221 test-runner/test-output-name-and-skip-patterns27075 ---27076 duration_ms: 409.2660027077 ...27078ok 5222 test-runner/test-output-source-mapped-locations27079 ---27080 duration_ms: 261.3960027081 ...27082ok 5223 test-runner/test-output-hooks27083 ---27084 duration_ms: 508.7270027085 ...27086ok 5224 test-runner/test-output-skip-pattern27087 ---27088 duration_ms: 326.9330027089 ...27090ok 5225 test-runner/test-output-suite-skip-hooks27091 ---27092 duration_ms: 261.6580027093 ...27094ok 5226 test-runner/test-output-randomize-output-cli-none27095 ---27096 duration_ms: 412.8350027097 ...27098ok 5227 test-runner/test-output-spec-reporter-successful27099 ---27100 duration_ms: 326.5490027101 ...27102ok 5228 test-runner/test-output-randomize-nested-scenarios-output-cli-none27103 ---27104 duration_ms: 507.3420027105 ...27106ok 5229 es-module/test-typescript-module27107 ---27108 duration_ms: 1409.8280027109 ...27110ok 5230 test-runner/test-output-tap-escape27111 ---27112 duration_ms: 327.6800027113 ...27114ok 5231 test-runner/test-output-hooks-spec-reporter27115 ---27116 duration_ms: 607.2360027117 ...27118ok 5232 test-runner/test-output-test-runner-plan27119 ---27120 duration_ms: 326.0980027121 ...27122ok 5233 test-runner/test-output-unfinished-suite-async-error27123 ---27124 duration_ms: 266.8710027125 ...27126ok 5234 es-module/test-esm-loader-chaining27127 ---27128 duration_ms: 2620.2450027129 ...27130ok 5235 test-runner/test-output-test-diagnostic-warning-without-test-only-flag27131 ---27132 duration_ms: 407.0740027133 ...27134ok 5236 test-runner/test-output-randomize-nested-scenarios-output-cli-process27135 ---27136 duration_ms: 607.2930027137 ...27138ok 5237 test-runner/test-run-watch-cwd-isolation-none27139 ---27140 duration_ms: 261.3410027141 ...27142ok 5238 test-runner/test-output-describe-it27143 ---27144 duration_ms: 1010.1420027145 ...27146ok 5239 test-runner/test-run-watch-cwd27147 ---27148 duration_ms: 325.7170027149 ...27150ok 5240 test-runner/test-run-watch-cwd-isolation-process27151 ---27152 duration_ms: 261.3570027153 ...27154ok 5241 test-runner/test-output-test-timeout-flag27155 ---27156 duration_ms: 407.0630027157 ...27158ok 5242 es-module/test-esm-detect-ambiguous27159 ---27160 duration_ms: 3010.8940027161 ...27162ok 5243 test-runner/test-run-watch-cwd-isolation-none-argv27163 ---27164 duration_ms: 326.1200027165 ...27166ok 5244 test-runner/test-output-typescript-coverage27167 ---27168 duration_ms: 407.7580027169 ...27170ok 5245 test-runner/test-output-test-runner-watch-spec27171 ---27172 duration_ms: 506.9600027173 ...27174ok 5246 test-runner/test-run-watch-no-emit-restarted-disabled27175 ---27176 duration_ms: 261.2290027177 ...27178ok 5247 test-runner/test-output-test-timeout-flag-with-test27179 ---27180 duration_ms: 506.9320027181 ...27182ok 5248 test-runner/test-output-dot-reporter27183 ---27184 duration_ms: 1108.8720027185 ...27186ok 5249 es-module/test-typescript-commonjs27187 ---27188 duration_ms: 1709.2280027189 ...27190ok 5250 parallel/test-stream-iter-broadcast-from27191 ---27192 duration_ms: 10260.6200027193 ...27194ok 5251 test-runner/test-output-abort27195 ---27196 duration_ms: 1411.0170027197 ...27198ok 5252 test-runner/test-output-abort-suite27199 ---27200 duration_ms: 1408.5900027201 ...27202ok 5253 test-runner/test-output-output27203 ---27204 duration_ms: 1008.0110027205 ...27206ok 5254 module-hooks/test-async-loader-hooks-called-with-expected-args27207 ---27208 duration_ms: 209.6350027209 ...27210ok 5255 parallel/test-zlib-zip-zip6427211 ---27212 duration_ms: 3816.1100027213 ...27214ok 5256 module-hooks/test-async-loader-hooks-called-with-register27215 ---27216 duration_ms: 261.3690027217 ...27218ok 5257 module-hooks/test-async-loader-hooks-globalpreload-no-warning-with-initialize27219 ---27220 duration_ms: 210.0920027221 ...27222ok 5258 test-runner/test-output-lcov-reporter27223 ---27224 duration_ms: 1108.7930027225 ...27226ok 5259 module-hooks/test-async-loader-hooks-globalpreload-warning27227 ---27228 duration_ms: 209.4230027229 ...27230ok 5260 test-runner/test-run-watch-emit-restarted27231 ---27232 duration_ms: 607.1290027233 ...27234ok 5261 module-hooks/test-async-loader-hooks-initialize-in-sequence27235 ---27236 duration_ms: 209.2210027237 ...27238ok 5262 test-runner/test-output-junit-reporter27239 ---27240 duration_ms: 1208.2740027241 ...27242ok 5263 test-runner/test-output-output-cli27243 ---27244 duration_ms: 1210.3860027245 ...27246ok 5264 module-hooks/test-async-loader-hooks-initialize-invoke27247 ---27248 duration_ms: 210.0380027249 ...27250ok 5265 module-hooks/test-async-loader-hooks-initialize-never-settling27251 ---27252 duration_ms: 209.5960027253 ...27254ok 5266 test-runner/test-output-randomize-output-cli27255 ---27256 duration_ms: 1207.6880027257 ...27258ok 5267 module-hooks/test-async-loader-hooks-initialize-process-exit27259 ---27260 duration_ms: 209.8360027261 ...27262ok 5268 test-runner/test-output-spec-reporter27263 ---27264 duration_ms: 1107.6530027265 ...27266ok 5269 module-hooks/test-async-loader-hooks-initialize-rejecting27267 ---27268 duration_ms: 209.5620027269 ...27270ok 5270 module-hooks/test-async-loader-hooks-mixed-opt-in27271 ---27272 duration_ms: 209.5870027273 ...27274ok 5271 module-hooks/test-async-loader-hooks-never-settling-load-cjs27275 ---27276 duration_ms: 209.5480027277 ...27278ok 5272 module-hooks/test-async-loader-hooks-never-settling-load-esm-no-warning27279 ---27280 duration_ms: 209.5990027281 ...27282ok 5273 module-hooks/test-async-loader-hooks-initialize-throw-null27283 ---27284 duration_ms: 261.9690027285 ...27286ok 5274 module-hooks/test-async-loader-hooks-never-settling-import-meta-resolve27287 ---27288 duration_ms: 260.9290027289 ...27290ok 5275 test-runner/test-output-spec-reporter-cli27291 ---27292 duration_ms: 1208.8140027293 ...27294ok 5276 module-hooks/test-async-loader-hooks-never-settling-load-esm-with-warning27295 ---27296 duration_ms: 209.5570027297 ...27298ok 5277 test-runner/test-output-no-refs27299 ---27300 duration_ms: 1416.9390027301 ...27302ok 5278 module-hooks/test-async-loader-hooks-never-settling-race-cjs27303 ---27304 duration_ms: 210.3520027305 ...27306ok 5279 module-hooks/test-async-loader-hooks-never-settling-resolve-cjs27307 ---27308 duration_ms: 209.2900027309 ...27310ok 5280 module-hooks/test-async-loader-hooks-never-settling-resolve-esm-no-warning27311 ---27312 duration_ms: 209.3800027313 ...27314ok 5281 module-hooks/test-async-loader-hooks-never-settling-resolve-esm-with-warning27315 ---27316 duration_ms: 209.5890027317 ...27318ok 5282 module-hooks/test-async-loader-hooks-no-leak-internals27319 ---27320 duration_ms: 209.6000027321 ...27322ok 5283 module-hooks/test-async-loader-hooks-never-settling-race-esm27323 ---27324 duration_ms: 261.5010027325 ...27326ok 5284 module-hooks/test-async-loader-hooks-process-exit-async27327 ---27328 duration_ms: 209.1070027329 ...27330ok 5285 module-hooks/test-async-loader-hooks-process-exit-sync27331 ---27332 duration_ms: 209.1400027333 ...27334ok 5286 es-module/test-typescript-eval27335 ---27336 duration_ms: 2412.1180027337 ...27338ok 5287 module-hooks/test-async-loader-hooks-process-exit-top-level27339 ---27340 duration_ms: 210.0660027341 ...27342ok 5288 module-hooks/test-async-loader-hooks-register-with-cjs27343 ---27344 duration_ms: 209.9840027345 ...27346ok 5289 module-hooks/test-async-loader-hooks-register-with-import27347 ---27348 duration_ms: 209.2830027349 ...27350ok 5290 module-hooks/test-async-loader-hooks-register-with-ports27351 ---27352 duration_ms: 209.4830027353 ...27354ok 5291 module-hooks/test-async-loader-hooks-register-with-require27355 ---27356 duration_ms: 209.8410027357 ...27358ok 5292 module-hooks/test-async-loader-hooks-register-with-url-parenturl27359 ---27360 duration_ms: 209.5240027361 ...27362ok 5293 module-hooks/test-async-loader-hooks-source-maps-cjs27363 ---27364 duration_ms: 209.9770027365 ...27366ok 5294 module-hooks/test-async-loader-hooks-throw-bigint27367 ---27368 duration_ms: 209.8090027369 ...27370ok 5295 module-hooks/test-async-loader-hooks-throw-boolean27371 ---27372 duration_ms: 209.6230027373 ...27374ok 5296 module-hooks/test-async-loader-hooks-throw-empty-object27375 ---27376 duration_ms: 209.1120027377 ...27378ok 5297 module-hooks/test-async-loader-hooks-require-resolve-default27379 ---27380 duration_ms: 261.6110027381 ...27382ok 5298 module-hooks/test-async-loader-hooks-require-resolve-opt-in27383 ---27384 duration_ms: 261.8550027385 ...27386ok 5299 module-hooks/test-async-loader-hooks-throw-error27387 ---27388 duration_ms: 209.6650027389 ...27390ok 5300 module-hooks/test-async-loader-hooks-throw-function27391 ---27392 duration_ms: 209.8650027393 ...27394ok 5301 module-hooks/test-async-loader-hooks-throw-null27395 ---27396 duration_ms: 209.4820027397 ...27398ok 5302 module-hooks/test-async-loader-hooks-throw-number27399 ---27400 duration_ms: 209.6610027401 ...27402ok 5303 module-hooks/test-async-loader-hooks-throw-object27403 ---27404 duration_ms: 209.8960027405 ...27406ok 5304 module-hooks/test-async-loader-hooks-throw-string27407 ---27408 duration_ms: 209.6140027409 ...27410ok 5305 module-hooks/test-async-loader-hooks-throw-symbol27411 ---27412 duration_ms: 209.5880027413 ...27414ok 5306 module-hooks/test-module-hooks-builtin-require27415 ---27416 duration_ms: 108.7550027417 ...27418ok 5307 module-hooks/test-module-hooks-create-require-with-url27419 ---27420 duration_ms: 108.7300027421 ...27422ok 5308 module-hooks/test-async-loader-hooks-throw-undefined27423 ---27424 duration_ms: 209.5180027425 ...27426ok 5309 module-hooks/test-async-loader-hooks-remove-beforeexit-listener27427 ---27428 duration_ms: 406.5100027429 ...27430ok 5310 module-hooks/test-module-hooks-custom-conditions-cjs27431 ---27432 duration_ms: 108.3360027433 ...27434ok 5311 test-runner/test-output-timeout-in-before-each27435 ---27436 duration_ms: 1509.5220027437 ...27438ok 5312 module-hooks/test-module-hooks-custom-conditions-special-values27439 ---27440 duration_ms: 108.0930027441 ...27442ok 5313 module-hooks/test-module-hooks-custom-conditions27443 ---27444 duration_ms: 134.9470027445 ...27446ok 5314 module-hooks/test-module-hooks-dispose27447 ---27448 duration_ms: 108.1140027449 ...27450ok 5315 module-hooks/test-async-loader-hooks-with-worker-permission-restricted27451 ---27452 duration_ms: 168.3620027453 ...27454ok 5316 module-hooks/test-async-loader-hooks-without-worker-permission27455 ---27456 duration_ms: 167.8370027457 ...27458ok 5317 module-hooks/test-module-hooks-import-wasm27459 ---27460 duration_ms: 109.0970027461 ...27462ok 5318 module-hooks/test-module-hooks-load-buffers27463 ---27464 duration_ms: 108.8470027465 ...27466ok 5319 module-hooks/test-async-loader-hooks-use-hooks-require-esm27467 ---27468 duration_ms: 260.9970027469 ...27470ok 5320 module-hooks/test-module-hooks-load-builtin-import27471 ---27472 duration_ms: 108.2130027473 ...27474ok 5321 module-hooks/test-module-hooks-load-builtin-override-commonjs27475 ---27476 duration_ms: 108.9140027477 ...27478ok 5322 module-hooks/test-module-hooks-load-builtin-override-json27479 ---27480 duration_ms: 108.9360027481 ...27482ok 5323 module-hooks/test-module-hooks-load-builtin-override-module27483 ---27484 duration_ms: 107.9190027485 ...27486ok 5324 module-hooks/test-module-hooks-load-builtin-require27487 ---27488 duration_ms: 108.7410027489 ...27490ok 5325 module-hooks/test-module-hooks-load-chained27491 ---27492 duration_ms: 108.6480027493 ...27494ok 5326 module-hooks/test-async-loader-hooks-with-worker-permission-allowed27495 ---27496 duration_ms: 260.9530027497 ...27498ok 5327 module-hooks/test-module-hooks-load-context-merged27499 ---27500 duration_ms: 108.6410027501 ...27502ok 5328 module-hooks/test-module-hooks-load-context-merged-esm27503 ---27504 duration_ms: 108.7890027505 ...27506ok 5329 module-hooks/test-module-hooks-load-context-optional27507 ---27508 duration_ms: 108.1550027509 ...27510ok 5330 module-hooks/test-module-hooks-load-context-optional-esm27511 ---27512 duration_ms: 108.3440027513 ...27514ok 5331 module-hooks/test-module-hooks-load-detection27515 ---27516 duration_ms: 108.3310027517 ...27518ok 5332 module-hooks/test-module-hooks-load-esm27519 ---27520 duration_ms: 108.2350027521 ...27522ok 5333 module-hooks/test-module-hooks-load-esm-mock27523 ---27524 duration_ms: 108.4980027525 ...27526ok 5334 module-hooks/test-module-hooks-load-import-cjs27527 ---27528 duration_ms: 108.5970027529 ...27530ok 5335 module-hooks/test-module-hooks-load-import-cjs-custom-source27531 ---27532 duration_ms: 108.5510027533 ...27534ok 5336 module-hooks/test-module-hooks-load-invalid27535 ---27536 duration_ms: 107.9240027537 ...27538ok 5337 module-hooks/test-module-hooks-load-mock27539 ---27540 duration_ms: 109.4280027541 ...27542ok 5338 module-hooks/test-module-hooks-load-short-circuit27543 ---27544 duration_ms: 108.8920027545 ...27546ok 5339 module-hooks/test-module-hooks-load-short-circuit-required-middle27547 ---27548 duration_ms: 108.3190027549 ...27550ok 5340 test-runner/test-run-watch-create27551 ---27552 duration_ms: 1708.7420027553 ...27554ok 5341 module-hooks/test-module-hooks-load-short-circuit-required-start27555 ---27556 duration_ms: 108.7810027557 ...27558ok 5342 module-hooks/test-module-hooks-load-url-change-import27559 ---27560 duration_ms: 109.1690027561 ...27562ok 5343 test-runner/test-watch-create-isolation-process27563 ---27564 duration_ms: 1408.0090027565 ...27566ok 5344 module-hooks/test-module-hooks-load-url-change-require27567 ---27568 duration_ms: 108.3350027569 ...27570ok 5345 test-runner/test-watch-dependency-isolation-none27571 ---27572 duration_ms: 1407.6110027573 ...27574ok 5346 test-runner/test-watch-dependency-isolation-process27575 ---27576 duration_ms: 1408.1020027577 ...27578ok 5347 module-hooks/test-module-hooks-require-wasm27579 ---27580 duration_ms: 109.5060027581 ...27582ok 5348 module-hooks/test-module-hooks-resolve-builtin-builtin-require27583 ---27584 duration_ms: 108.5730027585 ...27586ok 5349 test-runner/test-output-test-runner-plan-timeout27587 ---27588 duration_ms: 1808.7410027589 ...27590ok 5350 module-hooks/test-module-hooks-resolve-builtin-on-disk-import27591 ---27592 duration_ms: 109.0140027593 ...27594ok 5351 test-runner/test-watch-esm-dependency-isolation-none27595 ---27596 duration_ms: 1408.0140027597 ...27598ok 5352 test-runner/test-watch-esm-dependency-isolation-process27599 ---27600 duration_ms: 1407.5110027601 ...27602ok 5353 module-hooks/test-module-hooks-resolve-builtin-builtin-import27603 ---27604 duration_ms: 134.9990027605 ...27606ok 5354 module-hooks/test-module-hooks-resolve-builtin-on-disk-require-with-prefix27607 ---27608 duration_ms: 109.6010027609 ...27610ok 5355 module-hooks/test-module-hooks-resolve-context-merged27611 ---27612 duration_ms: 108.8240027613 ...27614ok 5356 test-runner/test-watch-no-file-isolation-none27615 ---27616 duration_ms: 1407.7390027617 ...27618ok 5357 es-module/test-esm-tla-syntax-errors-not-recognized-as-tla-error27619 ---27620 duration_ms: 3612.0670027621 ...27622ok 5358 module-hooks/test-module-hooks-resolve-builtin-on-disk-require27623 ---27624 duration_ms: 134.9300027625 ...27626ok 5359 test-runner/test-watch-no-file-isolation-process27627 ---27628 duration_ms: 1407.6520027629 ...27630ok 5360 module-hooks/test-module-hooks-resolve-context-merged-esm27631 ---27632 duration_ms: 134.8450027633 ...27634ok 5361 module-hooks/test-module-hooks-resolve-context-optional27635 ---27636 duration_ms: 108.6490027637 ...27638ok 5362 module-hooks/test-module-hooks-resolve-context-optional-esm27639 ---27640 duration_ms: 108.8750027641 ...27642ok 5363 test-runner/test-watch-rename-isolation-none27643 ---27644 duration_ms: 1407.5780027645 ...27646ok 5364 module-hooks/test-module-hooks-resolve-import-cjs27647 ---27648 duration_ms: 109.9120027649 ...27650ok 5365 module-hooks/test-module-hooks-resolve-invalid27651 ---27652 duration_ms: 108.3130027653 ...27654ok 5366 module-hooks/test-module-hooks-resolve-load-builtin-override-both27655 ---27656 duration_ms: 108.8660027657 ...27658ok 5367 module-hooks/test-module-hooks-resolve-load-builtin-override-both-prefix27659 ---27660 duration_ms: 109.4880027661 ...27662ok 5368 module-hooks/test-module-hooks-resolve-load-builtin-redirect-prefix27663 ---27664 duration_ms: 107.9670027665 ...27666ok 5369 test-runner/test-run-watch-dependency-repeatedly27667 ---27668 duration_ms: 1708.6140027669 ...27670ok 5370 test-runner/test-run-watch-different-cwd-dependency27671 ---27672 duration_ms: 1708.0950027673 ...27674ok 5371 module-hooks/test-module-hooks-resolve-load-builtin-redirect27675 ---27676 duration_ms: 135.3920027677 ...27678ok 5372 test-runner/test-watch-rename-isolation-process27679 ---27680 duration_ms: 1407.9840027681 ...27682ok 5373 module-hooks/test-module-hooks-resolve-require-resolve-builtin27683 ---27684 duration_ms: 109.3920027685 ...27686ok 5374 module-hooks/test-module-hooks-resolve-require-resolve-create-require27687 ---27688 duration_ms: 108.3650027689 ...27690ok 5375 test-runner/test-run-watch-different-cwd-rename27691 ---27692 duration_ms: 1708.3690027693 ...27694ok 5376 module-hooks/test-module-hooks-resolve-require-resolve-fallthrough27695 ---27696 duration_ms: 108.8090027697 ...27698ok 5377 test-runner/test-run-watch-different-runner-cwd27699 ---27700 duration_ms: 1708.2090027701 ...27702ok 5378 module-hooks/test-module-hooks-resolve-require-resolve-imported-cjs27703 ---27704 duration_ms: 111.2680027705 ...27706ok 5379 module-hooks/test-module-hooks-resolve-require-resolve-paths27707 ---27708 duration_ms: 109.7660027709 ...27710ok 5380 module-hooks/test-module-hooks-resolve-require-resolve-consistency27711 ---27712 duration_ms: 135.9490027713 ...27714ok 5381 module-hooks/test-module-hooks-resolve-require-resolve-redirect27715 ---27716 duration_ms: 109.4300027717 ...27718ok 5382 test-runner/test-watch-run-repeatedly-isolation-none27719 ---27720 duration_ms: 1408.2060027721 ...27722ok 5383 test-runner/test-run-watch-different-runner-cwd-isolation-process27723 ---27724 duration_ms: 1708.1250027725 ...27726ok 5384 module-hooks/test-module-hooks-resolve-short-circuit27727 ---27728 duration_ms: 109.5090027729 ...27730ok 5385 test-runner/test-watch-run-repeatedly-isolation-process27731 ---27732 duration_ms: 1408.8160027733 ...27734ok 5386 module-hooks/test-module-hooks-resolve-short-circuit-required-middle27735 ---27736 duration_ms: 108.8640027737 ...27738ok 5387 module-hooks/test-module-hooks-resolve-short-circuit-required-start27739 ---27740 duration_ms: 108.2920027741 ...27742ok 5388 test-runner/test-run-watch-esm-dependency27743 ---27744 duration_ms: 1708.0930027745 ...27746ok 5389 message/assert_throws_stack27747 ---27748 duration_ms: 111.7370027749 ...27750ok 5390 message/console_assert27751 ---27752 duration_ms: 111.4670027753 ...27754ok 5391 message/nexttick_throw27755 ---27756 duration_ms: 109.5140027757 ...27758ok 5392 message/test-testpy-env-var-via-comment27759 ---27760 duration_ms: 108.3060027761 ...27762ok 5393 module-hooks/test-module-hooks-resolve-require-resolve-loaded-with-source27763 ---27764 duration_ms: 168.5310027765 ...27766ok 5394 module-hooks/test-module-hooks-require-esm27767 ---27768 duration_ms: 326.8880027769 ...27770ok 5395 test-runner/test-run-watch-rename27771 ---27772 duration_ms: 1708.6150027773 ...27774ok 5396 message/internal_assert_fail27775 ---27776 duration_ms: 137.4530027777 ...27778ok 5397 test-runner/test-run-watch-repeatedly27779 ---27780 duration_ms: 1710.9090027781 ...27782ok 5398 message/internal_assert27783 ---27784 duration_ms: 140.4160027785 ...27786ok 5399 message/max_tick_depth27787 ---27788 duration_ms: 138.9350027789 ...27790ok 5400 async-hooks/test-async-exec-resource-match27791 ---27792 duration_ms: 112.5250027793 ...27794ok 5401 test-runner/test-run-watch-run-duration27795 ---27796 duration_ms: 1708.0760027797 ...27798ok 5402 message/util-inspect-error-cause27799 ---27800 duration_ms: 140.6530027801 ...27802ok 5403 test-runner/test-run-watch-without-file27803 ---27804 duration_ms: 1710.6580027805 ...27806ok 5404 message/util_inspect_error27807 ---27808 duration_ms: 143.4470027809 ...27810ok 5405 async-hooks/test-async-await27811 ---27812 duration_ms: 138.7960027813 ...27814ok 5406 async-hooks/test-async-local-storage-async-await27815 ---27816 duration_ms: 114.2580027817 ...27818ok 5407 message/node_run_non_existent27819 ---27820 duration_ms: 170.5490027821 ...27822ok 5408 async-hooks/test-async-local-storage-args27823 ---27824 duration_ms: 140.6290027825 ...27826ok 5409 async-hooks/test-async-local-storage-dgram27827 ---27828 duration_ms: 138.2830027829 ...27830ok 5410 async-hooks/test-async-local-storage-async-functions27831 ---27832 duration_ms: 138.7630027833 ...27834ok 5411 async-hooks/test-async-local-storage-enable-disable27835 ---27836 duration_ms: 138.0510027837 ...27838ok 5412 async-hooks/test-async-exec-resource-http27839 ---27840 duration_ms: 170.0850027841 ...27842ok 5413 async-hooks/test-async-exec-resource-http-agent27843 ---27844 duration_ms: 169.3070027845 ...27846ok 5414 message/node_run_list27847 ---27848 duration_ms: 209.9800027849 ...27850ok 5415 async-hooks/test-async-local-storage-http27851 ---27852 duration_ms: 140.7970027853 ...27854ok 5416 async-hooks/test-async-local-storage-misc-stores27855 ---27856 duration_ms: 138.8490027857 ...27858ok 5417 async-hooks/test-async-local-storage-thenable27859 ---27860 duration_ms: 113.6450027861 ...27862ok 5418 async-hooks/test-async-local-storage-promises27863 ---27864 duration_ms: 140.6060027865 ...27866ok 5419 async-hooks/test-async-local-storage-socket27867 ---27868 duration_ms: 139.7940027869 ...27870ok 5420 async-hooks/test-async-local-storage-stream-finished27871 ---27872 duration_ms: 138.0210027873 ...27874ok 5421 async-hooks/test-async-local-storage-enter-with27875 ---27876 duration_ms: 173.5910027877 ...27878ok 5422 async-hooks/test-async-local-storage-gcable27879 ---27880 duration_ms: 170.8050027881 ...27882ok 5423 async-hooks/test-async-local-storage-errors27883 ---27884 duration_ms: 171.9600027885 ...27886ok 5424 async-hooks/test-async-local-storage-http-agent27887 ---27888 duration_ms: 172.1540027889 ...27890ok 5425 async-hooks/test-async-local-storage-nested27891 ---27892 duration_ms: 175.0290027893 ...27894ok 5426 async-hooks/test-embedder.api.async-resource27895 ---27896 duration_ms: 116.0340027897 ...27898ok 5427 async-hooks/test-crypto-pbkdf227899 ---27900 duration_ms: 138.0370027901 ...27902ok 5428 es-module/test-typescript27903 ---27904 duration_ms: 3310.9550027905 ...27906ok 5429 async-hooks/test-disable-in-init27907 ---27908 duration_ms: 140.0160027909 ...27910ok 5430 async-hooks/test-emit-before-after27911 ---27912 duration_ms: 111.2840027913 ...27914ok 5431 async-hooks/test-async-wrap-providers27915 ---27916 duration_ms: 171.6250027917 ...27918ok 5432 async-hooks/test-embedder.api.async-resource.runInAsyncScope27919 ---27920 duration_ms: 138.7120027921 ...27922ok 5433 async-hooks/test-fseventwrap27923 ---27924 duration_ms: 109.1130027925 ...27926ok 5434 async-hooks/test-fsreqcallback-access27927 ---27928 duration_ms: 109.2980027929 ...27930ok 5435 async-hooks/test-crypto-randomBytes27931 ---27932 duration_ms: 173.4970027933 ...27934ok 5436 async-hooks/test-destroy-not-blocked27935 ---27936 duration_ms: 174.3350027937 ...27938ok 5437 async-hooks/test-fsreqcallback-readFile27939 ---27940 duration_ms: 110.1250027941 ...27942ok 5438 async-hooks/test-getnameinforeqwrap27943 ---27944 duration_ms: 109.1470027945 ...27946ok 5439 module-hooks/test-module-hooks-resolve-load-import-inline-typescript27947 ---27948 duration_ms: 407.4730027949 ...27950ok 5440 module-hooks/test-module-hooks-resolve-load-require-inline-typescript27951 ---27952 duration_ms: 407.2390027953 ...27954ok 5441 module-hooks/test-module-hooks-load-async-and-sync27955 ---27956 duration_ms: 707.8070027957 ...27958ok 5442 async-hooks/test-enable-in-init27959 ---27960 duration_ms: 136.6100027961 ...27962ok 5443 async-hooks/test-async-local-storage-tlssocket27963 ---27964 duration_ms: 212.5260027965 ...27966ok 5444 module-hooks/test-module-hooks-resolve-load-require-inline-typescript-override27967 ---27968 duration_ms: 409.8100027969 ...27970ok 5445 async-hooks/test-getaddrinforeqwrap27971 ---27972 duration_ms: 135.0170027973 ...27974ok 5446 async-hooks/test-emit-init27975 ---27976 duration_ms: 169.4580027977 ...27978ok 5447 async-hooks/test-enable-disable27979 ---27980 duration_ms: 168.3000027981 ...27982ok 5448 async-hooks/test-graph.fsreq-readFile27983 ---27984 duration_ms: 135.0760027985 ...27986ok 5449 async-hooks/test-graph.statwatcher27987 ---27988 duration_ms: 108.9330027989 ...27990ok 5450 async-hooks/test-filehandle-no-reuse27991 ---27992 duration_ms: 169.1750027993 ...27994ok 5451 async-hooks/test-graph.pipeconnect27995 ---27996 duration_ms: 135.5020027997 ...27998ok 5452 async-hooks/test-graph.shutdown27999 ---28000 duration_ms: 136.3630028001 ...28002ok 5453 async-hooks/test-graph.tcp28003 ---28004 duration_ms: 135.3590028005 ...28006ok 5454 async-hooks/test-graph.timeouts28007 ---28008 duration_ms: 135.1980028009 ...28010ok 5455 async-hooks/test-graph.http28011 ---28012 duration_ms: 168.1380028013 ...28014ok 5456 async-hooks/test-graph.intervals28015 ---28016 duration_ms: 168.9760028017 ...28018ok 5457 async-hooks/test-graph.tls-write-1228019 ---28020 duration_ms: 135.1180028021 ...28022ok 5458 async-hooks/test-httpparser.request28023 ---28024 duration_ms: 134.7770028025 ...28026ok 5459 async-hooks/test-graph.signal28027 ---28028 duration_ms: 169.7750028029 ...28030ok 5460 async-hooks/test-embedder.api.async-resource-no-type28031 ---28032 duration_ms: 266.4760028033 ...28034ok 5461 module-hooks/test-module-hooks-resolve-load-import-inline-typescript-override28035 ---28036 duration_ms: 507.8470028037 ...28038ok 5462 async-hooks/test-no-assert-when-disabled28039 ---28040 duration_ms: 109.3860028041 ...28042ok 5463 async-hooks/test-emit-after-on-destroyed28043 ---28044 duration_ms: 264.3920028045 ...28046ok 5464 async-hooks/test-httpparser.response28047 ---28048 duration_ms: 135.8200028049 ...28050ok 5465 async-hooks/test-emit-before-on-destroyed28051 ---28052 duration_ms: 265.1010028053 ...28054ok 5466 async-hooks/test-graph.tls-write28055 ---28056 duration_ms: 169.1290028057 ...28058ok 5467 async-hooks/test-promise.chain-promise-before-init-hooks28059 ---28060 duration_ms: 109.0280028061 ...28062ok 5468 async-hooks/test-late-hook-enable28063 ---28064 duration_ms: 136.6300028065 ...28066ok 5469 async-hooks/test-net-get-connections28067 ---28068 duration_ms: 136.2850028069 ...28070ok 5470 async-hooks/test-queue-microtask28071 ---28072 duration_ms: 109.3860028073 ...28074ok 5471 async-hooks/test-promise28075 ---28076 duration_ms: 136.2540028077 ...28078ok 5472 async-hooks/test-promise.promise-before-init-hooks28079 ---28080 duration_ms: 134.9390028081 ...28082ok 5473 async-hooks/test-immediate28083 ---28084 duration_ms: 168.7380028085 ...28086ok 5474 async-hooks/test-http-agent-handle-reuse-parallel28087 ---28088 duration_ms: 210.0030028089 ...28090ok 5475 async-hooks/test-nexttick-default-trigger28091 ---28092 duration_ms: 169.0910028093 ...28094ok 5476 async-hooks/test-http-agent-handle-reuse-serial28095 ---28096 duration_ms: 210.4040028097 ...28098ok 5477 async-hooks/test-pipeconnectwrap28099 ---28100 duration_ms: 169.2320028101 ...28102ok 5478 async-hooks/test-tcpwrap28103 ---28104 duration_ms: 135.4390028105 ...28106ok 5479 async-hooks/test-track-promises-false-check28107 ---28108 duration_ms: 108.2740028109 ...28110ok 5480 async-hooks/test-graph.pipe28111 ---28112 duration_ms: 262.9810028113 ...28114ok 5481 async-hooks/test-shutdownwrap28115 ---28116 duration_ms: 168.4600028117 ...28118ok 5482 async-hooks/test-signalwrap28119 ---28120 duration_ms: 168.2820028121 ...28122ok 5483 async-hooks/test-improper-order28123 ---28124 duration_ms: 210.8870028125 ...28126ok 5484 async-hooks/test-track-promises-default28127 ---28128 duration_ms: 135.5280028129 ...28130ok 5485 async-hooks/test-track-promises-false28131 ---28132 duration_ms: 135.1490028133 ...28134ok 5486 async-hooks/test-track-promises-true28135 ---28136 duration_ms: 135.1070028137 ...28138ok 5487 async-hooks/test-unhandled-exception-valid-ids28139 ---28140 duration_ms: 108.4940028141 ...28142ok 5488 async-hooks/test-track-promises-validation28143 ---28144 duration_ms: 135.2520028145 ...28146ok 5489 report/test-report-config28147 ---28148 duration_ms: 110.0250028149 ...28150ok 5490 async-hooks/test-ttywrap.readstream # skip no valid readable TTY available28151 ---28152 duration_ms: 135.1730028153 ...28154ok 5491 async-hooks/test-udpsendwrap28155 ---28156 duration_ms: 135.5020028157 ...28158ok 5492 async-hooks/test-unhandled-rejection-context28159 ---28160 duration_ms: 135.7700028161 ...28162ok 5493 async-hooks/test-zlib.zlib-binding.deflate28163 ---28164 duration_ms: 135.9890028165 ...28166ok 5494 async-hooks/test-improper-unwind28167 ---28168 duration_ms: 262.7680028169 ...28170ok 5495 es-module/test-wasm-web-api28171 ---28172 duration_ms: 3514.2390028173 ...28174ok 5496 async-hooks/test-pipewrap28175 ---28176 duration_ms: 262.7550028177 ...28178ok 5497 async-hooks/test-udpwrap28179 ---28180 duration_ms: 168.3680028181 ...28182ok 5498 report/test-report-uncaught-exception-handled28183 ---28184 duration_ms: 108.4500028185 ...28186ok 5499 report/test-report-uncaught-exception-override28187 ---28188 duration_ms: 108.8360028189 ...28190ok 5500 report/test-report-getreport28191 ---28192 duration_ms: 135.4410028193 ...28194ok 5501 async-hooks/test-async-local-storage-no-mix-contexts28195 ---28196 duration_ms: 512.8310028197 ...28198ok 5502 report/test-report-signal28199 ---28200 duration_ms: 135.2530028201 ...28202ok 5503 async-hooks/test-writewrap28203 ---28204 duration_ms: 211.4310028205 ...28206ok 5504 test-runner/test-run-watch-delete28207 ---28208 duration_ms: 2408.7650028209 ...28210ok 5505 async-hooks/test-httpparser-reuse28211 ---28212 duration_ms: 406.8920028213 ...28214ok 5506 report/test-report-worker28215 ---28216 duration_ms: 210.4090028217 ...28218ok 5507 report/test-report-writereport-exclude-env28219 ---28220 duration_ms: 210.1550028221 ...28222ok 5508 async-hooks/test-callback-error28223 ---28224 duration_ms: 614.4300028225 ...28226ok 5509 report/test-report-uncaught-exception28227 ---28228 duration_ms: 262.0610028229 ...28230ok 5510 report/test-report-uncaught-exception-primitives28231 ---28232 duration_ms: 261.4490028233 ...28234ok 5511 report/test-report-uncaught-exception-symbols28235 ---28236 duration_ms: 261.3290028237 ...28238ok 5512 async-hooks/test-statwatcher28239 ---28240 duration_ms: 406.9550028241 ...28242ok 5513 async-hooks/test-timers.setInterval28243 ---28244 duration_ms: 406.6440028245 ...28246ok 5514 test426/test-source-map-spec28247 ---28248 duration_ms: 261.7860028249 ...28250ok 5515 async-hooks/test-timers.setTimeout28251 ---28252 duration_ms: 407.8290028253 ...28254ok 5516 report/test-report-uncaught-exception-compat28255 ---28256 duration_ms: 326.8330028257 ...28258ok 5517 report/test-report-uv-handles28259 ---28260 duration_ms: 326.6810028261 ...28262ok 5518 async-hooks/test-querywrap28263 ---28264 duration_ms: 506.9260028265 ...28266ok 5519 report/test-report-fatalerror-oomerror-compact28267 ---28268 duration_ms: 406.8460028269 ...28270ok 5520 report/test-report-exclude-network28271 ---28272 duration_ms: 409.3960028273 ...28274ok 5521 report/test-report-fatalerror-oomerror-directory28275 ---28276 duration_ms: 407.5770028277 ...28278ok 5522 report/test-report-fatalerror-oomerror-filename28279 ---28280 duration_ms: 408.3940028281 ...28282ok 5523 report/test-report-fatalerror-oomerror-not-set28283 ---28284 duration_ms: 408.2540028285 ...28286ok 5524 report/test-report-fatalerror-oomerror-set28287 ---28288 duration_ms: 407.0480028289 ...28290ok 5525 async-hooks/test-tlswrap28291 ---28292 duration_ms: 508.3680028293 ...28294ok 5526 test-runner/test-watch-delete-isolation-none28295 ---28296 duration_ms: 2410.2530028297 ...28298ok 5527 test-runner/test-watch-delete-isolation-process28299 ---28300 duration_ms: 2408.8320028301 ...28302ok 5528 report/test-report-writereport28303 ---28304 duration_ms: 407.1080028305 ...28306ok 5529 module-hooks/test-module-hooks-preload28307 ---28308 duration_ms: 1408.3300028309 ...28310ok 5530 pummel/test-array-hash-collision28311 ---28312 duration_ms: 408.1390028313 ...28314ok 5531 async-hooks/test-async-exec-resource-http-3206028315 ---28316 duration_ms: 1308.2350028317 ...28318ok 5532 wasi/test-wasi-poll28319 ---28320 duration_ms: 6516.3540028321 ...28322ok 5533 pummel/test-blob-slice-with-large-size28323 ---28324 duration_ms: 1809.2050028325 ...28326ok 5534 pummel/test-buffer-large-size-buffer-alloc28327 ---28328 duration_ms: 1808.5670028329 ...28330ok 5535 pummel/test-buffer-large-size-buffer-alloc-unsafe28331 ---28332 duration_ms: 1709.0770028333 ...28334ok 5536 pummel/test-buffer-large-size-buffer-alloc-unsafe-slow28335 ---28336 duration_ms: 1809.2040028337 ...28338ok 5537 pummel/test-buffer-large-size-buffer-write28339 ---28340 duration_ms: 168.7550028341 ...28342ok 5538 pummel/test-buffer-large-size-copy28343 ---28344 duration_ms: 2709.0640028345 ...28346ok 5539 parallel/test-runner-execution-ordered-bypass28347 ---28348 duration_ms: 30479.5460028349 ...28350ok 5540 pummel/test-buffer-large-size-slowbuffer28351 ---28352 duration_ms: 1909.5280028353 ...28354ok 5541 pummel/test-child-process-spawn-loop28355 ---28356 duration_ms: 1209.4500028357 ...28358ok 5542 pummel/test-crypto-argon2-nonblocking-constructor28359 ---28360 duration_ms: 2111.1760028361 ...28362ok 5543 pummel/test-crypto-dh-hash28363 ---28364 duration_ms: 210.3880028365 ...28366ok 5544 pummel/test-crypto-dh-keys28367 ---28368 duration_ms: 326.9620028369 ...28370ok 5545 pummel/test-crypto-pqc-sign-verify-slh-dsa28371 ---28372 duration_ms: 13622.4700028373 ...28374ok 5546 pummel/test-dh-regr28375 ---28376 duration_ms: 26230.8040028377 ...28378ok 5547 pummel/test-fs-largefile28379 ---28380 duration_ms: 136.0860028381 ...28382ok 5548 pummel/test-fs-read-file-sync-utf8-memory28383 ---28384 duration_ms: 508.3870028385 ...28386ok 5549 pummel/test-fs-readfile-tostring-fail28387 ---28388 duration_ms: 1208.8930028389 ...28390ok 5550 pummel/test-heap-profile-and-snapshot-near-heap-limit28391 ---28392 duration_ms: 1209.1250028393 ...28394ok 5551 pummel/test-heap-profile-near-heap-limit28395 ---28396 duration_ms: 909.6150028397 ...28398ok 5552 pummel/test-heapdump-dns28399 ---28400 duration_ms: 2812.2200028401 ...28402ok 5553 pummel/test-heapdump-env28403 ---28404 duration_ms: 1108.5590028405 ...28406ok 5554 pummel/test-heapdump-fs-promise28407 ---28408 duration_ms: 2312.0810028409 ...28410ok 5555 pummel/test-heapdump-http228411 ---28412 duration_ms: 3511.3110028413 ...28414ok 5556 pummel/test-heapdump-inspector28415 ---28416 duration_ms: 1708.3910028417 ...28418ok 5557 pummel/test-heapdump-shadow-realm28419 ---28420 duration_ms: 3710.9850028421 ...28422ok 5558 pummel/test-heapdump-tls28423 ---28424 duration_ms: 2009.7770028425 ...28426ok 5559 pummel/test-heapdump-urlpattern28427 ---28428 duration_ms: 1910.5070028429 ...28430ok 5560 pummel/test-heapdump-vm-script28431 ---28432 duration_ms: 1008.2190028433 ...28434ok 5561 pummel/test-heapdump-worker28435 ---28436 duration_ms: 1709.0240028437 ...28438ok 5562 pummel/test-heapdump-zlib28439 ---28440 duration_ms: 12623.0550028441 ...28442ok 5563 pummel/test-heapdump-zstd28443 ---28444 duration_ms: 2509.1350028445 ...28446ok 5564 pummel/test-heapsnapshot-near-heap-limit28447 ---28448 duration_ms: 3211.2840028449 ...28450ok 5565 pummel/test-heapsnapshot-near-heap-limit-big28451 ---28452 duration_ms: 3912.4140028453 ...28454ok 5566 pummel/test-heapsnapshot-near-heap-limit-bounded28455 ---28456 duration_ms: 3010.5760028457 ...28458ok 5567 pummel/test-heapsnapshot-near-heap-limit-by-api28459 ---28460 duration_ms: 5617.0210028461 ...28462ok 5568 pummel/test-http-many-keep-alive-connections28463 ---28464 duration_ms: 809.4940028465 ...28466ok 5569 pummel/test-http-upload-timeout28467 ---28468 duration_ms: 3413.6790028469 ...28470ok 5570 pummel/test-https-large-response28471 ---28472 duration_ms: 328.9650028473 ...28474ok 5571 pummel/test-https-no-reader28475 ---28476 duration_ms: 2412.6930028477 ...28478ok 5572 pummel/test-keep-alive # skip test requires `wrk` to be installed first28479 ---28480 duration_ms: 169.9590028481 ...28482ok 5573 pummel/test-net-many-clients28483 ---28484 duration_ms: 263.9400028485 ...28486ok 5574 pummel/test-net-pause28487 ---28488 duration_ms: 2309.9700028489 ...28490ok 5575 pummel/test-net-pingpong28491 ---28492 duration_ms: 330.1000028493 ...28494ok 5576 pummel/test-net-pingpong-delay28495 ---28496 duration_ms: 507.6870028497 ...28498ok 5577 pummel/test-net-timeout28499 ---28500 duration_ms: 3813.0320028501 ...28502ok 5578 pummel/test-net-timeout228503 ---28504 duration_ms: 5313.9870028505 ...28506ok 5579 pummel/test-net-write-callbacks28507 ---28508 duration_ms: 1010.5720028509 ...28510ok 5580 pummel/test-next-tick-infinite-calls28511 ---28512 duration_ms: 6314.9790028513 ...28514ok 5581 pummel/test-process-cpuUsage28515 ---28516 duration_ms: 709.5110028517 ...28518ok 5582 pummel/test-process-hrtime28519 ---28520 duration_ms: 2210.4670028521 ...28522ok 5583 pummel/test-regress-GH-89228523 ---28524 duration_ms: 509.7610028525 ...28526ok 5584 pummel/test-repl-paste-big-data28527 ---28528 duration_ms: 608.6470028529 ...28530ok 5585 pummel/test-stream-pipe-multi28531 ---28532 duration_ms: 826.8800028533 ...28534ok 5586 pummel/test-string-decoder-large-buffer28535 ---28536 duration_ms: 108.7450028537 ...28538ok 5587 pummel/test-structuredclone-jstransferable28539 ---28540 duration_ms: 908.1720028541 ...28542ok 5588 pummel/test-timers28543 ---28544 duration_ms: 3313.1980028545 ...28546ok 5589 pummel/test-tls-server-large-request28547 ---28548 duration_ms: 328.0050028549 ...28550ok 5590 pummel/test-tls-throttle28551 ---28552 duration_ms: 263.7020028553 ...28554ok 5591 pummel/test-vm-memleak28555 ---28556 duration_ms: 5613.9820028557 ...28558ok 5592 pummel/test-vm-race28559 ---28560 duration_ms: 5212.0490028561 ...28562ok 5593 pummel/test-watch-file28563 ---28564 duration_ms: 5215.1550028565 ...28566ok 5594 pummel/test-webcrypto-derivebits-pbkdf228567 ---28568 duration_ms: 5613.3900028569 ...28570ok 5595 pummel/test-webcrypto-kangarootwelve-32bit-overflow # skip only relevant when kMaxLength < 2^3228571 ---28572 duration_ms: 108.9230028573 ...28574ok 5596 pummel/test-worker-take-heapsnapshot28575 ---28576 duration_ms: 608.4360028577 ...28578ok 5597 pummel/test-zlib-zip-slow28579 ---28580 duration_ms: 13627.7570028581 ...28582ok 5598 abort/test-abort-backtrace28583 ---28584 duration_ms: 418.3530028585 ...28586ok 5599 abort/test-abort-fatal-error28587 ---28588 duration_ms: 517.7820028589 ...28590ok 5600 abort/test-abort-uncaught-exception28591 ---28592 duration_ms: 414.6210028593 ...28594ok 5601 abort/test-addon-register-signal-handler # skip binding not built yet28595 ---28596 duration_ms: 142.2000028597 ...28598ok 5602 abort/test-addon-uv-handle-leak # skip binding not built yet28599 ---28600 duration_ms: 141.2790028601 ...28602ok 5603 abort/test-http-parser-consume28603 ---28604 duration_ms: 414.2550028605 ...28606ok 5604 abort/test-process-abort-exitcode28607 ---28608 duration_ms: 414.6060028609 ...28610ok 5605 abort/test-signal-handler28611 ---28612 duration_ms: 414.0260028613 ...28614ok 5606 abort/test-worker-abort-uncaught-exception28615 ---28616 duration_ms: 514.2440028617 ...28618ok 5607 abort/test-zlib-invalid-internals-usage28619 ---28620 duration_ms: 414.6020028621 ...28622ok 5608 wasm-allocation/test-wasm-allocation28623 ---28624 duration_ms: 174.7600028625 ...28626ok 5609 wasm-allocation/test-wasm-allocation-auto-adapt28627 ---28628 duration_ms: 143.1370028629 ...28630ok 5610 wasm-allocation/test-wasm-allocation-disable-trap-handler28631 ---28632 duration_ms: 142.9730028633 ...28634ok 5611 wasm-allocation/test-wasm-allocation-memory6428635 ---28636 duration_ms: 176.0000028637 ...28638ok 5612 known_issues/test-cli-print-var-crypto28639 ---28640 duration_ms: 327.0050028641 ...28642ok 5613 known_issues/test-cwd-enoent-file28643 ---28644 duration_ms: 262.5150028645 ...28646ok 5614 known_issues/test-dgram-bind-shared-ports-after-port-028647 ---28648 duration_ms: 510.0960028649 ...28650ok 5615 known_issues/test-fs-cp-async-buffer28651 ---28652 duration_ms: 136.7520028653 ...28654ok 5616 known_issues/test-fs-cp-filter28655 ---28656 duration_ms: 168.6010028657 ...28658ok 5617 known_issues/test-fs-cp-non-utf828659 ---28660 duration_ms: 169.4430028661 ...28662ok 5618 known_issues/test-fs-writeFileSync-invalid-windows28663 ---28664 duration_ms: 137.2620028665 ...28666ok 5619 known_issues/test-http-clientrequest-end-contentlength28667 ---28668 duration_ms: 211.5540028669 ...28670ok 5620 known_issues/test-http-clientrequest-end-empty-response-body28671 ---28672 duration_ms: 136.3660028673 ...28674ok 5621 known_issues/test-http-clientrequest-write-chunked28675 ---28676 duration_ms: 169.7600028677 ...28678ok 5622 known_issues/test-http-path-contains-unicode28679 ---28680 duration_ms: 170.2630028681 ...28682ok 5623 known_issues/test-inspector-cluster-port-clash28683 ---28684 duration_ms: 328.4540028685 ...28686ok 5624 known_issues/test-inspector-instrumentation-breakpoint28687 ---28688 duration_ms: 15428.1950028689 ...28690ok 5625 known_issues/test-repl-require-context28691 ---28692 duration_ms: 212.0590028693 ...28694ok 5626 known_issues/test-stdin-is-always-net.socket28695 ---28696 duration_ms: 327.7750028697 ...28698ok 5627 known_issues/test-stream-writable-sync-error28699 ---28700 duration_ms: 136.7280028701 ...28702ok 5628 known_issues/test-url-parse-conformance28703 ---28704 duration_ms: 211.2340028705 ...28706ok 5629 known_issues/test-vm-function-declaration-uses-define28707 ---28708 duration_ms: 170.7200028709 ...28710ok 5630 known_issues/test-vm-timeout-escape-nexttick28711 ---28712 duration_ms: 910.2320028713 ...28714ok 5631 wpt/test-abort28715 ---28716 duration_ms: 2412.0440028717 ...28718ok 5632 wpt/test-atob28719 ---28720 duration_ms: 328.5530028721 ...28722ok 5633 wpt/test-blob28723 ---28724 duration_ms: 408.9100028725 ...28726ok 5634 wpt/test-broadcastchannel28727 ---28728 duration_ms: 328.0840028729 ...28730ok 5635 wpt/test-compression28731 ---28732 duration_ms: 1210.1900028733 ...28734ok 5636 wpt/test-console28735 ---28736 duration_ms: 408.9770028737 ...28738ok 5637 wpt/test-encoding28739 ---28740 duration_ms: 713.2600028741 ...28742ok 5638 wpt/test-events28743 ---28744 duration_ms: 407.7680028745 ...28746ok 5639 wpt/test-file28747 ---28748 duration_ms: 327.8140028749 ...28750ok 5640 wpt/test-hr-time28751 ---28752 duration_ms: 2412.5090028753 ...28754ok 5641 wpt/test-microtask-queuing28755 ---28756 duration_ms: 328.3070028757 ...28758ok 5642 wpt/test-performance-timeline28759 ---28760 duration_ms: 2512.3390028761 ...28762ok 5643 wpt/test-resource-timing28763 ---28764 duration_ms: 510.3570028765 ...28766ok 5644 wpt/test-streams28767 ---28768 duration_ms: 2813.1310028769 ...28770ok 5645 wpt/test-structured-clone28771 ---28772 duration_ms: 262.3530028773 ...28774ok 5646 wpt/test-timers28775 ---28776 duration_ms: 1209.4380028777 ...28778ok 5647 wpt/test-url # skip Different versions of Ada affect the WPT tests28779 ---28780 duration_ms: 170.1700028781 ...28782ok 5648 wpt/test-urlpattern28783 ---28784 duration_ms: 409.7130028785 ...28786ok 5649 wpt/test-wasm-jsapi28787 ---28788 duration_ms: 1112.8350028789 ...28790ok 5650 wpt/test-wasm-webapi28791 ---28792 duration_ms: 408.1470028793 ...28794ok 5651 wpt/test-web-locks28795 ---28796 duration_ms: 2911.9620028797 ...28798ok 5652 wpt/test-webcrypto28799 ---28800 duration_ms: 5953.2200028801 ...28802ok 5653 wpt/test-webidl28803 ---28804 duration_ms: 409.0810028805 ...28806ok 5654 wpt/test-webstorage28807 ---28808 duration_ms: 1908.8030028809 ...28810ok 5655 wpt/test-workers28811 ---28812 duration_ms: 807.6420028813 ...28814ok 5656 sequential/test-async-wrap-getasyncid28815 ---28816 duration_ms: 326.0620028817 ...28818ok 5657 sequential/test-buffer-creation-regression28819 ---28820 duration_ms: 109.0800028821 ...28822ok 5658 sequential/test-child-process-emfile28823 ---28824 duration_ms: 261.8110028825 ...28826ok 5659 sequential/test-child-process-execsync28827 ---28828 duration_ms: 807.6920028829 ...28830ok 5660 sequential/test-child-process-exit28831 ---28832 duration_ms: 608.2730028833 ...28834ok 5661 sequential/test-child-process-pass-fd28835 ---28836 duration_ms: 508.5500028837 ...28838ok 5662 sequential/test-cli-syntax-bad28839 ---28840 duration_ms: 707.7610028841 ...28842ok 5663 sequential/test-cli-syntax-file-not-found28843 ---28844 duration_ms: 209.2600028845 ...28846ok 5664 sequential/test-cli-syntax-good28847 ---28848 duration_ms: 209.7890028849 ...28850ok 5665 sequential/test-cli-syntax-require28851 ---28852 duration_ms: 406.8350028853 ...28854ok 5666 sequential/test-cluster-inspect-brk28855 ---28856 duration_ms: 168.1460028857 ...28858ok 5667 sequential/test-cluster-net-listen-ipv6only-none28859 ---28860 duration_ms: 261.1690028861 ...28862ok 5668 sequential/test-cluster-net-listen-ipv6only-rr28863 ---28864 duration_ms: 261.5410028865 ...28866ok 5669 sequential/test-cluster-port-reuse-between-workers28867 ---28868 duration_ms: 407.8520028869 ...28870ok 5670 sequential/test-cluster-send-handle-large-payload28871 ---28872 duration_ms: 261.2340028873 ...28874ok 5671 sequential/test-cpu-prof-default28875 ---28876 duration_ms: 1209.0450028877 ...28878ok 5672 sequential/test-cpu-prof-dir-absolute28879 ---28880 duration_ms: 1308.1620028881 ...28882ok 5673 sequential/test-cpu-prof-dir-and-name28883 ---28884 duration_ms: 1207.9230028885 ...28886ok 5674 sequential/test-cpu-prof-dir-relative28887 ---28888 duration_ms: 1209.1940028889 ...28890ok 5675 sequential/test-cpu-prof-drained28891 ---28892 duration_ms: 1309.7280028893 ...28894ok 5676 sequential/test-cpu-prof-exit28895 ---28896 duration_ms: 408.8370028897 ...28898ok 5677 sequential/test-cpu-prof-invalid-options28899 ---28900 duration_ms: 327.6980028901 ...28902ok 5678 sequential/test-cpu-prof-kill28903 ---28904 duration_ms: 407.9600028905 ...28906ok 5679 sequential/test-cpu-prof-name28907 ---28908 duration_ms: 2910.1660028909 ...28910ok 5680 sequential/test-cpu-prof-worker-argv28911 ---28912 duration_ms: 1810.3890028913 ...28914ok 5681 sequential/test-crypto-timing-safe-equal28915 ---28916 duration_ms: 170.7890028917 ...28918ok 5682 sequential/test-crypto-timing-safe-equal-fast28919 ---28920 duration_ms: 211.0370028921 ...28922ok 5683 sequential/test-debug-prompt28923 ---28924 duration_ms: 809.8430028925 ...28926ok 5684 sequential/test-debugger-custom-port28927 ---28928 duration_ms: 808.8340028929 ...28930ok 5685 sequential/test-debugger-debug-brk28931 ---28932 duration_ms: 263.6550028933 ...28934ok 5686 sequential/test-debugger-invalid-args28935 ---28936 duration_ms: 5416.6390028937 ...28938ok 5687 sequential/test-debugger-launch28939 ---28940 duration_ms: 810.0740028941 ...28942ok 5688 sequential/test-debugger-pid28943 ---28944 duration_ms: 609.3240028945 ...28946ok 5689 sequential/test-deprecation-flags28947 ---28948 duration_ms: 263.9450028949 ...28950ok 5690 sequential/test-dgram-bind-shared-ports28951 ---28952 duration_ms: 509.4370028953 ...28954ok 5691 sequential/test-dgram-implicit-bind-failure28955 ---28956 duration_ms: 170.7550028957 ...28958ok 5692 sequential/test-dgram-pingpong28959 ---28960 duration_ms: 170.2060028961 ...28962ok 5693 sequential/test-diagnostic-dir-cpu-prof28963 ---28964 duration_ms: 3313.3430028965 ...28966ok 5694 sequential/test-diagnostic-dir-heap-prof28967 ---28968 duration_ms: 1712.0760028969 ...28970ok 5695 sequential/test-dtls-interop-openssl-client # skip DTLS is not enabled28971 ---28972 duration_ms: 169.9920028973 ...28974ok 5696 sequential/test-dtls-interop-openssl-server # skip DTLS is not enabled28975 ---28976 duration_ms: 169.9110028977 ...28978ok 5697 sequential/test-error-serdes28979 ---28980 duration_ms: 170.4620028981 ...28982ok 5698 sequential/test-fs-opendir-recursive28983 ---28984 duration_ms: 262.3620028985 ...28986ok 5699 sequential/test-fs-readdir-recursive28987 ---28988 duration_ms: 210.2860028989 ...28990ok 5700 sequential/test-fs-stat-sync-overflow28991 ---28992 duration_ms: 262.6140028993 ...28994ok 5701 sequential/test-gc-http-client28995 ---28996 duration_ms: 1510.2770028997 ...28998ok 5702 sequential/test-gc-http-client-onerror28999 ---29000 duration_ms: 1411.6560029001 ...29002ok 5703 sequential/test-gc-http-client-timeout29003 ---29004 duration_ms: 709.9100029005 ...29006ok 5704 sequential/test-get-heapsnapshot-options29007 ---29008 duration_ms: 2312.4500029009 ...29010ok 5705 sequential/test-heapdump29011 ---29012 duration_ms: 709.1260029013 ...29014ok 5706 sequential/test-heapdump-flag29015 ---29016 duration_ms: 709.2210029017 ...29018ok 5707 sequential/test-heapdump-flag-custom-dir29019 ---29020 duration_ms: 709.0780029021 ...29022ok 5708 sequential/test-http-econnrefused29023 ---29024 duration_ms: 211.6950029025 ...29026ok 5709 sequential/test-http-keep-alive-large-write29027 ---29028 duration_ms: 210.6790029029 ...29030ok 5710 sequential/test-http-keepalive-maxsockets29031 ---29032 duration_ms: 509.7580029033 ...29034ok 5711 sequential/test-http-regr-gh-292829035 ---29036 duration_ms: 211.8240029037 ...29038ok 5712 sequential/test-http-server-keep-alive-timeout-slow-client-headers29039 ---29040 duration_ms: 2012.0460029041 ...29042ok 5713 sequential/test-http-server-keep-alive-timeout-slow-server29043 ---29044 duration_ms: 809.7920029045 ...29046ok 5714 sequential/test-http2-max-session-memory29047 ---29048 duration_ms: 211.4770029049 ...29050ok 5715 sequential/test-http2-ping-flood29051 ---29052 duration_ms: 212.1550029053 ...29054ok 5716 sequential/test-http2-settings-flood29055 ---29056 duration_ms: 211.9400029057 ...29058ok 5717 sequential/test-http2-timeout-large-write29059 ---29060 duration_ms: 2912.2320029061 ...29062ok 5718 sequential/test-http2-timeout-large-write-file29063 ---29064 duration_ms: 2913.1690029065 ...29066ok 5719 sequential/test-https-connect-localport29067 ---29068 duration_ms: 6317.3360029069 ...29070ok 5720 sequential/test-https-server-keep-alive-timeout29071 ---29072 duration_ms: 1910.5930029073 ...29074ok 5721 sequential/test-init29075 ---29076 duration_ms: 326.6340029077 ...29078ok 5722 sequential/test-inspector-network-resource29079 ---29080 duration_ms: 1909.0200029081 ...29082ok 5723 sequential/test-inspector-open-dispose29083 ---29084 duration_ms: 328.2790029085 ...29086ok 5724 sequential/test-inspector-port-cluster29087 ---29088 duration_ms: 709.9560029089 ...29090ok 5725 sequential/test-module-loading29091 ---29092 duration_ms: 210.5780029093 ...29094ok 5726 sequential/test-net-GH-550429095 ---29096 duration_ms: 508.0530029097 ...29098ok 5727 sequential/test-net-better-error-messages-port29099 ---29100 duration_ms: 169.0580029101 ...29102ok 5728 sequential/test-net-connect-econnrefused29103 ---29104 duration_ms: 262.2190029105 ...29106ok 5729 sequential/test-net-connect-handle-econnrefused29107 ---29108 duration_ms: 168.9060029109 ...29110ok 5730 sequential/test-net-connect-local-error29111 ---29112 duration_ms: 168.9270029113 ...29114ok 5731 sequential/test-net-listen-ipv6only29115 ---29116 duration_ms: 169.1160029117 ...29118ok 5732 sequential/test-net-listen-shared-ports29119 ---29120 duration_ms: 508.0610029121 ...29122ok 5733 sequential/test-net-localport29123 ---29124 duration_ms: 135.8830029125 ...29126ok 5734 sequential/test-net-reconnect-error29127 ---29128 duration_ms: 169.0540029129 ...29130ok 5735 sequential/test-net-response-size29131 ---29132 duration_ms: 1408.4910029133 ...29134ok 5736 sequential/test-net-server-address29135 ---29136 duration_ms: 170.0320029137 ...29138ok 5737 sequential/test-net-server-bind29139 ---29140 duration_ms: 328.3430029141 ...29142ok 5738 sequential/test-net-server-listen-ipv6-link-local29143 ---29144 duration_ms: 136.4060029145 ...29146ok 5739 sequential/test-next-tick-error-spin29147 ---29148 duration_ms: 262.6190029149 ...29150ok 5740 sequential/test-perf-hooks29151 ---29152 duration_ms: 1210.0330029153 ...29154ok 5741 sequential/test-performance-eventloopdelay29155 ---29156 duration_ms: 7317.6060029157 ...29158ok 5742 sequential/test-pipe29159 ---29160 duration_ms: 4414.3180029161 ...29162ok 5743 sequential/test-process-title29163 ---29164 duration_ms: 264.1320029165 ...29166ok 5744 sequential/test-process-warnings29167 ---29168 duration_ms: 263.6980029169 ...29170ok 5745 sequential/test-repl-timeout-throw29171 ---29172 duration_ms: 409.6260029173 ...29174ok 5746 sequential/test-require-cache-without-stat29175 ---29176 duration_ms: 170.7060029177 ...29178ok 5747 sequential/test-resolution-inspect-brk29179 ---29180 duration_ms: 263.7310029181 ...29182ok 5748 sequential/test-stream2-fs29183 ---29184 duration_ms: 170.2210029185 ...29186ok 5749 sequential/test-stream2-stderr-sync29187 ---29188 duration_ms: 328.3740029189 ...29190ok 5750 sequential/test-timers-block-eventloop29191 ---29192 duration_ms: 212.0120029193 ...29194ok 5751 sequential/test-timers-set-interval-excludes-callback-duration29195 ---29196 duration_ms: 609.1430029197 ...29198ok 5752 sequential/test-tls-connect29199 ---29200 duration_ms: 171.2330029201 ...29202ok 5753 sequential/test-tls-lookup29203 ---29204 duration_ms: 212.0350029205 ...29206ok 5754 sequential/test-tls-psk-client # skip missing openssl cli29207 ---29208 duration_ms: 170.2610029209 ...29210ok 5755 sequential/test-tls-session-timeout # skip node compiled without OpenSSL CLI.29211 ---29212 duration_ms: 170.5840029213 ...29214ok 5756 sequential/test-util-debug29215 ---29216 duration_ms: 609.3770029217 ...29218ok 5757 sequential/test-vm-break-on-sigint29219 ---29220 duration_ms: 263.8870029221 ...29222ok 5758 sequential/test-vm-timeout-escape-promise-module-229223 ---29224 duration_ms: 169.9600029225 ...29226ok 5759 sequential/test-vm-timeout-rethrow29227 ---29228 duration_ms: 327.9860029229 ...29230ok 5760 sequential/test-watch-mode-restart-esm-loading-error29231 ---29232 duration_ms: 2411.9050029233 ...29234ok 5761 sequential/test-watch-mode-watch-flags29235 ---29236 duration_ms: 609.3100029237 ...29238ok 5762 sequential/test-watch-mode-worker29239 ---29240 duration_ms: 3213.1300029241 ...29242ok 5763 sequential/test-without-async-context-frame29243 ---29244 duration_ms: 1810.8670029245 ...29246ok 5764 sequential/test-worker-eventlooputil29247 ---29248 duration_ms: 408.9410029249 ...29250ok 5765 sequential/test-worker-fshandles-error-on-termination29251 ---29252 duration_ms: 509.8920029253 ...29254ok 5766 sequential/test-worker-fshandles-open-close-on-termination29255 ---29256 duration_ms: 509.3170029257 ...29258ok 5767 sequential/test-worker-heapsnapshot-options29259 ---29260 duration_ms: 1111.2670029261 ...29262ok 5768 sequential/test-worker-prof29263 ---29264 duration_ms: 2112.3050029265 ...29266ok 5769 sequential/test-write-heapsnapshot-options29267 ---29268 duration_ms: 2512.4770029269 ...29270ok 5770 sequential/test-zlib-crc32-fast-api29271 ---29272 duration_ms: 211.9080029273 ...2927429275Failed tests:29276out/Release/node /build/node-v26.9.0/test/parallel/test-fs-cp-async-file-modes.mjs29277make: *** [Makefile:631: test-ci-js] Error 1