nodejs-slim-26.9.0
checks.x86_64-linux.pkgs-hermes-desktop
· build #5071
· raw
1structuredAttrs is enabled
unpackPhase
2unpacking source archive /nix/store/7ajvk1c4mspigbdgf21bn9d7f7p9kmgk-node-v26.9.0.tar.xz3source root is node-v26.9.04setting SOURCE_DATE_EPOCH to timestamp 1789550914 of file "node-v26.9.0/tools/nix/v8.nix"patchPhase
5applying patch /nix/store/j4p9lc7z8hi4g40cpqpj3qxb9a7bvanp-configure-armv6-vfpv2.patch6patching file configure.py7Hunk #1 succeeded at 49 with fuzz 1 (offset -1 lines).8applying patch /nix/store/igz0qnjkvwi4f2mn7i13h3ndxl9n5ryi-node-npm-build-npm-package-logic.patch9patching file deps/npm/node_modules/@npmcli/run-script/lib/set-path.js10Hunk #1 succeeded at 13 with fuzz 2 (offset 1 line).11Hunk #2 succeeded at 37 (offset 8 lines).12patching file deps/npm/node_modules/pacote/lib/git.js13Hunk #1 succeeded at 186 (offset -2 lines).14patching file deps/npm/node_modules/@npmcli/arborist/lib/arborist/build-ideal-tree.js15Hunk #1 succeeded at 802 (offset 62 lines).16patching file deps/npm/node_modules/@npmcli/arborist/lib/arborist/load-actual.js17Hunk #1 succeeded at 121 with fuzz 1 (offset -26 lines).18applying patch /nix/store/57n0csr7hpdd0y91ljxpiwlfw7fsx3kl-use-correct-env-in-tests.patch19patching file test/parallel/test-child-process-default-options.js20patching file test/parallel/test-child-process-env.js21patching file test/parallel/test-child-process-exec-env.js22applying patch /nix/store/p2mhv95s89kaqmdynhz6y6asalf8y4dh-bin-sh-node-run-v22.patch23patching file test/fixtures/run-script/node_modules/.bin/positional-args24Hunk #1 succeeded at 1 with fuzz 1.25applying patch /nix/store/3za8p3x3hjfr1a9b1lc3z4aapp9sm2ja-use-nix-codesign.patch26patching file test/parallel/test-macos-app-sandbox.js27applying patch /nix/store/6whc7i794ygkcwjwrprw7y9aglfl238g-fix-temporal-integration-with-shared-icu.patch28patching file deps/v8/src/objects/js-temporal-zoneinfo64.cc29patching file tools/v8_gypfiles/v8.gyp30Hunk #1 succeeded at 1398 (offset 19 lines).31Hunk #2 succeeded at 2051 (offset 93 lines).updateAutotoolsGnuConfigScriptsPhase
32Updating Autotools / GNU config script to a newer upstream version: ./deps/ngtcp2/ngtcp2/third-party/libev/config.sub33Updating Autotools / GNU config script to a newer upstream version: ./deps/cares/config/config.sub34Updating Autotools / GNU config script to a newer upstream version: ./deps/libffi/config.sub35Updating Autotools / GNU config script to a newer upstream version: ./deps/ngtcp2/ngtcp2/third-party/libev/config.guess36Updating Autotools / GNU config script to a newer upstream version: ./deps/cares/config/config.guess37Updating Autotools / GNU config script to a newer upstream version: ./deps/libffi/config.guessconfigurePhase
38fixing libtool script ./deps/ngtcp2/ngtcp2/third-party/libev/ltmain.sh39fixing libtool script ./deps/cares/config/ltmain.sh40fixing libtool script ./deps/libffi/ltmain.sh41./deps/ngtcp2/ngtcp2/third-party/libev/configure42./deps/cares/configure43./deps/libffi/configure44configure flags: --prefix=/nix/store/mn8r5sjblqmigxv5lg89q4wcj5zqb16n-nodejs-slim-26.9.0 --ninja --with-intl=system-icu --openssl-use-def-ca-store --no-cross-compiling --dest-os=linux --dest-cpu=x64 --v8-enable-temporal-support --use-prefix-to-find-headers --shared-abseil --shared-abseil-libpath=/nix/store/iqvb7h1ykhm12304qwx17xbncrhhy1g4-abseil-cpp-20260107.1/lib --shared-ada --shared-ada-libpath=/nix/store/vk3yq4nzlrdvq1qxgy3764qaycanr0mc-ada-4.0.0/lib --shared-brotli --shared-brotli-libpath=/nix/store/xhgd6rb4h8ssid9yw8nvw74cwq69md5y-brotli-1.2.0-lib/lib --shared-cares --shared-cares-libpath=/nix/store/68syfccdbv3hlz7imlc9xl9fzyz4v8gx-c-ares-1.34.8/lib --shared-ffi --shared-ffi-libpath=/nix/store/3r5wfb1dl3sfknvy1yringvmap0hxj4r-libffi-3.8.0/lib --shared-gtest --shared-gtest-libpath=/nix/store/5sdsmm8s00hck28yp95fk993rg42mqsp-gtest-1.18.0/lib --shared-hdr-histogram --shared-hdr-histogram-libpath=/nix/store/9g532g9jf92xy9xh68p99ml815q11zs0-hdrhistogram_c-0.11.10/lib --shared-highway --shared-highway-libpath=/nix/store/xs1jbkdzxs4ym0rh89nx8xfwj387x3aj-libhwy-1.4.0/lib --shared-http-parser --shared-http-parser-libpath=/nix/store/1lw7d9jsv7qb6nvc4fmvvqsyphaacqcs-llhttp-9.4.3/lib --shared-libuv --shared-libuv-libpath=/nix/store/68b1blnvl4scgdq48d4p7h4lw4pm5w0w-libuv-1.52.1/lib --shared-lief --shared-lief-libpath=/nix/store/nx4g3j20wvgq36b406q6rysvqzzrxaci-lief-0.17.6/lib --shared-merve --shared-merve-libpath=/nix/store/2gj58j8rd88kaan7bsqhl9fjxxp11qqi-merve-1.2.2/lib --shared-nbytes --shared-nbytes-libpath=/nix/store/zf8c839ahp1fn736lih7ai2y14rrx2gn-nbytes-0.1.4/lib --shared-nghttp2 --shared-nghttp2-libpath=/nix/store/6avzrsm02jh7q48ym3hgznj3ypc2shc2-nghttp2-1.70.0-lib/lib --shared-nghttp3 --shared-nghttp3-libpath=/nix/store/dki4fkk75v2x4aqkszmi257wxq6rkkyr-nghttp3-1.16.0/lib --shared-ngtcp2 --shared-ngtcp2-libpath=/nix/store/2hc131frgdz45bjbajmpvlrj185lah7p-ngtcp2-1.23.0/lib --shared-openssl --shared-openssl-libpath=/nix/store/yj34vymbqf7mf4lmffipy8jqc4kwr1mc-openssl-3.6.4/lib --shared-simdjson --shared-simdjson-libpath=/nix/store/129shchmqszagbb0m8kk7ddzb7nnklxv-simdjson-4.6.8/lib --shared-simdutf --shared-simdutf-libpath=/nix/store/dw6xlar7m4qfrhbk63zhcc5pmixa1ga1-simdutf-9.1.0/lib --shared-sqlite --shared-sqlite-libpath=/nix/store/7a0nx1a0rdc5s07vxrsdhplqnzncl5z9-sqlite-3.53.3/lib --shared-temporal_capi --shared-temporal_capi-libpath=/nix/store/7hrx4vyx67h46xxwqj3zw4nafa1m8d04-temporal_capi-0.2.6/lib --shared-uvwasi --shared-uvwasi-libpath=/nix/store/qnbgx63w8yya5330xcxyixja3ah6gfzm-uvwasi-0.0.23/lib --shared-zlib --shared-zlib-libpath=/nix/store/lw86vj9kfwgvlivg3p8qg2nibpmhmsl9-zlib-1.3.2/lib --shared-zstd --shared-zstd-libpath=/nix/store/8ik1d1r4l2jzm9mjh6bc0a13yczx62wg-zstd-1.5.7/lib45INFO: configure completed successfullybuildPhase
46build flags: -j48 SHELL=/nix/store/svx59425zxp552p2b8gm11qj5r09b56i-bash-5.3p15/bin/bash47TERM=dumb ninja -C out/Release -j4848ninja: Entering directory `out/Release'49[1/1871] CXX obj/deps/v8/src/base/v8_libbase.vlq-base64.o50[2/1871] CXX obj/deps/v8/src/base/platform/v8_libbase.semaphore.o51[3/1871] CXX obj/deps/v8/src/base/numbers/v8_libbase.cached-powers.o52[4/1871] CXX obj/deps/v8/src/base/v8_libbase.region-allocator.o53[5/1871] CXX obj/deps/v8/src/base/v8_libbase.abort-mode.o54[6/1871] CXX obj/deps/v8/src/base/sanitizer/v8_libbase.lsan-virtual-address-space.o55[7/1871] CXX obj/deps/v8/src/base/numbers/v8_libbase.diy-fp.o56[8/1871] CXX obj/deps/v8/src/base/numbers/v8_libbase.bignum.o57[9/1871] CXX obj/deps/v8/src/base/debug/v8_libbase.stack_trace.o58[10/1871] CXX obj/deps/v8/src/base/v8_libbase.logging.o59[11/1871] CXX obj/deps/v8/src/base/v8_libbase.sys-info.o60[12/1871] CXX obj/deps/v8/src/base/platform/v8_libbase.platform.o61[13/1871] CXX obj/deps/v8/src/base/v8_libbase.fpu.o62[14/1871] CXX obj/deps/v8/src/base/v8_libbase.division-by-constant.o63[15/1871] CXX obj/deps/v8/src/base/platform/v8_libbase.platform-posix-time.o64[16/1871] CXX obj/deps/v8/src/base/sanitizer/v8_libbase.lsan-page-allocator.o65[17/1871] CXX obj/deps/v8/src/base/numbers/v8_libbase.dtoa.o66[18/1871] CXX obj/deps/v8/src/base/v8_libbase.page-allocator.o67[19/1871] CXX obj/deps/v8/src/base/platform/v8_libbase.mutex.o68[20/1871] CXX obj/deps/v8/src/base/numbers/v8_libbase.bignum-dtoa.o69[21/1871] CXX obj/deps/v8/src/base/v8_libbase.cpu.o70[22/1871] CXX obj/deps/v8/src/base/platform/v8_libbase.platform-linux.o71[23/1871] ACTION Checking inspector protocol compatibility72[24/1871] CXX obj/deps/v8/src/base/v8_libbase.once.o73[25/1871] CXX obj/deps/v8/src/base/numbers/v8_libbase.fixed-dtoa.o74[26/1871] ACTION Generating temporal zoneinfo static data75[27/1871] CXX obj/deps/v8/src/base/v8_libbase.bits.o76[28/1871] CXX obj/deps/v8/src/base/v8_libbase.virtual-address-space.o77[29/1871] CC obj/deps/v8/third_party/zlib/v8_zlib.compress.o78cc1: warning: command-line option '-fvisibility-inlines-hidden' is valid for C++/ObjC++ but not for C79[30/1871] CC obj/deps/v8/third_party/zlib/v8_zlib.cpu_features.o80cc1: warning: command-line option '-fvisibility-inlines-hidden' is valid for C++/ObjC++ but not for C81[31/1871] CC obj/deps/v8/third_party/zlib/v8_zlib.adler32.o82cc1: warning: command-line option '-fvisibility-inlines-hidden' is valid for C++/ObjC++ but not for C83[32/1871] CC obj/deps/v8/third_party/zlib/v8_zlib.gzclose.o84cc1: warning: command-line option '-fvisibility-inlines-hidden' is valid for C++/ObjC++ but not for C85[33/1871] CXX obj/deps/v8/src/base/numbers/v8_libbase.strtod.o86[34/1871] CXX obj/deps/v8/src/base/v8_libbase.file-utils.o87[35/1871] ACTION Generating inspector protocol sources from protocol json88[36/1871] STAMP obj/tools/v8_gypfiles/v8_inspector_headers.actions_rules_copies.stamp89[37/1871] CC obj/deps/v8/third_party/zlib/v8_zlib.gzwrite.o90cc1: warning: command-line option '-fvisibility-inlines-hidden' is valid for C++/ObjC++ but not for C91[38/1871] CC obj/deps/v8/third_party/zlib/v8_zlib.crc32.o92cc1: warning: command-line option '-fvisibility-inlines-hidden' is valid for C++/ObjC++ but not for C93[39/1871] CXX obj/deps/v8/src/interpreter/bytecode_builtins_list_generator.bytecode-operands.o94[40/1871] CC obj/deps/v8/third_party/zlib/v8_zlib.gzread.o95cc1: warning: command-line option '-fvisibility-inlines-hidden' is valid for C++/ObjC++ but not for C96[41/1871] CC obj/deps/v8/third_party/zlib/v8_zlib.gzlib.o97cc1: warning: command-line option '-fvisibility-inlines-hidden' is valid for C++/ObjC++ but not for C98[42/1871] CC obj/deps/v8/third_party/zlib/v8_zlib.uncompr.o99cc1: warning: command-line option '-fvisibility-inlines-hidden' is valid for C++/ObjC++ but not for C100[43/1871] CXX obj/deps/v8/src/torque/torque_base.declarable.o101[44/1871] CC obj/deps/v8/third_party/zlib/v8_zlib.zutil.o102cc1: warning: command-line option '-fvisibility-inlines-hidden' is valid for C++/ObjC++ but not for C103[45/1871] CXX obj/deps/v8/src/torque/torque_base.global-context.o104[46/1871] CC obj/deps/v8/third_party/zlib/v8_zlib.inftrees.o105cc1: warning: command-line option '-fvisibility-inlines-hidden' is valid for C++/ObjC++ but not for C106[47/1871] CXX obj/deps/v8/src/base/numbers/v8_libbase.fast-dtoa.o107[48/1871] CXX obj/deps/v8/third_party/zlib/google/v8_zlib.compression_utils_portable.o108[49/1871] CXX obj/deps/v8/src/base/v8_libbase.strings.o109[50/1871] CC obj/deps/v8/third_party/zlib/v8_zlib.infback.o110cc1: warning: command-line option '-fvisibility-inlines-hidden' is valid for C++/ObjC++ but not for C111[51/1871] CXX obj/deps/v8/src/base/v8_libbase.emulated-virtual-address-subspace.o112[52/1871] CXX obj/deps/v8/src/base/platform/v8_libbase.platform-posix.o113[53/1871] CXX obj/deps/v8/src/regexp/gen-regexp-special-case.gen-regexp-special-case.o114[54/1871] CC obj/deps/v8/third_party/zlib/v8_zlib.inffast.o115cc1: warning: command-line option '-fvisibility-inlines-hidden' is valid for C++/ObjC++ but not for C116[55/1871] CXX obj/deps/v8/src/base/v8_libbase.ieee754.o117[56/1871] CXX obj/deps/v8/src/interpreter/bytecode_builtins_list_generator.bytecodes.o118[57/1871] CC obj/deps/v8/third_party/zlib/v8_zlib.deflate.o119cc1: warning: command-line option '-fvisibility-inlines-hidden' is valid for C++/ObjC++ but not for C120[58/1871] CC obj/deps/v8/third_party/zlib/v8_zlib.inflate.o121cc1: warning: command-line option '-fvisibility-inlines-hidden' is valid for C++/ObjC++ but not for C122[59/1871] CXX obj/deps/v8/src/base/platform/v8_libbase.memory-protection-key.o123[60/1871] CXX obj/src/node_js2c.builtin_info.o124[61/1871] CXX obj/deps/v8/src/builtins/bytecode_builtins_list_generator.generate-bytecodes-builtins-list.o125[62/1871] CXX obj/deps/v8/src/base/platform/v8_libbase.condition-variable.o126[63/1871] CXX obj/deps/v8/src/base/platform/v8_libbase.time.o127[64/1871] CC obj/deps/v8/third_party/zlib/v8_zlib.trees.o128cc1: warning: command-line option '-fvisibility-inlines-hidden' is valid for C++/ObjC++ but not for C129[65/1871] AR obj/tools/v8_gypfiles/libv8_zlib.a130[66/1871] CXX obj/deps/v8/src/torque/torque_base.source-positions.o131[67/1871] CXX obj/deps/v8/src/libplatform/tracing/v8_libplatform.trace-object.o132[68/1871] CXX obj/deps/v8/src/base/v8_libbase.bounded-page-allocator.o133[69/1871] CXX obj/src/node_js2c.embedded_data.o134[70/1871] CXX obj/deps/v8/src/libplatform/tracing/v8_libplatform.trace-writer.o135[71/1871] CXX obj/deps/v8/src/libplatform/tracing/v8_libplatform.trace-config.o136[72/1871] CXX obj/deps/v8/src/libplatform/v8_libplatform.default-thread-isolated-allocator.o137[73/1871] CXX obj/deps/inspector_protocol/crdtp/crdtp.error_support.o138[74/1871] CXX obj/deps/v8/src/base/debug/v8_libbase.stack_trace_posix.o139[75/1871] CC obj/test/nop/nop.nop.o140[76/1871] CXX obj/deps/v8/src/libplatform/v8_libplatform.delayed-task-queue.o141[77/1871] CC obj/test/overlapped-checker/overlapped-checker.main_unix.o142[78/1871] CXX obj/deps/inspector_protocol/crdtp/crdtp.json_platform.o143[79/1871] CXX obj/deps/v8/src/torque/torque_base.cpp-builder.o144[80/1871] CXX obj/deps/inspector_protocol/crdtp/crdtp.span.o145[81/1871] CXX obj/deps/v8/src/libplatform/v8_libplatform.default-worker-threads-task-runner.o146[82/1871] CXX obj/deps/inspector_protocol/crdtp/crdtp.serializable.o147[83/1871] CXX obj/deps/inspector_protocol/crdtp/crdtp.status.o148[84/1871] LINK overlapped-checker149[85/1871] CXX obj/deps/v8/src/torque/torque_base.instance-type-generator.o150[86/1871] CXX obj/deps/v8/src/torque/torque_base.type-oracle.o151[87/1871] CXX obj/deps/v8/src/libplatform/tracing/v8_libplatform.tracing-controller.o152[88/1871] CXX obj/deps/v8/src/libplatform/tracing/v8_libplatform.trace-buffer.o153[89/1871] CXX obj/deps/v8/src/base/v8_libbase.virtual-address-space-page-allocator.o154[90/1871] CXX obj/deps/v8/src/torque/torque_base.torque-code-generator.o155[91/1871] CXX obj/deps/v8/src/base/utils/v8_libbase.random-number-generator.o156[92/1871] AR obj/tools/v8_gypfiles/libv8_libbase.a157[93/1871] STAMP obj/tools/v8_gypfiles/v8_flags.actions_depends.stamp158[94/1871] LINK nop159[95/1871] CXX obj/deps/inspector_protocol/crdtp/crdtp.protocol_core.o160[96/1871] CXX obj/deps/v8/src/torque/torque_base.utils.o161[97/1871] LINK gen-regexp-special-case162[98/1871] LINK bytecode_builtins_list_generator163[99/1871] ACTION run_gen-regexp-special-case: run_gen-regexp-special-case_action_72d03329d19e24c609ee6e65eeeb110034e9261c37b8a8d83522628d574e9fa7164[100/1871] ACTION generate_bytecode_builtins_list: generate_bytecode_builtins_list_action_73a03d1964edbe79fc19deb968fa21d5c456544c3d095b62158c8959ed2aeed1165[101/1871] CXX obj/deps/v8/src/torque/torque_base.csa-generator.o166[102/1871] CXX obj/deps/v8/src/libplatform/v8_libplatform.default-platform.o167[103/1871] CXX obj/deps/v8/src/libplatform/v8_libplatform.task-queue.o168[104/1871] CXX obj/deps/v8/src/libplatform/v8_libplatform.default-foreground-task-runner.o169[105/1871] CXX obj/deps/inspector_protocol/crdtp/crdtp.cbor.o170[106/1871] CXX obj/deps/ncrypto/ncrypto_engine.engine.o171[107/1871] AR obj/deps/ncrypto/libncrypto_engine.a172[108/1871] CXX obj/deps/v8/src/torque/torque_base.kythe-data.o173[109/1871] CXX obj/deps/v8/src/torque/torque_base.server-data.o174[110/1871] CXX obj/deps/inspector_protocol/crdtp/crdtp.dispatch.o175[111/1871] CXX obj/deps/v8/src/torque/torque_base.earley-parser.o176[112/1871] CXX obj/deps/v8/src/libplatform/v8_libplatform.worker-thread.o177[113/1871] CXX obj/deps/v8/src/torque/torque_base.instructions.o178[114/1871] CXX obj/deps/v8/src/torque/torque_base.type-inference.o179[115/1871] CXX obj/tools/node_js2c.js2c.o180[116/1871] CXX obj/deps/v8/src/torque/torque_base.type-visitor.o181[117/1871] CXX obj/deps/v8/src/libplatform/v8_libplatform.default-job.o182[118/1871] AR obj/tools/v8_gypfiles/libv8_libplatform.a183[119/1871] LINK node_js2c184[120/1871] STAMP obj/node_base.actions_depends.stamp185[121/1871] ACTION node_base: convert_node_protocol_to_json_f26a10641803f604d1307d23f68bde8b450ad8f073bd43313642df31e7a3478c186[122/1871] ACTION node_base: concatenate_protocols_f26a10641803f604d1307d23f68bde8b450ad8f073bd43313642df31e7a3478c187[123/1871] ACTION node_base: v8_inspector_compress_protocol_json_f26a10641803f604d1307d23f68bde8b450ad8f073bd43313642df31e7a3478c188[124/1871] ACTION node_base: node_js2c_f26a10641803f604d1307d23f68bde8b450ad8f073bd43313642df31e7a3478c189[125/1871] CXX obj/deps/v8/src/torque/torque_base.declarations.o190[126/1871] CXX obj/deps/v8/src/torque/torque_base.cfg.o191[127/1871] CXX obj/deps/v8/src/torque/torque_base.class-debug-reader-generator.o192[128/1871] CXX obj/deps/v8/src/torque/torque.torque.o193[129/1871] CXX obj/deps/v8/src/torque/torque_base.torque-compiler.o194[130/1871] CXX obj/deps/v8/src/torque/torque_base.cc-generator.o195[131/1871] ACTION Generating node protocol sources from protocol json196[132/1871] STAMP obj/node_base.actions_rules_copies.stamp197[133/1871] CXX obj/deps/inspector_protocol/crdtp/crdtp.json.o198[134/1871] CXX obj/src/node_base.embedded_data.o199[135/1871] CXX obj/deps/v8/src/torque/torque_base.types.o200[136/1871] CXX obj/src/node_base.builtin_info.o201[137/1871] CXX obj/deps/v8/src/torque/torque_base.declaration-visitor.o202[138/1871] CXX obj/gen/src/node/inspector/protocol/node_base.DOMStorage.o203In file included from ../../src/util.h:29,204 from ../../src/inspector/node_string.h:10,205 from gen/src/node/inspector/protocol/Forward.h:19,206 from gen/src/node/inspector/protocol/Protocol.h:18,207 from gen/src/node/inspector/protocol/DOMStorage.h:10,208 from gen/src/node/inspector/protocol/DOMStorage.cpp:7:209../../deps/v8/include/v8-profiler.h: In constructor 'v8::HeapProfiler::HeapSnapshotOptions::HeapSnapshotOptions()':210../../deps/v8/include/v8-profiler.h:1128:27: warning: 'v8::HeapProfiler::HeapSnapshotOptions::global_object_name_resolver' is deprecated: Use context_name_resolver callback instead. [-Wdeprecated-declarations]211 1128 | HeapSnapshotOptions() {}212 | ^213../../deps/v8/include/v8-profiler.h:1142:25: note: declared here214 1142 | ObjectNameResolver* global_object_name_resolver = nullptr;215 | ^~~~~~~~~~~~~~~~~~~~~~~~~~~216../../deps/v8/include/v8-profiler.h:1128:27: warning: 'v8::HeapProfiler::HeapSnapshotOptions::global_object_name_resolver' is deprecated: Use context_name_resolver callback instead. [-Wdeprecated-declarations]217 1128 | HeapSnapshotOptions() {}218 | ^219../../deps/v8/include/v8-profiler.h:1142:25: note: declared here220 1142 | ObjectNameResolver* global_object_name_resolver = nullptr;221 | ^~~~~~~~~~~~~~~~~~~~~~~~~~~222[139/1871] CXX obj/gen/src/node/inspector/protocol/node_base.NodeWorker.o223In file included from ../../src/util.h:29,224 from ../../src/inspector/node_string.h:10,225 from gen/src/node/inspector/protocol/Forward.h:19,226 from gen/src/node/inspector/protocol/Protocol.h:18,227 from gen/src/node/inspector/protocol/NodeWorker.h:10,228 from gen/src/node/inspector/protocol/NodeWorker.cpp:7:229../../deps/v8/include/v8-profiler.h: In constructor 'v8::HeapProfiler::HeapSnapshotOptions::HeapSnapshotOptions()':230../../deps/v8/include/v8-profiler.h:1128:27: warning: 'v8::HeapProfiler::HeapSnapshotOptions::global_object_name_resolver' is deprecated: Use context_name_resolver callback instead. [-Wdeprecated-declarations]231 1128 | HeapSnapshotOptions() {}232 | ^233../../deps/v8/include/v8-profiler.h:1142:25: note: declared here234 1142 | ObjectNameResolver* global_object_name_resolver = nullptr;235 | ^~~~~~~~~~~~~~~~~~~~~~~~~~~236../../deps/v8/include/v8-profiler.h:1128:27: warning: 'v8::HeapProfiler::HeapSnapshotOptions::global_object_name_resolver' is deprecated: Use context_name_resolver callback instead. [-Wdeprecated-declarations]237 1128 | HeapSnapshotOptions() {}238 | ^239../../deps/v8/include/v8-profiler.h:1142:25: note: declared here240 1142 | ObjectNameResolver* global_object_name_resolver = nullptr;241 | ^~~~~~~~~~~~~~~~~~~~~~~~~~~242[140/1871] CXX obj/gen/src/node/inspector/protocol/node_base.Storage.o243In file included from ../../src/util.h:29,244 from ../../src/inspector/node_string.h:10,245 from gen/src/node/inspector/protocol/Forward.h:19,246 from gen/src/node/inspector/protocol/Protocol.h:18,247 from gen/src/node/inspector/protocol/Storage.h:10,248 from gen/src/node/inspector/protocol/Storage.cpp:7:249../../deps/v8/include/v8-profiler.h: In constructor 'v8::HeapProfiler::HeapSnapshotOptions::HeapSnapshotOptions()':250../../deps/v8/include/v8-profiler.h:1128:27: warning: 'v8::HeapProfiler::HeapSnapshotOptions::global_object_name_resolver' is deprecated: Use context_name_resolver callback instead. [-Wdeprecated-declarations]251 1128 | HeapSnapshotOptions() {}252 | ^253../../deps/v8/include/v8-profiler.h:1142:25: note: declared here254 1142 | ObjectNameResolver* global_object_name_resolver = nullptr;255 | ^~~~~~~~~~~~~~~~~~~~~~~~~~~256../../deps/v8/include/v8-profiler.h:1128:27: warning: 'v8::HeapProfiler::HeapSnapshotOptions::global_object_name_resolver' is deprecated: Use context_name_resolver callback instead. [-Wdeprecated-declarations]257 1128 | HeapSnapshotOptions() {}258 | ^259../../deps/v8/include/v8-profiler.h:1142:25: note: declared here260 1142 | ObjectNameResolver* global_object_name_resolver = nullptr;261 | ^~~~~~~~~~~~~~~~~~~~~~~~~~~262[141/1871] CXX obj/gen/src/node/inspector/protocol/node_base.IO.o263In file included from ../../src/util.h:29,264 from ../../src/inspector/node_string.h:10,265 from gen/src/node/inspector/protocol/Forward.h:19,266 from gen/src/node/inspector/protocol/Protocol.h:18,267 from gen/src/node/inspector/protocol/IO.h:10,268 from gen/src/node/inspector/protocol/IO.cpp:7:269../../deps/v8/include/v8-profiler.h: In constructor 'v8::HeapProfiler::HeapSnapshotOptions::HeapSnapshotOptions()':270../../deps/v8/include/v8-profiler.h:1128:27: warning: 'v8::HeapProfiler::HeapSnapshotOptions::global_object_name_resolver' is deprecated: Use context_name_resolver callback instead. [-Wdeprecated-declarations]271 1128 | HeapSnapshotOptions() {}272 | ^273../../deps/v8/include/v8-profiler.h:1142:25: note: declared here274 1142 | ObjectNameResolver* global_object_name_resolver = nullptr;275 | ^~~~~~~~~~~~~~~~~~~~~~~~~~~276../../deps/v8/include/v8-profiler.h:1128:27: warning: 'v8::HeapProfiler::HeapSnapshotOptions::global_object_name_resolver' is deprecated: Use context_name_resolver callback instead. [-Wdeprecated-declarations]277 1128 | HeapSnapshotOptions() {}278 | ^279../../deps/v8/include/v8-profiler.h:1142:25: note: declared here280 1142 | ObjectNameResolver* global_object_name_resolver = nullptr;281 | ^~~~~~~~~~~~~~~~~~~~~~~~~~~282[142/1871] CXX obj/src/api/node_base.utils.o283[143/1871] CXX obj/gen/src/node/inspector/protocol/node_base.NodeRuntime.o284In file included from ../../src/util.h:29,285 from ../../src/inspector/node_string.h:10,286 from gen/src/node/inspector/protocol/Forward.h:19,287 from gen/src/node/inspector/protocol/Protocol.h:18,288 from gen/src/node/inspector/protocol/NodeRuntime.h:10,289 from gen/src/node/inspector/protocol/NodeRuntime.cpp:7:290../../deps/v8/include/v8-profiler.h: In constructor 'v8::HeapProfiler::HeapSnapshotOptions::HeapSnapshotOptions()':291../../deps/v8/include/v8-profiler.h:1128:27: warning: 'v8::HeapProfiler::HeapSnapshotOptions::global_object_name_resolver' is deprecated: Use context_name_resolver callback instead. [-Wdeprecated-declarations]292 1128 | HeapSnapshotOptions() {}293 | ^294../../deps/v8/include/v8-profiler.h:1142:25: note: declared here295 1142 | ObjectNameResolver* global_object_name_resolver = nullptr;296 | ^~~~~~~~~~~~~~~~~~~~~~~~~~~297../../deps/v8/include/v8-profiler.h:1128:27: warning: 'v8::HeapProfiler::HeapSnapshotOptions::global_object_name_resolver' is deprecated: Use context_name_resolver callback instead. [-Wdeprecated-declarations]298 1128 | HeapSnapshotOptions() {}299 | ^300../../deps/v8/include/v8-profiler.h:1142:25: note: declared here301 1142 | ObjectNameResolver* global_object_name_resolver = nullptr;302 | ^~~~~~~~~~~~~~~~~~~~~~~~~~~303[144/1871] CXX obj/src/node_base.json_utils.o304[145/1871] CXX obj/src/node_base.internal_only_v8.o305In file included from ../../src/util.h:29,306 from ../../src/util-inl.h:33,307 from ../../src/internal_only_v8.cc:3:308../../deps/v8/include/v8-profiler.h: In constructor 'v8::HeapProfiler::HeapSnapshotOptions::HeapSnapshotOptions()':309../../deps/v8/include/v8-profiler.h:1128:27: warning: 'v8::HeapProfiler::HeapSnapshotOptions::global_object_name_resolver' is deprecated: Use context_name_resolver callback instead. [-Wdeprecated-declarations]310 1128 | HeapSnapshotOptions() {}311 | ^312../../deps/v8/include/v8-profiler.h:1142:25: note: declared here313 1142 | ObjectNameResolver* global_object_name_resolver = nullptr;314 | ^~~~~~~~~~~~~~~~~~~~~~~~~~~315../../deps/v8/include/v8-profiler.h:1128:27: warning: 'v8::HeapProfiler::HeapSnapshotOptions::global_object_name_resolver' is deprecated: Use context_name_resolver callback instead. [-Wdeprecated-declarations]316 1128 | HeapSnapshotOptions() {}317 | ^318../../deps/v8/include/v8-profiler.h:1142:25: note: declared here319 1142 | ObjectNameResolver* global_object_name_resolver = nullptr;320 | ^~~~~~~~~~~~~~~~~~~~~~~~~~~321[146/1871] CXX obj/gen/src/node/inspector/protocol/node_base.Target.o322In file included from ../../src/util.h:29,323 from ../../src/inspector/node_string.h:10,324 from gen/src/node/inspector/protocol/Forward.h:19,325 from gen/src/node/inspector/protocol/Protocol.h:18,326 from gen/src/node/inspector/protocol/Target.h:10,327 from gen/src/node/inspector/protocol/Target.cpp:7:328../../deps/v8/include/v8-profiler.h: In constructor 'v8::HeapProfiler::HeapSnapshotOptions::HeapSnapshotOptions()':329../../deps/v8/include/v8-profiler.h:1128:27: warning: 'v8::HeapProfiler::HeapSnapshotOptions::global_object_name_resolver' is deprecated: Use context_name_resolver callback instead. [-Wdeprecated-declarations]330 1128 | HeapSnapshotOptions() {}331 | ^332../../deps/v8/include/v8-profiler.h:1142:25: note: declared here333 1142 | ObjectNameResolver* global_object_name_resolver = nullptr;334 | ^~~~~~~~~~~~~~~~~~~~~~~~~~~335../../deps/v8/include/v8-profiler.h:1128:27: warning: 'v8::HeapProfiler::HeapSnapshotOptions::global_object_name_resolver' is deprecated: Use context_name_resolver callback instead. [-Wdeprecated-declarations]336 1128 | HeapSnapshotOptions() {}337 | ^338../../deps/v8/include/v8-profiler.h:1142:25: note: declared here339 1142 | ObjectNameResolver* global_object_name_resolver = nullptr;340 | ^~~~~~~~~~~~~~~~~~~~~~~~~~~341[147/1871] CXX obj/src/node_base.node_debug.o342[148/1871] CXX obj/gen/src/node/inspector/protocol/node_base.Network.o343In file included from ../../src/util.h:29,344 from ../../src/inspector/node_string.h:10,345 from gen/src/node/inspector/protocol/Forward.h:19,346 from gen/src/node/inspector/protocol/Protocol.h:18,347 from gen/src/node/inspector/protocol/Network.h:10,348 from gen/src/node/inspector/protocol/Network.cpp:7:349../../deps/v8/include/v8-profiler.h: In constructor 'v8::HeapProfiler::HeapSnapshotOptions::HeapSnapshotOptions()':350../../deps/v8/include/v8-profiler.h:1128:27: warning: 'v8::HeapProfiler::HeapSnapshotOptions::global_object_name_resolver' is deprecated: Use context_name_resolver callback instead. [-Wdeprecated-declarations]351 1128 | HeapSnapshotOptions() {}352 | ^353../../deps/v8/include/v8-profiler.h:1142:25: note: declared here354 1142 | ObjectNameResolver* global_object_name_resolver = nullptr;355 | ^~~~~~~~~~~~~~~~~~~~~~~~~~~356../../deps/v8/include/v8-profiler.h:1128:27: warning: 'v8::HeapProfiler::HeapSnapshotOptions::global_object_name_resolver' is deprecated: Use context_name_resolver callback instead. [-Wdeprecated-declarations]357 1128 | HeapSnapshotOptions() {}358 | ^359../../deps/v8/include/v8-profiler.h:1142:25: note: declared here360 1142 | ObjectNameResolver* global_object_name_resolver = nullptr;361 | ^~~~~~~~~~~~~~~~~~~~~~~~~~~362[149/1871] CXX obj/deps/ncrypto/ncrypto.ncrypto.o363[150/1871] CXX obj/gen/src/node/inspector/protocol/node_base.Protocol.o364In file included from ../../src/util.h:29,365 from ../../src/inspector/node_string.h:10,366 from gen/src/node/inspector/protocol/Forward.h:19,367 from gen/src/node/inspector/protocol/Protocol.h:18,368 from gen/src/node/inspector/protocol/Protocol.cpp:7:369../../deps/v8/include/v8-profiler.h: In constructor 'v8::HeapProfiler::HeapSnapshotOptions::HeapSnapshotOptions()':370../../deps/v8/include/v8-profiler.h:1128:27: warning: 'v8::HeapProfiler::HeapSnapshotOptions::global_object_name_resolver' is deprecated: Use context_name_resolver callback instead. [-Wdeprecated-declarations]371 1128 | HeapSnapshotOptions() {}372 | ^373../../deps/v8/include/v8-profiler.h:1142:25: note: declared here374 1142 | ObjectNameResolver* global_object_name_resolver = nullptr;375 | ^~~~~~~~~~~~~~~~~~~~~~~~~~~376../../deps/v8/include/v8-profiler.h:1128:27: warning: 'v8::HeapProfiler::HeapSnapshotOptions::global_object_name_resolver' is deprecated: Use context_name_resolver callback instead. [-Wdeprecated-declarations]377 1128 | HeapSnapshotOptions() {}378 | ^379../../deps/v8/include/v8-profiler.h:1142:25: note: declared here380 1142 | ObjectNameResolver* global_object_name_resolver = nullptr;381 | ^~~~~~~~~~~~~~~~~~~~~~~~~~~382[151/1871] CXX obj/src/node_base.cleanup_queue.o383In file included from ../../src/memory_tracker.h:6,384 from ../../src/cleanup_queue.h:11,385 from ../../src/cleanup_queue.cc:1:386../../deps/v8/include/v8-profiler.h: In constructor 'v8::HeapProfiler::HeapSnapshotOptions::HeapSnapshotOptions()':387../../deps/v8/include/v8-profiler.h:1128:27: warning: 'v8::HeapProfiler::HeapSnapshotOptions::global_object_name_resolver' is deprecated: Use context_name_resolver callback instead. [-Wdeprecated-declarations]388 1128 | HeapSnapshotOptions() {}389 | ^390../../deps/v8/include/v8-profiler.h:1142:25: note: declared here391 1142 | ObjectNameResolver* global_object_name_resolver = nullptr;392 | ^~~~~~~~~~~~~~~~~~~~~~~~~~~393../../deps/v8/include/v8-profiler.h:1128:27: warning: 'v8::HeapProfiler::HeapSnapshotOptions::global_object_name_resolver' is deprecated: Use context_name_resolver callback instead. [-Wdeprecated-declarations]394 1128 | HeapSnapshotOptions() {}395 | ^396../../deps/v8/include/v8-profiler.h:1142:25: note: declared here397 1142 | ObjectNameResolver* global_object_name_resolver = nullptr;398 | ^~~~~~~~~~~~~~~~~~~~~~~~~~~399[152/1871] CXX obj/gen/src/node/inspector/protocol/node_base.NodeTracing.o400In file included from ../../src/util.h:29,401 from ../../src/inspector/node_string.h:10,402 from gen/src/node/inspector/protocol/Forward.h:19,403 from gen/src/node/inspector/protocol/Protocol.h:18,404 from gen/src/node/inspector/protocol/NodeTracing.h:10,405 from gen/src/node/inspector/protocol/NodeTracing.cpp:7:406../../deps/v8/include/v8-profiler.h: In constructor 'v8::HeapProfiler::HeapSnapshotOptions::HeapSnapshotOptions()':407../../deps/v8/include/v8-profiler.h:1128:27: warning: 'v8::HeapProfiler::HeapSnapshotOptions::global_object_name_resolver' is deprecated: Use context_name_resolver callback instead. [-Wdeprecated-declarations]408 1128 | HeapSnapshotOptions() {}409 | ^410../../deps/v8/include/v8-profiler.h:1142:25: note: declared here411 1142 | ObjectNameResolver* global_object_name_resolver = nullptr;412 | ^~~~~~~~~~~~~~~~~~~~~~~~~~~413../../deps/v8/include/v8-profiler.h:1128:27: warning: 'v8::HeapProfiler::HeapSnapshotOptions::global_object_name_resolver' is deprecated: Use context_name_resolver callback instead. [-Wdeprecated-declarations]414 1128 | HeapSnapshotOptions() {}415 | ^416../../deps/v8/include/v8-profiler.h:1142:25: note: declared here417 1142 | ObjectNameResolver* global_object_name_resolver = nullptr;418 | ^~~~~~~~~~~~~~~~~~~~~~~~~~~419[153/1871] CXX obj/src/node_base.handle_wrap.o420In file included from ../../src/memory_tracker.h:6,421 from ../../src/base_object.h:29,422 from ../../src/async_wrap.h:27,423 from ../../src/handle_wrap.h:27,424 from ../../src/handle_wrap.cc:22:425../../deps/v8/include/v8-profiler.h: In constructor 'v8::HeapProfiler::HeapSnapshotOptions::HeapSnapshotOptions()':426../../deps/v8/include/v8-profiler.h:1128:27: warning: 'v8::HeapProfiler::HeapSnapshotOptions::global_object_name_resolver' is deprecated: Use context_name_resolver callback instead. [-Wdeprecated-declarations]427 1128 | HeapSnapshotOptions() {}428 | ^429../../deps/v8/include/v8-profiler.h:1142:25: note: declared here430 1142 | ObjectNameResolver* global_object_name_resolver = nullptr;431 | ^~~~~~~~~~~~~~~~~~~~~~~~~~~432../../deps/v8/include/v8-profiler.h:1128:27: warning: 'v8::HeapProfiler::HeapSnapshotOptions::global_object_name_resolver' is deprecated: Use context_name_resolver callback instead. [-Wdeprecated-declarations]433 1128 | HeapSnapshotOptions() {}434 | ^435../../deps/v8/include/v8-profiler.h:1142:25: note: declared here436 1142 | ObjectNameResolver* global_object_name_resolver = nullptr;437 | ^~~~~~~~~~~~~~~~~~~~~~~~~~~438[154/1871] CXX obj/src/api/node_base.embed_helpers.o439In file included from ../../src/memory_tracker.h:6,440 from ../../src/base_object.h:29,441 from ../../src/async_wrap.h:27,442 from ../../src/debug_utils.h:6,443 from ../../src/debug_utils-inl.h:6,444 from ../../src/api/embed_helpers.cc:1:445../../deps/v8/include/v8-profiler.h: In constructor 'v8::HeapProfiler::HeapSnapshotOptions::HeapSnapshotOptions()':446../../deps/v8/include/v8-profiler.h:1128:27: warning: 'v8::HeapProfiler::HeapSnapshotOptions::global_object_name_resolver' is deprecated: Use context_name_resolver callback instead. [-Wdeprecated-declarations]447 1128 | HeapSnapshotOptions() {}448 | ^449../../deps/v8/include/v8-profiler.h:1142:25: note: declared here450 1142 | ObjectNameResolver* global_object_name_resolver = nullptr;451 | ^~~~~~~~~~~~~~~~~~~~~~~~~~~452../../deps/v8/include/v8-profiler.h:1128:27: warning: 'v8::HeapProfiler::HeapSnapshotOptions::global_object_name_resolver' is deprecated: Use context_name_resolver callback instead. [-Wdeprecated-declarations]453 1128 | HeapSnapshotOptions() {}454 | ^455../../deps/v8/include/v8-profiler.h:1142:25: note: declared here456 1142 | ObjectNameResolver* global_object_name_resolver = nullptr;457 | ^~~~~~~~~~~~~~~~~~~~~~~~~~~458[155/1871] CXX obj/src/node_base.base_object.o459In file included from ../../src/memory_tracker.h:6,460 from ../../src/base_object.h:29,461 from ../../src/base_object.cc:1:462../../deps/v8/include/v8-profiler.h: In constructor 'v8::HeapProfiler::HeapSnapshotOptions::HeapSnapshotOptions()':463../../deps/v8/include/v8-profiler.h:1128:27: warning: 'v8::HeapProfiler::HeapSnapshotOptions::global_object_name_resolver' is deprecated: Use context_name_resolver callback instead. [-Wdeprecated-declarations]464 1128 | HeapSnapshotOptions() {}465 | ^466../../deps/v8/include/v8-profiler.h:1142:25: note: declared here467 1142 | ObjectNameResolver* global_object_name_resolver = nullptr;468 | ^~~~~~~~~~~~~~~~~~~~~~~~~~~469../../deps/v8/include/v8-profiler.h:1128:27: warning: 'v8::HeapProfiler::HeapSnapshotOptions::global_object_name_resolver' is deprecated: Use context_name_resolver callback instead. [-Wdeprecated-declarations]470 1128 | HeapSnapshotOptions() {}471 | ^472../../deps/v8/include/v8-profiler.h:1142:25: note: declared here473 1142 | ObjectNameResolver* global_object_name_resolver = nullptr;474 | ^~~~~~~~~~~~~~~~~~~~~~~~~~~475[156/1871] CXX obj/src/node_base.histogram.o476In file included from ../../src/memory_tracker.h:6,477 from ../../src/base_object.h:29,478 from ../../src/histogram.h:7,479 from ../../src/histogram.cc:1:480../../deps/v8/include/v8-profiler.h: In constructor 'v8::HeapProfiler::HeapSnapshotOptions::HeapSnapshotOptions()':481../../deps/v8/include/v8-profiler.h:1128:27: warning: 'v8::HeapProfiler::HeapSnapshotOptions::global_object_name_resolver' is deprecated: Use context_name_resolver callback instead. [-Wdeprecated-declarations]482 1128 | HeapSnapshotOptions() {}483 | ^484../../deps/v8/include/v8-profiler.h:1142:25: note: declared here485 1142 | ObjectNameResolver* global_object_name_resolver = nullptr;486 | ^~~~~~~~~~~~~~~~~~~~~~~~~~~487../../deps/v8/include/v8-profiler.h:1128:27: warning: 'v8::HeapProfiler::HeapSnapshotOptions::global_object_name_resolver' is deprecated: Use context_name_resolver callback instead. [-Wdeprecated-declarations]488 1128 | HeapSnapshotOptions() {}489 | ^490../../deps/v8/include/v8-profiler.h:1142:25: note: declared here491 1142 | ObjectNameResolver* global_object_name_resolver = nullptr;492 | ^~~~~~~~~~~~~~~~~~~~~~~~~~~493[157/1871] CXX obj/src/node_base.connect_wrap.o494In file included from ../../src/memory_tracker.h:6,495 from ../../src/base_object.h:29,496 from ../../src/async_wrap.h:27,497 from ../../src/req_wrap.h:6,498 from ../../src/req_wrap-inl.h:6,499 from ../../src/connect_wrap.h:6,500 from ../../src/connect_wrap.cc:1:501../../deps/v8/include/v8-profiler.h: In constructor 'v8::HeapProfiler::HeapSnapshotOptions::HeapSnapshotOptions()':502../../deps/v8/include/v8-profiler.h:1128:27: warning: 'v8::HeapProfiler::HeapSnapshotOptions::global_object_name_resolver' is deprecated: Use context_name_resolver callback instead. [-Wdeprecated-declarations]503 1128 | HeapSnapshotOptions() {}504 | ^505../../deps/v8/include/v8-profiler.h:1142:25: note: declared here506 1142 | ObjectNameResolver* global_object_name_resolver = nullptr;507 | ^~~~~~~~~~~~~~~~~~~~~~~~~~~508../../deps/v8/include/v8-profiler.h:1128:27: warning: 'v8::HeapProfiler::HeapSnapshotOptions::global_object_name_resolver' is deprecated: Use context_name_resolver callback instead. [-Wdeprecated-declarations]509 1128 | HeapSnapshotOptions() {}510 | ^511../../deps/v8/include/v8-profiler.h:1142:25: note: declared here512 1142 | ObjectNameResolver* global_object_name_resolver = nullptr;513 | ^~~~~~~~~~~~~~~~~~~~~~~~~~~514[158/1871] CXX obj/src/node_base.node_file_utils.o515In file included from ../../src/util.h:29,516 from ../../src/util-inl.h:33,517 from ../../src/node_file_utils.cc:10:518../../deps/v8/include/v8-profiler.h: In constructor 'v8::HeapProfiler::HeapSnapshotOptions::HeapSnapshotOptions()':519../../deps/v8/include/v8-profiler.h:1128:27: warning: 'v8::HeapProfiler::HeapSnapshotOptions::global_object_name_resolver' is deprecated: Use context_name_resolver callback instead. [-Wdeprecated-declarations]520 1128 | HeapSnapshotOptions() {}521 | ^522../../deps/v8/include/v8-profiler.h:1142:25: note: declared here523 1142 | ObjectNameResolver* global_object_name_resolver = nullptr;524 | ^~~~~~~~~~~~~~~~~~~~~~~~~~~525../../deps/v8/include/v8-profiler.h:1128:27: warning: 'v8::HeapProfiler::HeapSnapshotOptions::global_object_name_resolver' is deprecated: Use context_name_resolver callback instead. [-Wdeprecated-declarations]526 1128 | HeapSnapshotOptions() {}527 | ^528../../deps/v8/include/v8-profiler.h:1142:25: note: declared here529 1142 | ObjectNameResolver* global_object_name_resolver = nullptr;530 | ^~~~~~~~~~~~~~~~~~~~~~~~~~~531../../src/node_file_utils.cc: In function 'int node::WriteFileSync(const char*, uv_buf_t*, size_t)':532../../src/node_file_utils.cc:62:32: warning: enumerated and non-enumerated type in conditional expression [-Wextra]533 62 | int err = req.result < 0 ? req.result : UV_EIO;534 | ~~~~~~~~~~~~~~~^~~~~~~~~~~~~~~~~~~~~535[159/1871] CXX obj/src/node_base.compile_cache.o536In file included from ../../src/memory_tracker.h:6,537 from ../../src/base_object.h:29,538 from ../../src/async_wrap.h:27,539 from ../../src/debug_utils.h:6,540 from ../../src/debug_utils-inl.h:6,541 from ../../src/compile_cache.cc:3:542../../deps/v8/include/v8-profiler.h: In constructor 'v8::HeapProfiler::HeapSnapshotOptions::HeapSnapshotOptions()':543../../deps/v8/include/v8-profiler.h:1128:27: warning: 'v8::HeapProfiler::HeapSnapshotOptions::global_object_name_resolver' is deprecated: Use context_name_resolver callback instead. [-Wdeprecated-declarations]544 1128 | HeapSnapshotOptions() {}545 | ^546../../deps/v8/include/v8-profiler.h:1142:25: note: declared here547 1142 | ObjectNameResolver* global_object_name_resolver = nullptr;548 | ^~~~~~~~~~~~~~~~~~~~~~~~~~~549../../deps/v8/include/v8-profiler.h:1128:27: warning: 'v8::HeapProfiler::HeapSnapshotOptions::global_object_name_resolver' is deprecated: Use context_name_resolver callback instead. [-Wdeprecated-declarations]550 1128 | HeapSnapshotOptions() {}551 | ^552../../deps/v8/include/v8-profiler.h:1142:25: note: declared here553 1142 | ObjectNameResolver* global_object_name_resolver = nullptr;554 | ^~~~~~~~~~~~~~~~~~~~~~~~~~~555[160/1871] CXX obj/src/node_base.heap_utils.o556In file included from ../../src/memory_tracker.h:6,557 from ../../src/aliased_buffer.h:7,558 from ../../src/env.h:27,559 from ../../src/node_internals.h:27,560 from ../../src/diagnosticfilename-inl.h:6,561 from ../../src/heap_utils.cc:1:562../../deps/v8/include/v8-profiler.h: In constructor 'v8::HeapProfiler::HeapSnapshotOptions::HeapSnapshotOptions()':563../../deps/v8/include/v8-profiler.h:1128:27: warning: 'v8::HeapProfiler::HeapSnapshotOptions::global_object_name_resolver' is deprecated: Use context_name_resolver callback instead. [-Wdeprecated-declarations]564 1128 | HeapSnapshotOptions() {}565 | ^566../../deps/v8/include/v8-profiler.h:1142:25: note: declared here567 1142 | ObjectNameResolver* global_object_name_resolver = nullptr;568 | ^~~~~~~~~~~~~~~~~~~~~~~~~~~569../../deps/v8/include/v8-profiler.h:1128:27: warning: 'v8::HeapProfiler::HeapSnapshotOptions::global_object_name_resolver' is deprecated: Use context_name_resolver callback instead. [-Wdeprecated-declarations]570 1128 | HeapSnapshotOptions() {}571 | ^572../../deps/v8/include/v8-profiler.h:1142:25: note: declared here573 1142 | ObjectNameResolver* global_object_name_resolver = nullptr;574 | ^~~~~~~~~~~~~~~~~~~~~~~~~~~575[161/1871] CXX obj/src/node_base.module_wrap.o576In file included from ../../src/memory_tracker.h:6,577 from ../../src/base_object.h:29,578 from ../../src/module_wrap.h:10,579 from ../../src/module_wrap.cc:1:580../../deps/v8/include/v8-profiler.h: In constructor 'v8::HeapProfiler::HeapSnapshotOptions::HeapSnapshotOptions()':581../../deps/v8/include/v8-profiler.h:1128:27: warning: 'v8::HeapProfiler::HeapSnapshotOptions::global_object_name_resolver' is deprecated: Use context_name_resolver callback instead. [-Wdeprecated-declarations]582 1128 | HeapSnapshotOptions() {}583 | ^584../../deps/v8/include/v8-profiler.h:1142:25: note: declared here585 1142 | ObjectNameResolver* global_object_name_resolver = nullptr;586 | ^~~~~~~~~~~~~~~~~~~~~~~~~~~587../../deps/v8/include/v8-profiler.h:1128:27: warning: 'v8::HeapProfiler::HeapSnapshotOptions::global_object_name_resolver' is deprecated: Use context_name_resolver callback instead. [-Wdeprecated-declarations]588 1128 | HeapSnapshotOptions() {}589 | ^590../../deps/v8/include/v8-profiler.h:1142:25: note: declared here591 1142 | ObjectNameResolver* global_object_name_resolver = nullptr;592 | ^~~~~~~~~~~~~~~~~~~~~~~~~~~593[162/1871] CXX obj/src/node_base.async_context_frame.o594In file included from ../../src/memory_tracker.h:6,595 from ../../src/base_object.h:29,596 from ../../src/async_context_frame.h:6,597 from ../../src/async_context_frame.cc:1:598../../deps/v8/include/v8-profiler.h: In constructor 'v8::HeapProfiler::HeapSnapshotOptions::HeapSnapshotOptions()':599../../deps/v8/include/v8-profiler.h:1128:27: warning: 'v8::HeapProfiler::HeapSnapshotOptions::global_object_name_resolver' is deprecated: Use context_name_resolver callback instead. [-Wdeprecated-declarations]600 1128 | HeapSnapshotOptions() {}601 | ^602../../deps/v8/include/v8-profiler.h:1142:25: note: declared here603 1142 | ObjectNameResolver* global_object_name_resolver = nullptr;604 | ^~~~~~~~~~~~~~~~~~~~~~~~~~~605../../deps/v8/include/v8-profiler.h:1128:27: warning: 'v8::HeapProfiler::HeapSnapshotOptions::global_object_name_resolver' is deprecated: Use context_name_resolver callback instead. [-Wdeprecated-declarations]606 1128 | HeapSnapshotOptions() {}607 | ^608../../deps/v8/include/v8-profiler.h:1142:25: note: declared here609 1142 | ObjectNameResolver* global_object_name_resolver = nullptr;610 | ^~~~~~~~~~~~~~~~~~~~~~~~~~~611[163/1871] CXX obj/src/api/node_base.hooks.o612In file included from ../../src/memory_tracker.h:6,613 from ../../src/aliased_buffer.h:7,614 from ../../src/aliased_buffer-inl.h:6,615 from ../../src/env-inl.h:27,616 from ../../src/api/hooks.cc:1:617../../deps/v8/include/v8-profiler.h: In constructor 'v8::HeapProfiler::HeapSnapshotOptions::HeapSnapshotOptions()':618../../deps/v8/include/v8-profiler.h:1128:27: warning: 'v8::HeapProfiler::HeapSnapshotOptions::global_object_name_resolver' is deprecated: Use context_name_resolver callback instead. [-Wdeprecated-declarations]619 1128 | HeapSnapshotOptions() {}620 | ^621../../deps/v8/include/v8-profiler.h:1142:25: note: declared here622 1142 | ObjectNameResolver* global_object_name_resolver = nullptr;623 | ^~~~~~~~~~~~~~~~~~~~~~~~~~~624../../deps/v8/include/v8-profiler.h:1128:27: warning: 'v8::HeapProfiler::HeapSnapshotOptions::global_object_name_resolver' is deprecated: Use context_name_resolver callback instead. [-Wdeprecated-declarations]625 1128 | HeapSnapshotOptions() {}626 | ^627../../deps/v8/include/v8-profiler.h:1142:25: note: declared here628 1142 | ObjectNameResolver* global_object_name_resolver = nullptr;629 | ^~~~~~~~~~~~~~~~~~~~~~~~~~~630[164/1871] CXX obj/src/node_base.node.o631In file included from ../../src/memory_tracker.h:6,632 from ../../src/aliased_buffer.h:7,633 from ../../src/env.h:27,634 from ../../src/node_internals.h:27,635 from ../../src/node_config_file.h:12,636 from ../../src/node.cc:23:637../../deps/v8/include/v8-profiler.h: In constructor 'v8::HeapProfiler::HeapSnapshotOptions::HeapSnapshotOptions()':638../../deps/v8/include/v8-profiler.h:1128:27: warning: 'v8::HeapProfiler::HeapSnapshotOptions::global_object_name_resolver' is deprecated: Use context_name_resolver callback instead. [-Wdeprecated-declarations]639 1128 | HeapSnapshotOptions() {}640 | ^641../../deps/v8/include/v8-profiler.h:1142:25: note: declared here642 1142 | ObjectNameResolver* global_object_name_resolver = nullptr;643 | ^~~~~~~~~~~~~~~~~~~~~~~~~~~644../../deps/v8/include/v8-profiler.h:1128:27: warning: 'v8::HeapProfiler::HeapSnapshotOptions::global_object_name_resolver' is deprecated: Use context_name_resolver callback instead. [-Wdeprecated-declarations]645 1128 | HeapSnapshotOptions() {}646 | ^647../../deps/v8/include/v8-profiler.h:1142:25: note: declared here648 1142 | ObjectNameResolver* global_object_name_resolver = nullptr;649 | ^~~~~~~~~~~~~~~~~~~~~~~~~~~650[165/1871] CXX obj/src/api/node_base.async_resource.o651In file included from ../../src/memory_tracker.h:6,652 from ../../src/base_object.h:29,653 from ../../src/async_context_frame.h:6,654 from ../../src/api/async_resource.cc:1:655../../deps/v8/include/v8-profiler.h: In constructor 'v8::HeapProfiler::HeapSnapshotOptions::HeapSnapshotOptions()':656../../deps/v8/include/v8-profiler.h:1128:27: warning: 'v8::HeapProfiler::HeapSnapshotOptions::global_object_name_resolver' is deprecated: Use context_name_resolver callback instead. [-Wdeprecated-declarations]657 1128 | HeapSnapshotOptions() {}658 | ^659../../deps/v8/include/v8-profiler.h:1142:25: note: declared here660 1142 | ObjectNameResolver* global_object_name_resolver = nullptr;661 | ^~~~~~~~~~~~~~~~~~~~~~~~~~~662../../deps/v8/include/v8-profiler.h:1128:27: warning: 'v8::HeapProfiler::HeapSnapshotOptions::global_object_name_resolver' is deprecated: Use context_name_resolver callback instead. [-Wdeprecated-declarations]663 1128 | HeapSnapshotOptions() {}664 | ^665../../deps/v8/include/v8-profiler.h:1142:25: note: declared here666 1142 | ObjectNameResolver* global_object_name_resolver = nullptr;667 | ^~~~~~~~~~~~~~~~~~~~~~~~~~~668[166/1871] CXX obj/src/api/node_base.callback.o669In file included from ../../src/memory_tracker.h:6,670 from ../../src/base_object.h:29,671 from ../../src/async_context_frame.h:6,672 from ../../src/api/callback.cc:1:673../../deps/v8/include/v8-profiler.h: In constructor 'v8::HeapProfiler::HeapSnapshotOptions::HeapSnapshotOptions()':674../../deps/v8/include/v8-profiler.h:1128:27: warning: 'v8::HeapProfiler::HeapSnapshotOptions::global_object_name_resolver' is deprecated: Use context_name_resolver callback instead. [-Wdeprecated-declarations]675 1128 | HeapSnapshotOptions() {}676 | ^677../../deps/v8/include/v8-profiler.h:1142:25: note: declared here678 1142 | ObjectNameResolver* global_object_name_resolver = nullptr;679 | ^~~~~~~~~~~~~~~~~~~~~~~~~~~680../../deps/v8/include/v8-profiler.h:1128:27: warning: 'v8::HeapProfiler::HeapSnapshotOptions::global_object_name_resolver' is deprecated: Use context_name_resolver callback instead. [-Wdeprecated-declarations]681 1128 | HeapSnapshotOptions() {}682 | ^683../../deps/v8/include/v8-profiler.h:1142:25: note: declared here684 1142 | ObjectNameResolver* global_object_name_resolver = nullptr;685 | ^~~~~~~~~~~~~~~~~~~~~~~~~~~686[167/1871] CXX obj/src/node_base.node_constants.o687In file included from ../../src/memory_tracker.h:6,688 from ../../src/aliased_buffer.h:7,689 from ../../src/aliased_buffer-inl.h:6,690 from ../../src/env-inl.h:27,691 from ../../src/node_constants.cc:22:692../../deps/v8/include/v8-profiler.h: In constructor 'v8::HeapProfiler::HeapSnapshotOptions::HeapSnapshotOptions()':693../../deps/v8/include/v8-profiler.h:1128:27: warning: 'v8::HeapProfiler::HeapSnapshotOptions::global_object_name_resolver' is deprecated: Use context_name_resolver callback instead. [-Wdeprecated-declarations]694 1128 | HeapSnapshotOptions() {}695 | ^696../../deps/v8/include/v8-profiler.h:1142:25: note: declared here697 1142 | ObjectNameResolver* global_object_name_resolver = nullptr;698 | ^~~~~~~~~~~~~~~~~~~~~~~~~~~699../../deps/v8/include/v8-profiler.h:1128:27: warning: 'v8::HeapProfiler::HeapSnapshotOptions::global_object_name_resolver' is deprecated: Use context_name_resolver callback instead. [-Wdeprecated-declarations]700 1128 | HeapSnapshotOptions() {}701 | ^702../../deps/v8/include/v8-profiler.h:1142:25: note: declared here703 1142 | ObjectNameResolver* global_object_name_resolver = nullptr;704 | ^~~~~~~~~~~~~~~~~~~~~~~~~~~705[168/1871] CXX obj/src/node_base.js_udp_wrap.o706In file included from ../../src/memory_tracker.h:6,707 from ../../src/base_object.h:29,708 from ../../src/async_wrap.h:27,709 from ../../src/handle_wrap.h:27,710 from ../../src/udp_wrap.h:27,711 from ../../src/js_udp_wrap.cc:1:712../../deps/v8/include/v8-profiler.h: In constructor 'v8::HeapProfiler::HeapSnapshotOptions::HeapSnapshotOptions()':713../../deps/v8/include/v8-profiler.h:1128:27: warning: 'v8::HeapProfiler::HeapSnapshotOptions::global_object_name_resolver' is deprecated: Use context_name_resolver callback instead. [-Wdeprecated-declarations]714 1128 | HeapSnapshotOptions() {}715 | ^716../../deps/v8/include/v8-profiler.h:1142:25: note: declared here717 1142 | ObjectNameResolver* global_object_name_resolver = nullptr;718 | ^~~~~~~~~~~~~~~~~~~~~~~~~~~719../../deps/v8/include/v8-profiler.h:1128:27: warning: 'v8::HeapProfiler::HeapSnapshotOptions::global_object_name_resolver' is deprecated: Use context_name_resolver callback instead. [-Wdeprecated-declarations]720 1128 | HeapSnapshotOptions() {}721 | ^722../../deps/v8/include/v8-profiler.h:1142:25: note: declared here723 1142 | ObjectNameResolver* global_object_name_resolver = nullptr;724 | ^~~~~~~~~~~~~~~~~~~~~~~~~~~725[169/1871] CXX obj/src/node_base.fs_event_wrap.o726In file included from ../../src/memory_tracker.h:6,727 from ../../src/base_object.h:29,728 from ../../src/async_wrap.h:27,729 from ../../src/async_wrap-inl.h:27,730 from ../../src/fs_event_wrap.cc:22:731../../deps/v8/include/v8-profiler.h: In constructor 'v8::HeapProfiler::HeapSnapshotOptions::HeapSnapshotOptions()':732../../deps/v8/include/v8-profiler.h:1128:27: warning: 'v8::HeapProfiler::HeapSnapshotOptions::global_object_name_resolver' is deprecated: Use context_name_resolver callback instead. [-Wdeprecated-declarations]733 1128 | HeapSnapshotOptions() {}734 | ^735../../deps/v8/include/v8-profiler.h:1142:25: note: declared here736 1142 | ObjectNameResolver* global_object_name_resolver = nullptr;737 | ^~~~~~~~~~~~~~~~~~~~~~~~~~~738../../deps/v8/include/v8-profiler.h:1128:27: warning: 'v8::HeapProfiler::HeapSnapshotOptions::global_object_name_resolver' is deprecated: Use context_name_resolver callback instead. [-Wdeprecated-declarations]739 1128 | HeapSnapshotOptions() {}740 | ^741../../deps/v8/include/v8-profiler.h:1142:25: note: declared here742 1142 | ObjectNameResolver* global_object_name_resolver = nullptr;743 | ^~~~~~~~~~~~~~~~~~~~~~~~~~~744[170/1871] CXX obj/src/api/node_base.environment.o745In file included from ../../src/memory_tracker.h:6,746 from ../../src/base_object.h:29,747 from ../../src/async_wrap.h:27,748 from ../../src/crypto/crypto_util.h:6,749 from ../../src/api/environment.cc:3:750../../deps/v8/include/v8-profiler.h: In constructor 'v8::HeapProfiler::HeapSnapshotOptions::HeapSnapshotOptions()':751../../deps/v8/include/v8-profiler.h:1128:27: warning: 'v8::HeapProfiler::HeapSnapshotOptions::global_object_name_resolver' is deprecated: Use context_name_resolver callback instead. [-Wdeprecated-declarations]752 1128 | HeapSnapshotOptions() {}753 | ^754../../deps/v8/include/v8-profiler.h:1142:25: note: declared here755 1142 | ObjectNameResolver* global_object_name_resolver = nullptr;756 | ^~~~~~~~~~~~~~~~~~~~~~~~~~~757../../deps/v8/include/v8-profiler.h:1128:27: warning: 'v8::HeapProfiler::HeapSnapshotOptions::global_object_name_resolver' is deprecated: Use context_name_resolver callback instead. [-Wdeprecated-declarations]758 1128 | HeapSnapshotOptions() {}759 | ^760../../deps/v8/include/v8-profiler.h:1142:25: note: declared here761 1142 | ObjectNameResolver* global_object_name_resolver = nullptr;762 | ^~~~~~~~~~~~~~~~~~~~~~~~~~~763[171/1871] CXX obj/src/node_base.async_wrap.o764In file included from ../../src/memory_tracker.h:6,765 from ../../src/base_object.h:29,766 from ../../src/async_wrap.h:27,767 from ../../src/async_wrap.cc:22:768../../deps/v8/include/v8-profiler.h: In constructor 'v8::HeapProfiler::HeapSnapshotOptions::HeapSnapshotOptions()':769../../deps/v8/include/v8-profiler.h:1128:27: warning: 'v8::HeapProfiler::HeapSnapshotOptions::global_object_name_resolver' is deprecated: Use context_name_resolver callback instead. [-Wdeprecated-declarations]770 1128 | HeapSnapshotOptions() {}771 | ^772../../deps/v8/include/v8-profiler.h:1142:25: note: declared here773 1142 | ObjectNameResolver* global_object_name_resolver = nullptr;774 | ^~~~~~~~~~~~~~~~~~~~~~~~~~~775../../deps/v8/include/v8-profiler.h:1128:27: warning: 'v8::HeapProfiler::HeapSnapshotOptions::global_object_name_resolver' is deprecated: Use context_name_resolver callback instead. [-Wdeprecated-declarations]776 1128 | HeapSnapshotOptions() {}777 | ^778../../deps/v8/include/v8-profiler.h:1142:25: note: declared here779 1142 | ObjectNameResolver* global_object_name_resolver = nullptr;780 | ^~~~~~~~~~~~~~~~~~~~~~~~~~~781[172/1871] CXX obj/src/node_base.node_credentials.o782In file included from ../../src/memory_tracker.h:6,783 from ../../src/aliased_buffer.h:7,784 from ../../src/aliased_buffer-inl.h:6,785 from ../../src/env-inl.h:27,786 from ../../src/node_credentials.cc:1:787../../deps/v8/include/v8-profiler.h: In constructor 'v8::HeapProfiler::HeapSnapshotOptions::HeapSnapshotOptions()':788../../deps/v8/include/v8-profiler.h:1128:27: warning: 'v8::HeapProfiler::HeapSnapshotOptions::global_object_name_resolver' is deprecated: Use context_name_resolver callback instead. [-Wdeprecated-declarations]789 1128 | HeapSnapshotOptions() {}790 | ^791../../deps/v8/include/v8-profiler.h:1142:25: note: declared here792 1142 | ObjectNameResolver* global_object_name_resolver = nullptr;793 | ^~~~~~~~~~~~~~~~~~~~~~~~~~~794../../deps/v8/include/v8-profiler.h:1128:27: warning: 'v8::HeapProfiler::HeapSnapshotOptions::global_object_name_resolver' is deprecated: Use context_name_resolver callback instead. [-Wdeprecated-declarations]795 1128 | HeapSnapshotOptions() {}796 | ^797../../deps/v8/include/v8-profiler.h:1142:25: note: declared here798 1142 | ObjectNameResolver* global_object_name_resolver = nullptr;799 | ^~~~~~~~~~~~~~~~~~~~~~~~~~~800[173/1871] CXX obj/src/node_base.js_stream.o801In file included from ../../src/memory_tracker.h:6,802 from ../../src/base_object.h:29,803 from ../../src/async_wrap.h:27,804 from ../../src/js_stream.h:6,805 from ../../src/js_stream.cc:1:806../../deps/v8/include/v8-profiler.h: In constructor 'v8::HeapProfiler::HeapSnapshotOptions::HeapSnapshotOptions()':807../../deps/v8/include/v8-profiler.h:1128:27: warning: 'v8::HeapProfiler::HeapSnapshotOptions::global_object_name_resolver' is deprecated: Use context_name_resolver callback instead. [-Wdeprecated-declarations]808 1128 | HeapSnapshotOptions() {}809 | ^810../../deps/v8/include/v8-profiler.h:1142:25: note: declared here811 1142 | ObjectNameResolver* global_object_name_resolver = nullptr;812 | ^~~~~~~~~~~~~~~~~~~~~~~~~~~813../../deps/v8/include/v8-profiler.h:1128:27: warning: 'v8::HeapProfiler::HeapSnapshotOptions::global_object_name_resolver' is deprecated: Use context_name_resolver callback instead. [-Wdeprecated-declarations]814 1128 | HeapSnapshotOptions() {}815 | ^816../../deps/v8/include/v8-profiler.h:1142:25: note: declared here817 1142 | ObjectNameResolver* global_object_name_resolver = nullptr;818 | ^~~~~~~~~~~~~~~~~~~~~~~~~~~819[174/1871] CXX obj/src/node_base.node_binding.o820In file included from ../../src/memory_tracker.h:6,821 from ../../src/aliased_buffer.h:7,822 from ../../src/aliased_buffer-inl.h:6,823 from ../../src/env-inl.h:27,824 from ../../src/node_binding.cc:3:825../../deps/v8/include/v8-profiler.h: In constructor 'v8::HeapProfiler::HeapSnapshotOptions::HeapSnapshotOptions()':826../../deps/v8/include/v8-profiler.h:1128:27: warning: 'v8::HeapProfiler::HeapSnapshotOptions::global_object_name_resolver' is deprecated: Use context_name_resolver callback instead. [-Wdeprecated-declarations]827 1128 | HeapSnapshotOptions() {}828 | ^829../../deps/v8/include/v8-profiler.h:1142:25: note: declared here830 1142 | ObjectNameResolver* global_object_name_resolver = nullptr;831 | ^~~~~~~~~~~~~~~~~~~~~~~~~~~832../../deps/v8/include/v8-profiler.h:1128:27: warning: 'v8::HeapProfiler::HeapSnapshotOptions::global_object_name_resolver' is deprecated: Use context_name_resolver callback instead. [-Wdeprecated-declarations]833 1128 | HeapSnapshotOptions() {}834 | ^835../../deps/v8/include/v8-profiler.h:1142:25: note: declared here836 1142 | ObjectNameResolver* global_object_name_resolver = nullptr;837 | ^~~~~~~~~~~~~~~~~~~~~~~~~~~838[175/1871] CXX obj/src/node_base.debug_utils.o839In file included from ../../src/memory_tracker.h:6,840 from ../../src/base_object.h:29,841 from ../../src/async_wrap.h:27,842 from ../../src/debug_utils.h:6,843 from ../../src/debug_utils-inl.h:6,844 from ../../src/debug_utils.cc:1:845../../deps/v8/include/v8-profiler.h: In constructor 'v8::HeapProfiler::HeapSnapshotOptions::HeapSnapshotOptions()':846../../deps/v8/include/v8-profiler.h:1128:27: warning: 'v8::HeapProfiler::HeapSnapshotOptions::global_object_name_resolver' is deprecated: Use context_name_resolver callback instead. [-Wdeprecated-declarations]847 1128 | HeapSnapshotOptions() {}848 | ^849../../deps/v8/include/v8-profiler.h:1142:25: note: declared here850 1142 | ObjectNameResolver* global_object_name_resolver = nullptr;851 | ^~~~~~~~~~~~~~~~~~~~~~~~~~~852../../deps/v8/include/v8-profiler.h:1128:27: warning: 'v8::HeapProfiler::HeapSnapshotOptions::global_object_name_resolver' is deprecated: Use context_name_resolver callback instead. [-Wdeprecated-declarations]853 1128 | HeapSnapshotOptions() {}854 | ^855../../deps/v8/include/v8-profiler.h:1142:25: note: declared here856 1142 | ObjectNameResolver* global_object_name_resolver = nullptr;857 | ^~~~~~~~~~~~~~~~~~~~~~~~~~~858[176/1871] CXX obj/src/node_base.node_config_file.o859In file included from ../../src/memory_tracker.h:6,860 from ../../src/aliased_buffer.h:7,861 from ../../src/env.h:27,862 from ../../src/node_internals.h:27,863 from ../../src/node_config_file.h:12,864 from ../../src/node_config_file.cc:1:865../../deps/v8/include/v8-profiler.h: In constructor 'v8::HeapProfiler::HeapSnapshotOptions::HeapSnapshotOptions()':866../../deps/v8/include/v8-profiler.h:1128:27: warning: 'v8::HeapProfiler::HeapSnapshotOptions::global_object_name_resolver' is deprecated: Use context_name_resolver callback instead. [-Wdeprecated-declarations]867 1128 | HeapSnapshotOptions() {}868 | ^869../../deps/v8/include/v8-profiler.h:1142:25: note: declared here870 1142 | ObjectNameResolver* global_object_name_resolver = nullptr;871 | ^~~~~~~~~~~~~~~~~~~~~~~~~~~872../../deps/v8/include/v8-profiler.h:1128:27: warning: 'v8::HeapProfiler::HeapSnapshotOptions::global_object_name_resolver' is deprecated: Use context_name_resolver callback instead. [-Wdeprecated-declarations]873 1128 | HeapSnapshotOptions() {}874 | ^875../../deps/v8/include/v8-profiler.h:1142:25: note: declared here876 1142 | ObjectNameResolver* global_object_name_resolver = nullptr;877 | ^~~~~~~~~~~~~~~~~~~~~~~~~~~878[177/1871] CXX obj/src/api/node_base.encoding.o879In file included from ../../src/memory_tracker.h:6,880 from ../../src/aliased_buffer.h:7,881 from ../../src/aliased_buffer-inl.h:6,882 from ../../src/env-inl.h:27,883 from ../../src/string_bytes.h:30,884 from ../../src/api/encoding.cc:2:885../../deps/v8/include/v8-profiler.h: In constructor 'v8::HeapProfiler::HeapSnapshotOptions::HeapSnapshotOptions()':886../../deps/v8/include/v8-profiler.h:1128:27: warning: 'v8::HeapProfiler::HeapSnapshotOptions::global_object_name_resolver' is deprecated: Use context_name_resolver callback instead. [-Wdeprecated-declarations]887 1128 | HeapSnapshotOptions() {}888 | ^889../../deps/v8/include/v8-profiler.h:1142:25: note: declared here890 1142 | ObjectNameResolver* global_object_name_resolver = nullptr;891 | ^~~~~~~~~~~~~~~~~~~~~~~~~~~892../../deps/v8/include/v8-profiler.h:1128:27: warning: 'v8::HeapProfiler::HeapSnapshotOptions::global_object_name_resolver' is deprecated: Use context_name_resolver callback instead. [-Wdeprecated-declarations]893 1128 | HeapSnapshotOptions() {}894 | ^895../../deps/v8/include/v8-profiler.h:1142:25: note: declared here896 1142 | ObjectNameResolver* global_object_name_resolver = nullptr;897 | ^~~~~~~~~~~~~~~~~~~~~~~~~~~898[178/1871] CXX obj/src/node_base.node_config.o899In file included from ../../src/memory_tracker.h:6,900 from ../../src/aliased_buffer.h:7,901 from ../../src/aliased_buffer-inl.h:6,902 from ../../src/env-inl.h:27,903 from ../../src/node_config.cc:1:904../../deps/v8/include/v8-profiler.h: In constructor 'v8::HeapProfiler::HeapSnapshotOptions::HeapSnapshotOptions()':905../../deps/v8/include/v8-profiler.h:1128:27: warning: 'v8::HeapProfiler::HeapSnapshotOptions::global_object_name_resolver' is deprecated: Use context_name_resolver callback instead. [-Wdeprecated-declarations]906 1128 | HeapSnapshotOptions() {}907 | ^908../../deps/v8/include/v8-profiler.h:1142:25: note: declared here909 1142 | ObjectNameResolver* global_object_name_resolver = nullptr;910 | ^~~~~~~~~~~~~~~~~~~~~~~~~~~911../../deps/v8/include/v8-profiler.h:1128:27: warning: 'v8::HeapProfiler::HeapSnapshotOptions::global_object_name_resolver' is deprecated: Use context_name_resolver callback instead. [-Wdeprecated-declarations]912 1128 | HeapSnapshotOptions() {}913 | ^914../../deps/v8/include/v8-profiler.h:1142:25: note: declared here915 1142 | ObjectNameResolver* global_object_name_resolver = nullptr;916 | ^~~~~~~~~~~~~~~~~~~~~~~~~~~917[179/1871] CXX obj/src/node_base.connection_wrap.o918In file included from ../../src/memory_tracker.h:6,919 from ../../src/aliased_buffer.h:7,920 from ../../src/env.h:27,921 from ../../src/stream_base.h:6,922 from ../../src/stream_wrap.h:27,923 from ../../src/connection_wrap.h:6,924 from ../../src/connection_wrap.cc:1:925../../deps/v8/include/v8-profiler.h: In constructor 'v8::HeapProfiler::HeapSnapshotOptions::HeapSnapshotOptions()':926../../deps/v8/include/v8-profiler.h:1128:27: warning: 'v8::HeapProfiler::HeapSnapshotOptions::global_object_name_resolver' is deprecated: Use context_name_resolver callback instead. [-Wdeprecated-declarations]927 1128 | HeapSnapshotOptions() {}928 | ^929../../deps/v8/include/v8-profiler.h:1142:25: note: declared here930 1142 | ObjectNameResolver* global_object_name_resolver = nullptr;931 | ^~~~~~~~~~~~~~~~~~~~~~~~~~~932../../deps/v8/include/v8-profiler.h:1128:27: warning: 'v8::HeapProfiler::HeapSnapshotOptions::global_object_name_resolver' is deprecated: Use context_name_resolver callback instead. [-Wdeprecated-declarations]933 1128 | HeapSnapshotOptions() {}934 | ^935../../deps/v8/include/v8-profiler.h:1142:25: note: declared here936 1142 | ObjectNameResolver* global_object_name_resolver = nullptr;937 | ^~~~~~~~~~~~~~~~~~~~~~~~~~~938[180/1871] CXX obj/src/node_base.node_builtins.o939In file included from ../../src/util.h:29,940 from ../../src/node_mutex.h:6,941 from ../../src/node_builtins.h:16,942 from ../../src/node_builtins.cc:1:943../../deps/v8/include/v8-profiler.h: In constructor 'v8::HeapProfiler::HeapSnapshotOptions::HeapSnapshotOptions()':944../../deps/v8/include/v8-profiler.h:1128:27: warning: 'v8::HeapProfiler::HeapSnapshotOptions::global_object_name_resolver' is deprecated: Use context_name_resolver callback instead. [-Wdeprecated-declarations]945 1128 | HeapSnapshotOptions() {}946 | ^947../../deps/v8/include/v8-profiler.h:1142:25: note: declared here948 1142 | ObjectNameResolver* global_object_name_resolver = nullptr;949 | ^~~~~~~~~~~~~~~~~~~~~~~~~~~950../../deps/v8/include/v8-profiler.h:1128:27: warning: 'v8::HeapProfiler::HeapSnapshotOptions::global_object_name_resolver' is deprecated: Use context_name_resolver callback instead. [-Wdeprecated-declarations]951 1128 | HeapSnapshotOptions() {}952 | ^953../../deps/v8/include/v8-profiler.h:1142:25: note: declared here954 1142 | ObjectNameResolver* global_object_name_resolver = nullptr;955 | ^~~~~~~~~~~~~~~~~~~~~~~~~~~956[181/1871] CXX obj/src/node_base.node_env_var.o957In file included from ../../src/memory_tracker.h:6,958 from ../../src/base_object.h:29,959 from ../../src/async_wrap.h:27,960 from ../../src/debug_utils.h:6,961 from ../../src/debug_utils-inl.h:6,962 from ../../src/node_env_var.cc:1:963../../deps/v8/include/v8-profiler.h: In constructor 'v8::HeapProfiler::HeapSnapshotOptions::HeapSnapshotOptions()':964../../deps/v8/include/v8-profiler.h:1128:27: warning: 'v8::HeapProfiler::HeapSnapshotOptions::global_object_name_resolver' is deprecated: Use context_name_resolver callback instead. [-Wdeprecated-declarations]965 1128 | HeapSnapshotOptions() {}966 | ^967../../deps/v8/include/v8-profiler.h:1142:25: note: declared here968 1142 | ObjectNameResolver* global_object_name_resolver = nullptr;969 | ^~~~~~~~~~~~~~~~~~~~~~~~~~~970../../deps/v8/include/v8-profiler.h:1128:27: warning: 'v8::HeapProfiler::HeapSnapshotOptions::global_object_name_resolver' is deprecated: Use context_name_resolver callback instead. [-Wdeprecated-declarations]971 1128 | HeapSnapshotOptions() {}972 | ^973../../deps/v8/include/v8-profiler.h:1142:25: note: declared here974 1142 | ObjectNameResolver* global_object_name_resolver = nullptr;975 | ^~~~~~~~~~~~~~~~~~~~~~~~~~~976[182/1871] CXX obj/src/node_base.node_blob.o977In file included from ../../src/memory_tracker.h:6,978 from ../../src/base_object.h:29,979 from ../../src/async_wrap.h:27,980 from ../../src/node_blob.h:8,981 from ../../src/node_blob.cc:1:982../../deps/v8/include/v8-profiler.h: In constructor 'v8::HeapProfiler::HeapSnapshotOptions::HeapSnapshotOptions()':983../../deps/v8/include/v8-profiler.h:1128:27: warning: 'v8::HeapProfiler::HeapSnapshotOptions::global_object_name_resolver' is deprecated: Use context_name_resolver callback instead. [-Wdeprecated-declarations]984 1128 | HeapSnapshotOptions() {}985 | ^986../../deps/v8/include/v8-profiler.h:1142:25: note: declared here987 1142 | ObjectNameResolver* global_object_name_resolver = nullptr;988 | ^~~~~~~~~~~~~~~~~~~~~~~~~~~989../../deps/v8/include/v8-profiler.h:1128:27: warning: 'v8::HeapProfiler::HeapSnapshotOptions::global_object_name_resolver' is deprecated: Use context_name_resolver callback instead. [-Wdeprecated-declarations]990 1128 | HeapSnapshotOptions() {}991 | ^992../../deps/v8/include/v8-profiler.h:1142:25: note: declared here993 1142 | ObjectNameResolver* global_object_name_resolver = nullptr;994 | ^~~~~~~~~~~~~~~~~~~~~~~~~~~995[183/1871] CXX obj/src/node_base.encoding_binding.o996In file included from ../../src/memory_tracker.h:6,997 from ../../src/aliased_buffer.h:7,998 from ../../src/encoding_binding.h:7,999 from ../../src/encoding_binding.cc:1:1000../../deps/v8/include/v8-profiler.h: In constructor 'v8::HeapProfiler::HeapSnapshotOptions::HeapSnapshotOptions()':1001../../deps/v8/include/v8-profiler.h:1128:27: warning: 'v8::HeapProfiler::HeapSnapshotOptions::global_object_name_resolver' is deprecated: Use context_name_resolver callback instead. [-Wdeprecated-declarations]1002 1128 | HeapSnapshotOptions() {}1003 | ^1004../../deps/v8/include/v8-profiler.h:1142:25: note: declared here1005 1142 | ObjectNameResolver* global_object_name_resolver = nullptr;1006 | ^~~~~~~~~~~~~~~~~~~~~~~~~~~1007../../deps/v8/include/v8-profiler.h:1128:27: warning: 'v8::HeapProfiler::HeapSnapshotOptions::global_object_name_resolver' is deprecated: Use context_name_resolver callback instead. [-Wdeprecated-declarations]1008 1128 | HeapSnapshotOptions() {}1009 | ^1010../../deps/v8/include/v8-profiler.h:1142:25: note: declared here1011 1142 | ObjectNameResolver* global_object_name_resolver = nullptr;1012 | ^~~~~~~~~~~~~~~~~~~~~~~~~~~1013[184/1871] CXX obj/src/node_base.node_external_reference.o1014In file included from ../../src/memory_tracker.h:6,1015 from ../../src/base_object.h:29,1016 from ../../src/base_object-inl.h:27,1017 from ../../src/node_external_reference.cc:4:1018../../deps/v8/include/v8-profiler.h: In constructor 'v8::HeapProfiler::HeapSnapshotOptions::HeapSnapshotOptions()':1019../../deps/v8/include/v8-profiler.h:1128:27: warning: 'v8::HeapProfiler::HeapSnapshotOptions::global_object_name_resolver' is deprecated: Use context_name_resolver callback instead. [-Wdeprecated-declarations]1020 1128 | HeapSnapshotOptions() {}1021 | ^1022../../deps/v8/include/v8-profiler.h:1142:25: note: declared here1023 1142 | ObjectNameResolver* global_object_name_resolver = nullptr;1024 | ^~~~~~~~~~~~~~~~~~~~~~~~~~~1025../../deps/v8/include/v8-profiler.h:1128:27: warning: 'v8::HeapProfiler::HeapSnapshotOptions::global_object_name_resolver' is deprecated: Use context_name_resolver callback instead. [-Wdeprecated-declarations]1026 1128 | HeapSnapshotOptions() {}1027 | ^1028../../deps/v8/include/v8-profiler.h:1142:25: note: declared here1029 1142 | ObjectNameResolver* global_object_name_resolver = nullptr;1030 | ^~~~~~~~~~~~~~~~~~~~~~~~~~~1031[185/1871] CXX obj/src/node_base.node_api.o1032In file included from ../../src/memory_tracker.h:6,1033 from ../../src/base_object.h:29,1034 from ../../src/async_context_frame.h:6,1035 from ../../src/node_api.cc:1:1036../../deps/v8/include/v8-profiler.h: In constructor 'v8::HeapProfiler::HeapSnapshotOptions::HeapSnapshotOptions()':1037../../deps/v8/include/v8-profiler.h:1128:27: warning: 'v8::HeapProfiler::HeapSnapshotOptions::global_object_name_resolver' is deprecated: Use context_name_resolver callback instead. [-Wdeprecated-declarations]1038 1128 | HeapSnapshotOptions() {}1039 | ^1040../../deps/v8/include/v8-profiler.h:1142:25: note: declared here1041 1142 | ObjectNameResolver* global_object_name_resolver = nullptr;1042 | ^~~~~~~~~~~~~~~~~~~~~~~~~~~1043../../deps/v8/include/v8-profiler.h:1128:27: warning: 'v8::HeapProfiler::HeapSnapshotOptions::global_object_name_resolver' is deprecated: Use context_name_resolver callback instead. [-Wdeprecated-declarations]1044 1128 | HeapSnapshotOptions() {}1045 | ^1046../../deps/v8/include/v8-profiler.h:1142:25: note: declared here1047 1142 | ObjectNameResolver* global_object_name_resolver = nullptr;1048 | ^~~~~~~~~~~~~~~~~~~~~~~~~~~1049[186/1871] CXX obj/src/node_base.node_profiling.o1050In file included from ../../src/node_profiling.h:6,1051 from ../../src/node_profiling.cc:1:1052../../deps/v8/include/v8-profiler.h: In constructor 'v8::HeapProfiler::HeapSnapshotOptions::HeapSnapshotOptions()':1053../../deps/v8/include/v8-profiler.h:1128:27: warning: 'v8::HeapProfiler::HeapSnapshotOptions::global_object_name_resolver' is deprecated: Use context_name_resolver callback instead. [-Wdeprecated-declarations]1054 1128 | HeapSnapshotOptions() {}1055 | ^1056../../deps/v8/include/v8-profiler.h:1142:25: note: declared here1057 1142 | ObjectNameResolver* global_object_name_resolver = nullptr;1058 | ^~~~~~~~~~~~~~~~~~~~~~~~~~~1059../../deps/v8/include/v8-profiler.h:1128:27: warning: 'v8::HeapProfiler::HeapSnapshotOptions::global_object_name_resolver' is deprecated: Use context_name_resolver callback instead. [-Wdeprecated-declarations]1060 1128 | HeapSnapshotOptions() {}1061 | ^1062../../deps/v8/include/v8-profiler.h:1142:25: note: declared here1063 1142 | ObjectNameResolver* global_object_name_resolver = nullptr;1064 | ^~~~~~~~~~~~~~~~~~~~~~~~~~~1065[187/1871] CXX obj/src/node_base.node_dotenv.o1066In file included from ../../src/util.h:29,1067 from ../../src/util-inl.h:33,1068 from ../../src/node_dotenv.h:6,1069 from ../../src/node_dotenv.cc:1:1070../../deps/v8/include/v8-profiler.h: In constructor 'v8::HeapProfiler::HeapSnapshotOptions::HeapSnapshotOptions()':1071../../deps/v8/include/v8-profiler.h:1128:27: warning: 'v8::HeapProfiler::HeapSnapshotOptions::global_object_name_resolver' is deprecated: Use context_name_resolver callback instead. [-Wdeprecated-declarations]1072 1128 | HeapSnapshotOptions() {}1073 | ^1074../../deps/v8/include/v8-profiler.h:1142:25: note: declared here1075 1142 | ObjectNameResolver* global_object_name_resolver = nullptr;1076 | ^~~~~~~~~~~~~~~~~~~~~~~~~~~1077../../deps/v8/include/v8-profiler.h:1128:27: warning: 'v8::HeapProfiler::HeapSnapshotOptions::global_object_name_resolver' is deprecated: Use context_name_resolver callback instead. [-Wdeprecated-declarations]1078 1128 | HeapSnapshotOptions() {}1079 | ^1080../../deps/v8/include/v8-profiler.h:1142:25: note: declared here1081 1142 | ObjectNameResolver* global_object_name_resolver = nullptr;1082 | ^~~~~~~~~~~~~~~~~~~~~~~~~~~1083[188/1871] CXX obj/src/node_base.node_cjs_lexer.o1084In file included from ../../src/memory_tracker.h:6,1085 from ../../src/aliased_buffer.h:7,1086 from ../../src/aliased_buffer-inl.h:6,1087 from ../../src/env-inl.h:27,1088 from ../../src/node_cjs_lexer.cc:1:1089../../deps/v8/include/v8-profiler.h: In constructor 'v8::HeapProfiler::HeapSnapshotOptions::HeapSnapshotOptions()':1090../../deps/v8/include/v8-profiler.h:1128:27: warning: 'v8::HeapProfiler::HeapSnapshotOptions::global_object_name_resolver' is deprecated: Use context_name_resolver callback instead. [-Wdeprecated-declarations]1091 1128 | HeapSnapshotOptions() {}1092 | ^1093../../deps/v8/include/v8-profiler.h:1142:25: note: declared here1094 1142 | ObjectNameResolver* global_object_name_resolver = nullptr;1095 | ^~~~~~~~~~~~~~~~~~~~~~~~~~~1096../../deps/v8/include/v8-profiler.h:1128:27: warning: 'v8::HeapProfiler::HeapSnapshotOptions::global_object_name_resolver' is deprecated: Use context_name_resolver callback instead. [-Wdeprecated-declarations]1097 1128 | HeapSnapshotOptions() {}1098 | ^1099../../deps/v8/include/v8-profiler.h:1142:25: note: declared here1100 1142 | ObjectNameResolver* global_object_name_resolver = nullptr;1101 | ^~~~~~~~~~~~~~~~~~~~~~~~~~~1102[189/1871] CXX obj/src/node_base.node_dir.o1103In file included from ../../src/memory_tracker.h:6,1104 from ../../src/aliased_buffer.h:7,1105 from ../../src/node_file.h:7,1106 from ../../src/node_dir.h:6,1107 from ../../src/node_dir.cc:1:1108../../deps/v8/include/v8-profiler.h: In constructor 'v8::HeapProfiler::HeapSnapshotOptions::HeapSnapshotOptions()':1109../../deps/v8/include/v8-profiler.h:1128:27: warning: 'v8::HeapProfiler::HeapSnapshotOptions::global_object_name_resolver' is deprecated: Use context_name_resolver callback instead. [-Wdeprecated-declarations]1110 1128 | HeapSnapshotOptions() {}1111 | ^1112../../deps/v8/include/v8-profiler.h:1142:25: note: declared here1113 1142 | ObjectNameResolver* global_object_name_resolver = nullptr;1114 | ^~~~~~~~~~~~~~~~~~~~~~~~~~~1115../../deps/v8/include/v8-profiler.h:1128:27: warning: 'v8::HeapProfiler::HeapSnapshotOptions::global_object_name_resolver' is deprecated: Use context_name_resolver callback instead. [-Wdeprecated-declarations]1116 1128 | HeapSnapshotOptions() {}1117 | ^1118../../deps/v8/include/v8-profiler.h:1142:25: note: declared here1119 1142 | ObjectNameResolver* global_object_name_resolver = nullptr;1120 | ^~~~~~~~~~~~~~~~~~~~~~~~~~~1121[190/1871] CXX obj/src/api/node_base.exceptions.o1122In file included from ../../src/memory_tracker.h:6,1123 from ../../src/aliased_buffer.h:7,1124 from ../../src/aliased_buffer-inl.h:6,1125 from ../../src/env-inl.h:27,1126 from ../../src/api/exceptions.cc:3:1127../../deps/v8/include/v8-profiler.h: In constructor 'v8::HeapProfiler::HeapSnapshotOptions::HeapSnapshotOptions()':1128../../deps/v8/include/v8-profiler.h:1128:27: warning: 'v8::HeapProfiler::HeapSnapshotOptions::global_object_name_resolver' is deprecated: Use context_name_resolver callback instead. [-Wdeprecated-declarations]1129 1128 | HeapSnapshotOptions() {}1130 | ^1131../../deps/v8/include/v8-profiler.h:1142:25: note: declared here1132 1142 | ObjectNameResolver* global_object_name_resolver = nullptr;1133 | ^~~~~~~~~~~~~~~~~~~~~~~~~~~1134../../deps/v8/include/v8-profiler.h:1128:27: warning: 'v8::HeapProfiler::HeapSnapshotOptions::global_object_name_resolver' is deprecated: Use context_name_resolver callback instead. [-Wdeprecated-declarations]1135 1128 | HeapSnapshotOptions() {}1136 | ^1137../../deps/v8/include/v8-profiler.h:1142:25: note: declared here1138 1142 | ObjectNameResolver* global_object_name_resolver = nullptr;1139 | ^~~~~~~~~~~~~~~~~~~~~~~~~~~1140[191/1871] CXX obj/src/node_base.node_contextify.o1141In file included from ../../src/memory_tracker.h:6,1142 from ../../src/base_object.h:29,1143 from ../../src/base_object-inl.h:27,1144 from ../../src/node_contextify.h:6,1145 from ../../src/node_contextify.cc:22:1146../../deps/v8/include/v8-profiler.h: In constructor 'v8::HeapProfiler::HeapSnapshotOptions::HeapSnapshotOptions()':1147../../deps/v8/include/v8-profiler.h:1128:27: warning: 'v8::HeapProfiler::HeapSnapshotOptions::global_object_name_resolver' is deprecated: Use context_name_resolver callback instead. [-Wdeprecated-declarations]1148 1128 | HeapSnapshotOptions() {}1149 | ^1150../../deps/v8/include/v8-profiler.h:1142:25: note: declared here1151 1142 | ObjectNameResolver* global_object_name_resolver = nullptr;1152 | ^~~~~~~~~~~~~~~~~~~~~~~~~~~1153../../deps/v8/include/v8-profiler.h:1128:27: warning: 'v8::HeapProfiler::HeapSnapshotOptions::global_object_name_resolver' is deprecated: Use context_name_resolver callback instead. [-Wdeprecated-declarations]1154 1128 | HeapSnapshotOptions() {}1155 | ^1156../../deps/v8/include/v8-profiler.h:1142:25: note: declared here1157 1142 | ObjectNameResolver* global_object_name_resolver = nullptr;1158 | ^~~~~~~~~~~~~~~~~~~~~~~~~~~1159[192/1871] CXX obj/src/node_base.js_native_api_v8.o1160In file included from ../../src/memory_tracker.h:6,1161 from ../../src/aliased_buffer.h:7,1162 from ../../src/aliased_buffer-inl.h:6,1163 from ../../src/env-inl.h:27,1164 from ../../src/js_native_api_v8.cc:7:1165../../deps/v8/include/v8-profiler.h: In constructor 'v8::HeapProfiler::HeapSnapshotOptions::HeapSnapshotOptions()':1166../../deps/v8/include/v8-profiler.h:1128:27: warning: 'v8::HeapProfiler::HeapSnapshotOptions::global_object_name_resolver' is deprecated: Use context_name_resolver callback instead. [-Wdeprecated-declarations]1167 1128 | HeapSnapshotOptions() {}1168 | ^1169../../deps/v8/include/v8-profiler.h:1142:25: note: declared here1170 1142 | ObjectNameResolver* global_object_name_resolver = nullptr;1171 | ^~~~~~~~~~~~~~~~~~~~~~~~~~~1172../../deps/v8/include/v8-profiler.h:1128:27: warning: 'v8::HeapProfiler::HeapSnapshotOptions::global_object_name_resolver' is deprecated: Use context_name_resolver callback instead. [-Wdeprecated-declarations]1173 1128 | HeapSnapshotOptions() {}1174 | ^1175../../deps/v8/include/v8-profiler.h:1142:25: note: declared here1176 1142 | ObjectNameResolver* global_object_name_resolver = nullptr;1177 | ^~~~~~~~~~~~~~~~~~~~~~~~~~~1178[193/1871] CXX obj/src/node_base.node_http_parser.o1179In file included from ../../src/util.h:29,1180 from ../../src/node_http_parser.cc:24:1181../../deps/v8/include/v8-profiler.h: In constructor 'v8::HeapProfiler::HeapSnapshotOptions::HeapSnapshotOptions()':1182../../deps/v8/include/v8-profiler.h:1128:27: warning: 'v8::HeapProfiler::HeapSnapshotOptions::global_object_name_resolver' is deprecated: Use context_name_resolver callback instead. [-Wdeprecated-declarations]1183 1128 | HeapSnapshotOptions() {}1184 | ^1185../../deps/v8/include/v8-profiler.h:1142:25: note: declared here1186 1142 | ObjectNameResolver* global_object_name_resolver = nullptr;1187 | ^~~~~~~~~~~~~~~~~~~~~~~~~~~1188../../deps/v8/include/v8-profiler.h:1128:27: warning: 'v8::HeapProfiler::HeapSnapshotOptions::global_object_name_resolver' is deprecated: Use context_name_resolver callback instead. [-Wdeprecated-declarations]1189 1128 | HeapSnapshotOptions() {}1190 | ^1191../../deps/v8/include/v8-profiler.h:1142:25: note: declared here1192 1142 | ObjectNameResolver* global_object_name_resolver = nullptr;1193 | ^~~~~~~~~~~~~~~~~~~~~~~~~~~1194[194/1871] CXX obj/src/node_base.node_buffer.o1195In file included from ../../src/memory_tracker.h:6,1196 from ../../src/base_object.h:29,1197 from ../../src/async_wrap.h:27,1198 from ../../src/node_blob.h:8,1199 from ../../src/node_buffer.cc:24:1200../../deps/v8/include/v8-profiler.h: In constructor 'v8::HeapProfiler::HeapSnapshotOptions::HeapSnapshotOptions()':1201../../deps/v8/include/v8-profiler.h:1128:27: warning: 'v8::HeapProfiler::HeapSnapshotOptions::global_object_name_resolver' is deprecated: Use context_name_resolver callback instead. [-Wdeprecated-declarations]1202 1128 | HeapSnapshotOptions() {}1203 | ^1204../../deps/v8/include/v8-profiler.h:1142:25: note: declared here1205 1142 | ObjectNameResolver* global_object_name_resolver = nullptr;1206 | ^~~~~~~~~~~~~~~~~~~~~~~~~~~1207../../deps/v8/include/v8-profiler.h:1128:27: warning: 'v8::HeapProfiler::HeapSnapshotOptions::global_object_name_resolver' is deprecated: Use context_name_resolver callback instead. [-Wdeprecated-declarations]1208 1128 | HeapSnapshotOptions() {}1209 | ^1210../../deps/v8/include/v8-profiler.h:1142:25: note: declared here1211 1142 | ObjectNameResolver* global_object_name_resolver = nullptr;1212 | ^~~~~~~~~~~~~~~~~~~~~~~~~~~1213[195/1871] CXX obj/src/node_base.node_ipc_serdes.o1214In file included from ../../src/memory_tracker.h:6,1215 from ../../src/aliased_buffer.h:7,1216 from ../../src/aliased_buffer-inl.h:6,1217 from ../../src/env-inl.h:27,1218 from ../../src/node_ipc_serdes.cc:1:1219../../deps/v8/include/v8-profiler.h: In constructor 'v8::HeapProfiler::HeapSnapshotOptions::HeapSnapshotOptions()':1220../../deps/v8/include/v8-profiler.h:1128:27: warning: 'v8::HeapProfiler::HeapSnapshotOptions::global_object_name_resolver' is deprecated: Use context_name_resolver callback instead. [-Wdeprecated-declarations]1221 1128 | HeapSnapshotOptions() {}1222 | ^1223../../deps/v8/include/v8-profiler.h:1142:25: note: declared here1224 1142 | ObjectNameResolver* global_object_name_resolver = nullptr;1225 | ^~~~~~~~~~~~~~~~~~~~~~~~~~~1226../../deps/v8/include/v8-profiler.h:1128:27: warning: 'v8::HeapProfiler::HeapSnapshotOptions::global_object_name_resolver' is deprecated: Use context_name_resolver callback instead. [-Wdeprecated-declarations]1227 1128 | HeapSnapshotOptions() {}1228 | ^1229../../deps/v8/include/v8-profiler.h:1142:25: note: declared here1230 1142 | ObjectNameResolver* global_object_name_resolver = nullptr;1231 | ^~~~~~~~~~~~~~~~~~~~~~~~~~~1232[196/1871] CXX obj/src/node_base.node_process_object.o1233In file included from ../../src/memory_tracker.h:6,1234 from ../../src/aliased_buffer.h:7,1235 from ../../src/aliased_buffer-inl.h:6,1236 from ../../src/env-inl.h:27,1237 from ../../src/node_process_object.cc:1:1238../../deps/v8/include/v8-profiler.h: In constructor 'v8::HeapProfiler::HeapSnapshotOptions::HeapSnapshotOptions()':1239../../deps/v8/include/v8-profiler.h:1128:27: warning: 'v8::HeapProfiler::HeapSnapshotOptions::global_object_name_resolver' is deprecated: Use context_name_resolver callback instead. [-Wdeprecated-declarations]1240 1128 | HeapSnapshotOptions() {}1241 | ^1242../../deps/v8/include/v8-profiler.h:1142:25: note: declared here1243 1142 | ObjectNameResolver* global_object_name_resolver = nullptr;1244 | ^~~~~~~~~~~~~~~~~~~~~~~~~~~1245../../deps/v8/include/v8-profiler.h:1128:27: warning: 'v8::HeapProfiler::HeapSnapshotOptions::global_object_name_resolver' is deprecated: Use context_name_resolver callback instead. [-Wdeprecated-declarations]1246 1128 | HeapSnapshotOptions() {}1247 | ^1248../../deps/v8/include/v8-profiler.h:1142:25: note: declared here1249 1142 | ObjectNameResolver* global_object_name_resolver = nullptr;1250 | ^~~~~~~~~~~~~~~~~~~~~~~~~~~1251[197/1871] CXX obj/src/node_base.node_i18n.o1252In file included from ../../src/memory_tracker.h:6,1253 from ../../src/base_object.h:29,1254 from ../../src/node_i18n.h:29,1255 from ../../src/node_i18n.cc:43:1256../../deps/v8/include/v8-profiler.h: In constructor 'v8::HeapProfiler::HeapSnapshotOptions::HeapSnapshotOptions()':1257../../deps/v8/include/v8-profiler.h:1128:27: warning: 'v8::HeapProfiler::HeapSnapshotOptions::global_object_name_resolver' is deprecated: Use context_name_resolver callback instead. [-Wdeprecated-declarations]1258 1128 | HeapSnapshotOptions() {}1259 | ^1260../../deps/v8/include/v8-profiler.h:1142:25: note: declared here1261 1142 | ObjectNameResolver* global_object_name_resolver = nullptr;1262 | ^~~~~~~~~~~~~~~~~~~~~~~~~~~1263../../deps/v8/include/v8-profiler.h:1128:27: warning: 'v8::HeapProfiler::HeapSnapshotOptions::global_object_name_resolver' is deprecated: Use context_name_resolver callback instead. [-Wdeprecated-declarations]1264 1128 | HeapSnapshotOptions() {}1265 | ^1266../../deps/v8/include/v8-profiler.h:1142:25: note: declared here1267 1142 | ObjectNameResolver* global_object_name_resolver = nullptr;1268 | ^~~~~~~~~~~~~~~~~~~~~~~~~~~1269[198/1871] CXX obj/src/node_base.node_errors.o1270In file included from ../../src/memory_tracker.h:6,1271 from ../../src/base_object.h:29,1272 from ../../src/async_wrap.h:27,1273 from ../../src/debug_utils.h:6,1274 from ../../src/debug_utils-inl.h:6,1275 from ../../src/node_errors.cc:6:1276../../deps/v8/include/v8-profiler.h: In constructor 'v8::HeapProfiler::HeapSnapshotOptions::HeapSnapshotOptions()':1277../../deps/v8/include/v8-profiler.h:1128:27: warning: 'v8::HeapProfiler::HeapSnapshotOptions::global_object_name_resolver' is deprecated: Use context_name_resolver callback instead. [-Wdeprecated-declarations]1278 1128 | HeapSnapshotOptions() {}1279 | ^1280../../deps/v8/include/v8-profiler.h:1142:25: note: declared here1281 1142 | ObjectNameResolver* global_object_name_resolver = nullptr;1282 | ^~~~~~~~~~~~~~~~~~~~~~~~~~~1283../../deps/v8/include/v8-profiler.h:1128:27: warning: 'v8::HeapProfiler::HeapSnapshotOptions::global_object_name_resolver' is deprecated: Use context_name_resolver callback instead. [-Wdeprecated-declarations]1284 1128 | HeapSnapshotOptions() {}1285 | ^1286../../deps/v8/include/v8-profiler.h:1142:25: note: declared here1287 1142 | ObjectNameResolver* global_object_name_resolver = nullptr;1288 | ^~~~~~~~~~~~~~~~~~~~~~~~~~~1289[199/1871] CXX obj/src/node_base.node_main_instance.o1290In file included from ../../src/util.h:29,1291 from ../../src/node_main_instance.h:11,1292 from ../../src/node_main_instance.cc:1:1293../../deps/v8/include/v8-profiler.h: In constructor 'v8::HeapProfiler::HeapSnapshotOptions::HeapSnapshotOptions()':1294../../deps/v8/include/v8-profiler.h:1128:27: warning: 'v8::HeapProfiler::HeapSnapshotOptions::global_object_name_resolver' is deprecated: Use context_name_resolver callback instead. [-Wdeprecated-declarations]1295 1128 | HeapSnapshotOptions() {}1296 | ^1297../../deps/v8/include/v8-profiler.h:1142:25: note: declared here1298 1142 | ObjectNameResolver* global_object_name_resolver = nullptr;1299 | ^~~~~~~~~~~~~~~~~~~~~~~~~~~1300../../deps/v8/include/v8-profiler.h:1128:27: warning: 'v8::HeapProfiler::HeapSnapshotOptions::global_object_name_resolver' is deprecated: Use context_name_resolver callback instead. [-Wdeprecated-declarations]1301 1128 | HeapSnapshotOptions() {}1302 | ^1303../../deps/v8/include/v8-profiler.h:1142:25: note: declared here1304 1142 | ObjectNameResolver* global_object_name_resolver = nullptr;1305 | ^~~~~~~~~~~~~~~~~~~~~~~~~~~1306[200/1871] CXX obj/src/node_base.node_metadata.o1307In file included from ../../src/util.h:29,1308 from ../../src/node_metadata.cc:22:1309../../deps/v8/include/v8-profiler.h: In constructor 'v8::HeapProfiler::HeapSnapshotOptions::HeapSnapshotOptions()':1310../../deps/v8/include/v8-profiler.h:1128:27: warning: 'v8::HeapProfiler::HeapSnapshotOptions::global_object_name_resolver' is deprecated: Use context_name_resolver callback instead. [-Wdeprecated-declarations]1311 1128 | HeapSnapshotOptions() {}1312 | ^1313../../deps/v8/include/v8-profiler.h:1142:25: note: declared here1314 1142 | ObjectNameResolver* global_object_name_resolver = nullptr;1315 | ^~~~~~~~~~~~~~~~~~~~~~~~~~~1316../../deps/v8/include/v8-profiler.h:1128:27: warning: 'v8::HeapProfiler::HeapSnapshotOptions::global_object_name_resolver' is deprecated: Use context_name_resolver callback instead. [-Wdeprecated-declarations]1317 1128 | HeapSnapshotOptions() {}1318 | ^1319../../deps/v8/include/v8-profiler.h:1142:25: note: declared here1320 1142 | ObjectNameResolver* global_object_name_resolver = nullptr;1321 | ^~~~~~~~~~~~~~~~~~~~~~~~~~~1322[201/1871] CXX obj/src/node_base.node_stat_watcher.o1323In file included from ../../src/memory_tracker.h:6,1324 from ../../src/base_object.h:29,1325 from ../../src/async_wrap.h:27,1326 from ../../src/handle_wrap.h:27,1327 from ../../src/node_stat_watcher.h:28,1328 from ../../src/node_stat_watcher.cc:22:1329../../deps/v8/include/v8-profiler.h: In constructor 'v8::HeapProfiler::HeapSnapshotOptions::HeapSnapshotOptions()':1330../../deps/v8/include/v8-profiler.h:1128:27: warning: 'v8::HeapProfiler::HeapSnapshotOptions::global_object_name_resolver' is deprecated: Use context_name_resolver callback instead. [-Wdeprecated-declarations]1331 1128 | HeapSnapshotOptions() {}1332 | ^1333../../deps/v8/include/v8-profiler.h:1142:25: note: declared here1334 1142 | ObjectNameResolver* global_object_name_resolver = nullptr;1335 | ^~~~~~~~~~~~~~~~~~~~~~~~~~~1336../../deps/v8/include/v8-profiler.h:1128:27: warning: 'v8::HeapProfiler::HeapSnapshotOptions::global_object_name_resolver' is deprecated: Use context_name_resolver callback instead. [-Wdeprecated-declarations]1337 1128 | HeapSnapshotOptions() {}1338 | ^1339../../deps/v8/include/v8-profiler.h:1142:25: note: declared here1340 1142 | ObjectNameResolver* global_object_name_resolver = nullptr;1341 | ^~~~~~~~~~~~~~~~~~~~~~~~~~~1342[202/1871] CXX obj/src/node_base.node_file.o1343In file included from ../../src/memory_tracker.h:6,1344 from ../../src/aliased_buffer.h:7,1345 from ../../src/node_file.h:7,1346 from ../../src/node_file.cc:21:1347../../deps/v8/include/v8-profiler.h: In constructor 'v8::HeapProfiler::HeapSnapshotOptions::HeapSnapshotOptions()':1348../../deps/v8/include/v8-profiler.h:1128:27: warning: 'v8::HeapProfiler::HeapSnapshotOptions::global_object_name_resolver' is deprecated: Use context_name_resolver callback instead. [-Wdeprecated-declarations]1349 1128 | HeapSnapshotOptions() {}1350 | ^1351../../deps/v8/include/v8-profiler.h:1142:25: note: declared here1352 1142 | ObjectNameResolver* global_object_name_resolver = nullptr;1353 | ^~~~~~~~~~~~~~~~~~~~~~~~~~~1354../../deps/v8/include/v8-profiler.h:1128:27: warning: 'v8::HeapProfiler::HeapSnapshotOptions::global_object_name_resolver' is deprecated: Use context_name_resolver callback instead. [-Wdeprecated-declarations]1355 1128 | HeapSnapshotOptions() {}1356 | ^1357../../deps/v8/include/v8-profiler.h:1142:25: note: declared here1358 1142 | ObjectNameResolver* global_object_name_resolver = nullptr;1359 | ^~~~~~~~~~~~~~~~~~~~~~~~~~~1360[203/1871] CXX obj/src/node_base.node_postmortem_metadata.o1361In file included from ../../src/memory_tracker.h:6,1362 from ../../src/base_object.h:29,1363 from ../../src/base_object-inl.h:27,1364 from ../../src/node_postmortem_metadata.cc:1:1365../../deps/v8/include/v8-profiler.h: In constructor 'v8::HeapProfiler::HeapSnapshotOptions::HeapSnapshotOptions()':1366../../deps/v8/include/v8-profiler.h:1128:27: warning: 'v8::HeapProfiler::HeapSnapshotOptions::global_object_name_resolver' is deprecated: Use context_name_resolver callback instead. [-Wdeprecated-declarations]1367 1128 | HeapSnapshotOptions() {}1368 | ^1369../../deps/v8/include/v8-profiler.h:1142:25: note: declared here1370 1142 | ObjectNameResolver* global_object_name_resolver = nullptr;1371 | ^~~~~~~~~~~~~~~~~~~~~~~~~~~1372../../deps/v8/include/v8-profiler.h:1128:27: warning: 'v8::HeapProfiler::HeapSnapshotOptions::global_object_name_resolver' is deprecated: Use context_name_resolver callback instead. [-Wdeprecated-declarations]1373 1128 | HeapSnapshotOptions() {}1374 | ^1375../../deps/v8/include/v8-profiler.h:1142:25: note: declared here1376 1142 | ObjectNameResolver* global_object_name_resolver = nullptr;1377 | ^~~~~~~~~~~~~~~~~~~~~~~~~~~1378[204/1871] CXX obj/deps/v8/third_party/simdutf/simdutf.simdutf.o1379[205/1871] AR obj/tools/v8_gypfiles/libsimdutf.a1380[206/1871] CXX obj/src/node_base.node_types.o1381In file included from ../../src/memory_tracker.h:6,1382 from ../../src/aliased_buffer.h:7,1383 from ../../src/aliased_buffer-inl.h:6,1384 from ../../src/env-inl.h:27,1385 from ../../src/node_types.cc:1:1386../../deps/v8/include/v8-profiler.h: In constructor 'v8::HeapProfiler::HeapSnapshotOptions::HeapSnapshotOptions()':1387../../deps/v8/include/v8-profiler.h:1128:27: warning: 'v8::HeapProfiler::HeapSnapshotOptions::global_object_name_resolver' is deprecated: Use context_name_resolver callback instead. [-Wdeprecated-declarations]1388 1128 | HeapSnapshotOptions() {}1389 | ^1390../../deps/v8/include/v8-profiler.h:1142:25: note: declared here1391 1142 | ObjectNameResolver* global_object_name_resolver = nullptr;1392 | ^~~~~~~~~~~~~~~~~~~~~~~~~~~1393../../deps/v8/include/v8-profiler.h:1128:27: warning: 'v8::HeapProfiler::HeapSnapshotOptions::global_object_name_resolver' is deprecated: Use context_name_resolver callback instead. [-Wdeprecated-declarations]1394 1128 | HeapSnapshotOptions() {}1395 | ^1396../../deps/v8/include/v8-profiler.h:1142:25: note: declared here1397 1142 | ObjectNameResolver* global_object_name_resolver = nullptr;1398 | ^~~~~~~~~~~~~~~~~~~~~~~~~~~1399[207/1871] CXX obj/src/dataqueue/node_base.queue.o1400In file included from ../../src/memory_tracker.h:6,1401 from ../../src/base_object.h:29,1402 from ../../src/dataqueue/queue.h:5,1403 from ../../src/dataqueue/queue.cc:1:1404../../deps/v8/include/v8-profiler.h: In constructor 'v8::HeapProfiler::HeapSnapshotOptions::HeapSnapshotOptions()':1405../../deps/v8/include/v8-profiler.h:1128:27: warning: 'v8::HeapProfiler::HeapSnapshotOptions::global_object_name_resolver' is deprecated: Use context_name_resolver callback instead. [-Wdeprecated-declarations]1406 1128 | HeapSnapshotOptions() {}1407 | ^1408../../deps/v8/include/v8-profiler.h:1142:25: note: declared here1409 1142 | ObjectNameResolver* global_object_name_resolver = nullptr;1410 | ^~~~~~~~~~~~~~~~~~~~~~~~~~~1411../../deps/v8/include/v8-profiler.h:1128:27: warning: 'v8::HeapProfiler::HeapSnapshotOptions::global_object_name_resolver' is deprecated: Use context_name_resolver callback instead. [-Wdeprecated-declarations]1412 1128 | HeapSnapshotOptions() {}1413 | ^1414../../deps/v8/include/v8-profiler.h:1142:25: note: declared here1415 1142 | ObjectNameResolver* global_object_name_resolver = nullptr;1416 | ^~~~~~~~~~~~~~~~~~~~~~~~~~~1417[208/1871] CXX obj/src/node_base.node_report_module.o1418In file included from ../../src/memory_tracker.h:6,1419 from ../../src/aliased_buffer.h:7,1420 from ../../src/env.h:27,1421 from ../../src/node_report_module.cc:1:1422../../deps/v8/include/v8-profiler.h: In constructor 'v8::HeapProfiler::HeapSnapshotOptions::HeapSnapshotOptions()':1423../../deps/v8/include/v8-profiler.h:1128:27: warning: 'v8::HeapProfiler::HeapSnapshotOptions::global_object_name_resolver' is deprecated: Use context_name_resolver callback instead. [-Wdeprecated-declarations]1424 1128 | HeapSnapshotOptions() {}1425 | ^1426../../deps/v8/include/v8-profiler.h:1142:25: note: declared here1427 1142 | ObjectNameResolver* global_object_name_resolver = nullptr;1428 | ^~~~~~~~~~~~~~~~~~~~~~~~~~~1429../../deps/v8/include/v8-profiler.h:1128:27: warning: 'v8::HeapProfiler::HeapSnapshotOptions::global_object_name_resolver' is deprecated: Use context_name_resolver callback instead. [-Wdeprecated-declarations]1430 1128 | HeapSnapshotOptions() {}1431 | ^1432../../deps/v8/include/v8-profiler.h:1142:25: note: declared here1433 1142 | ObjectNameResolver* global_object_name_resolver = nullptr;1434 | ^~~~~~~~~~~~~~~~~~~~~~~~~~~1435[209/1871] CXX obj/src/node_base.node_os.o1436In file included from ../../src/memory_tracker.h:6,1437 from ../../src/aliased_buffer.h:7,1438 from ../../src/aliased_buffer-inl.h:6,1439 from ../../src/env-inl.h:27,1440 from ../../src/node_os.cc:22:1441../../deps/v8/include/v8-profiler.h: In constructor 'v8::HeapProfiler::HeapSnapshotOptions::HeapSnapshotOptions()':1442../../deps/v8/include/v8-profiler.h:1128:27: warning: 'v8::HeapProfiler::HeapSnapshotOptions::global_object_name_resolver' is deprecated: Use context_name_resolver callback instead. [-Wdeprecated-declarations]1443 1128 | HeapSnapshotOptions() {}1444 | ^1445../../deps/v8/include/v8-profiler.h:1142:25: note: declared here1446 1142 | ObjectNameResolver* global_object_name_resolver = nullptr;1447 | ^~~~~~~~~~~~~~~~~~~~~~~~~~~1448../../deps/v8/include/v8-profiler.h:1128:27: warning: 'v8::HeapProfiler::HeapSnapshotOptions::global_object_name_resolver' is deprecated: Use context_name_resolver callback instead. [-Wdeprecated-declarations]1449 1128 | HeapSnapshotOptions() {}1450 | ^1451../../deps/v8/include/v8-profiler.h:1142:25: note: declared here1452 1142 | ObjectNameResolver* global_object_name_resolver = nullptr;1453 | ^~~~~~~~~~~~~~~~~~~~~~~~~~~1454[210/1871] CXX obj/src/node_base.node_diagnostics_channel.o1455In file included from ../../src/memory_tracker.h:6,1456 from ../../src/aliased_buffer.h:7,1457 from ../../src/node_diagnostics_channel.h:11,1458 from ../../src/node_diagnostics_channel.cc:1:1459../../deps/v8/include/v8-profiler.h: In constructor 'v8::HeapProfiler::HeapSnapshotOptions::HeapSnapshotOptions()':1460../../deps/v8/include/v8-profiler.h:1128:27: warning: 'v8::HeapProfiler::HeapSnapshotOptions::global_object_name_resolver' is deprecated: Use context_name_resolver callback instead. [-Wdeprecated-declarations]1461 1128 | HeapSnapshotOptions() {}1462 | ^1463../../deps/v8/include/v8-profiler.h:1142:25: note: declared here1464 1142 | ObjectNameResolver* global_object_name_resolver = nullptr;1465 | ^~~~~~~~~~~~~~~~~~~~~~~~~~~1466../../deps/v8/include/v8-profiler.h:1128:27: warning: 'v8::HeapProfiler::HeapSnapshotOptions::global_object_name_resolver' is deprecated: Use context_name_resolver callback instead. [-Wdeprecated-declarations]1467 1128 | HeapSnapshotOptions() {}1468 | ^1469../../deps/v8/include/v8-profiler.h:1142:25: note: declared here1470 1142 | ObjectNameResolver* global_object_name_resolver = nullptr;1471 | ^~~~~~~~~~~~~~~~~~~~~~~~~~~1472[211/1871] CXX obj/src/node_base.node_messaging.o1473In file included from ../../src/memory_tracker.h:6,1474 from ../../src/aliased_buffer.h:7,1475 from ../../src/env.h:27,1476 from ../../src/node_messaging.h:6,1477 from ../../src/node_messaging.cc:1:1478../../deps/v8/include/v8-profiler.h: In constructor 'v8::HeapProfiler::HeapSnapshotOptions::HeapSnapshotOptions()':1479../../deps/v8/include/v8-profiler.h:1128:27: warning: 'v8::HeapProfiler::HeapSnapshotOptions::global_object_name_resolver' is deprecated: Use context_name_resolver callback instead. [-Wdeprecated-declarations]1480 1128 | HeapSnapshotOptions() {}1481 | ^1482../../deps/v8/include/v8-profiler.h:1142:25: note: declared here1483 1142 | ObjectNameResolver* global_object_name_resolver = nullptr;1484 | ^~~~~~~~~~~~~~~~~~~~~~~~~~~1485../../deps/v8/include/v8-profiler.h:1128:27: warning: 'v8::HeapProfiler::HeapSnapshotOptions::global_object_name_resolver' is deprecated: Use context_name_resolver callback instead. [-Wdeprecated-declarations]1486 1128 | HeapSnapshotOptions() {}1487 | ^1488../../deps/v8/include/v8-profiler.h:1142:25: note: declared here1489 1142 | ObjectNameResolver* global_object_name_resolver = nullptr;1490 | ^~~~~~~~~~~~~~~~~~~~~~~~~~~1491[212/1871] CXX obj/src/node_base.node_realm.o1492In file included from ../../src/memory_tracker.h:6,1493 from ../../src/cleanup_queue.h:11,1494 from ../../src/node_realm.h:8,1495 from ../../src/node_realm.cc:1:1496../../deps/v8/include/v8-profiler.h: In constructor 'v8::HeapProfiler::HeapSnapshotOptions::HeapSnapshotOptions()':1497../../deps/v8/include/v8-profiler.h:1128:27: warning: 'v8::HeapProfiler::HeapSnapshotOptions::global_object_name_resolver' is deprecated: Use context_name_resolver callback instead. [-Wdeprecated-declarations]1498 1128 | HeapSnapshotOptions() {}1499 | ^1500../../deps/v8/include/v8-profiler.h:1142:25: note: declared here1501 1142 | ObjectNameResolver* global_object_name_resolver = nullptr;1502 | ^~~~~~~~~~~~~~~~~~~~~~~~~~~1503../../deps/v8/include/v8-profiler.h:1128:27: warning: 'v8::HeapProfiler::HeapSnapshotOptions::global_object_name_resolver' is deprecated: Use context_name_resolver callback instead. [-Wdeprecated-declarations]1504 1128 | HeapSnapshotOptions() {}1505 | ^1506../../deps/v8/include/v8-profiler.h:1142:25: note: declared here1507 1142 | ObjectNameResolver* global_object_name_resolver = nullptr;1508 | ^~~~~~~~~~~~~~~~~~~~~~~~~~~1509[213/1871] CXX obj/gen/node_base.node_javascript.o1510In file included from ../../src/memory_tracker.h:6,1511 from ../../src/aliased_buffer.h:7,1512 from ../../src/aliased_buffer-inl.h:6,1513 from ../../src/env-inl.h:27,1514 from gen/node_javascript.cc:2:1515../../deps/v8/include/v8-profiler.h: In constructor 'v8::HeapProfiler::HeapSnapshotOptions::HeapSnapshotOptions()':1516../../deps/v8/include/v8-profiler.h:1128:27: warning: 'v8::HeapProfiler::HeapSnapshotOptions::global_object_name_resolver' is deprecated: Use context_name_resolver callback instead. [-Wdeprecated-declarations]1517 1128 | HeapSnapshotOptions() {}1518 | ^1519../../deps/v8/include/v8-profiler.h:1142:25: note: declared here1520 1142 | ObjectNameResolver* global_object_name_resolver = nullptr;1521 | ^~~~~~~~~~~~~~~~~~~~~~~~~~~1522../../deps/v8/include/v8-profiler.h:1128:27: warning: 'v8::HeapProfiler::HeapSnapshotOptions::global_object_name_resolver' is deprecated: Use context_name_resolver callback instead. [-Wdeprecated-declarations]1523 1128 | HeapSnapshotOptions() {}1524 | ^1525../../deps/v8/include/v8-profiler.h:1142:25: note: declared here1526 1142 | ObjectNameResolver* global_object_name_resolver = nullptr;1527 | ^~~~~~~~~~~~~~~~~~~~~~~~~~~1528[214/1871] CXX obj/src/node_base.node_report_utils.o1529In file included from ../../src/memory_tracker.h:6,1530 from ../../src/aliased_buffer.h:7,1531 from ../../src/env.h:27,1532 from ../../src/node_internals.h:27,1533 from ../../src/node_report_utils.cc:2:1534../../deps/v8/include/v8-profiler.h: In constructor 'v8::HeapProfiler::HeapSnapshotOptions::HeapSnapshotOptions()':1535../../deps/v8/include/v8-profiler.h:1128:27: warning: 'v8::HeapProfiler::HeapSnapshotOptions::global_object_name_resolver' is deprecated: Use context_name_resolver callback instead. [-Wdeprecated-declarations]1536 1128 | HeapSnapshotOptions() {}1537 | ^1538../../deps/v8/include/v8-profiler.h:1142:25: note: declared here1539 1142 | ObjectNameResolver* global_object_name_resolver = nullptr;1540 | ^~~~~~~~~~~~~~~~~~~~~~~~~~~1541../../deps/v8/include/v8-profiler.h:1128:27: warning: 'v8::HeapProfiler::HeapSnapshotOptions::global_object_name_resolver' is deprecated: Use context_name_resolver callback instead. [-Wdeprecated-declarations]1542 1128 | HeapSnapshotOptions() {}1543 | ^1544../../deps/v8/include/v8-profiler.h:1142:25: note: declared here1545 1142 | ObjectNameResolver* global_object_name_resolver = nullptr;1546 | ^~~~~~~~~~~~~~~~~~~~~~~~~~~1547[215/1871] CXX obj/src/node_base.node_perf.o1548In file included from ../../src/memory_tracker.h:6,1549 from ../../src/base_object.h:29,1550 from ../../src/base_object-inl.h:27,1551 from ../../src/node_perf.h:6,1552 from ../../src/node_perf.cc:1:1553../../deps/v8/include/v8-profiler.h: In constructor 'v8::HeapProfiler::HeapSnapshotOptions::HeapSnapshotOptions()':1554../../deps/v8/include/v8-profiler.h:1128:27: warning: 'v8::HeapProfiler::HeapSnapshotOptions::global_object_name_resolver' is deprecated: Use context_name_resolver callback instead. [-Wdeprecated-declarations]1555 1128 | HeapSnapshotOptions() {}1556 | ^1557../../deps/v8/include/v8-profiler.h:1142:25: note: declared here1558 1142 | ObjectNameResolver* global_object_name_resolver = nullptr;1559 | ^~~~~~~~~~~~~~~~~~~~~~~~~~~1560../../deps/v8/include/v8-profiler.h:1128:27: warning: 'v8::HeapProfiler::HeapSnapshotOptions::global_object_name_resolver' is deprecated: Use context_name_resolver callback instead. [-Wdeprecated-declarations]1561 1128 | HeapSnapshotOptions() {}1562 | ^1563../../deps/v8/include/v8-profiler.h:1142:25: note: declared here1564 1142 | ObjectNameResolver* global_object_name_resolver = nullptr;1565 | ^~~~~~~~~~~~~~~~~~~~~~~~~~~1566[216/1871] CXX obj/src/node_base.node_platform.o1567In file included from ../../src/util.h:29,1568 from ../../src/node_mutex.h:6,1569 from ../../src/node_platform.h:15,1570 from ../../src/node_platform.cc:1:1571../../deps/v8/include/v8-profiler.h: In constructor 'v8::HeapProfiler::HeapSnapshotOptions::HeapSnapshotOptions()':1572../../deps/v8/include/v8-profiler.h:1128:27: warning: 'v8::HeapProfiler::HeapSnapshotOptions::global_object_name_resolver' is deprecated: Use context_name_resolver callback instead. [-Wdeprecated-declarations]1573 1128 | HeapSnapshotOptions() {}1574 | ^1575../../deps/v8/include/v8-profiler.h:1142:25: note: declared here1576 1142 | ObjectNameResolver* global_object_name_resolver = nullptr;1577 | ^~~~~~~~~~~~~~~~~~~~~~~~~~~1578../../deps/v8/include/v8-profiler.h:1128:27: warning: 'v8::HeapProfiler::HeapSnapshotOptions::global_object_name_resolver' is deprecated: Use context_name_resolver callback instead. [-Wdeprecated-declarations]1579 1128 | HeapSnapshotOptions() {}1580 | ^1581../../deps/v8/include/v8-profiler.h:1142:25: note: declared here1582 1142 | ObjectNameResolver* global_object_name_resolver = nullptr;1583 | ^~~~~~~~~~~~~~~~~~~~~~~~~~~1584[217/1871] CXX obj/src/node_base.node_util.o1585In file included from ../../src/memory_tracker.h:6,1586 from ../../src/base_object.h:29,1587 from ../../src/base_object-inl.h:27,1588 from ../../src/node_util.cc:1:1589../../deps/v8/include/v8-profiler.h: In constructor 'v8::HeapProfiler::HeapSnapshotOptions::HeapSnapshotOptions()':1590../../deps/v8/include/v8-profiler.h:1128:27: warning: 'v8::HeapProfiler::HeapSnapshotOptions::global_object_name_resolver' is deprecated: Use context_name_resolver callback instead. [-Wdeprecated-declarations]1591 1128 | HeapSnapshotOptions() {}1592 | ^1593../../deps/v8/include/v8-profiler.h:1142:25: note: declared here1594 1142 | ObjectNameResolver* global_object_name_resolver = nullptr;1595 | ^~~~~~~~~~~~~~~~~~~~~~~~~~~1596../../deps/v8/include/v8-profiler.h:1128:27: warning: 'v8::HeapProfiler::HeapSnapshotOptions::global_object_name_resolver' is deprecated: Use context_name_resolver callback instead. [-Wdeprecated-declarations]1597 1128 | HeapSnapshotOptions() {}1598 | ^1599../../deps/v8/include/v8-profiler.h:1142:25: note: declared here1600 1142 | ObjectNameResolver* global_object_name_resolver = nullptr;1601 | ^~~~~~~~~~~~~~~~~~~~~~~~~~~1602[218/1871] CXX obj/src/node_base.node_process_events.o1603In file included from ../../src/memory_tracker.h:6,1604 from ../../src/aliased_buffer.h:7,1605 from ../../src/aliased_buffer-inl.h:6,1606 from ../../src/env-inl.h:27,1607 from ../../src/node_process_events.cc:3:1608../../deps/v8/include/v8-profiler.h: In constructor 'v8::HeapProfiler::HeapSnapshotOptions::HeapSnapshotOptions()':1609../../deps/v8/include/v8-profiler.h:1128:27: warning: 'v8::HeapProfiler::HeapSnapshotOptions::global_object_name_resolver' is deprecated: Use context_name_resolver callback instead. [-Wdeprecated-declarations]1610 1128 | HeapSnapshotOptions() {}1611 | ^1612../../deps/v8/include/v8-profiler.h:1142:25: note: declared here1613 1142 | ObjectNameResolver* global_object_name_resolver = nullptr;1614 | ^~~~~~~~~~~~~~~~~~~~~~~~~~~1615../../deps/v8/include/v8-profiler.h:1128:27: warning: 'v8::HeapProfiler::HeapSnapshotOptions::global_object_name_resolver' is deprecated: Use context_name_resolver callback instead. [-Wdeprecated-declarations]1616 1128 | HeapSnapshotOptions() {}1617 | ^1618../../deps/v8/include/v8-profiler.h:1142:25: note: declared here1619 1142 | ObjectNameResolver* global_object_name_resolver = nullptr;1620 | ^~~~~~~~~~~~~~~~~~~~~~~~~~~1621[219/1871] CXX obj/src/node_base.cares_wrap.o1622In file included from ../../src/memory_tracker.h:6,1623 from ../../src/base_object.h:29,1624 from ../../src/async_wrap.h:27,1625 from ../../src/cares_wrap.h:8,1626 from ../../src/cares_wrap.cc:22:1627../../deps/v8/include/v8-profiler.h: In constructor 'v8::HeapProfiler::HeapSnapshotOptions::HeapSnapshotOptions()':1628../../deps/v8/include/v8-profiler.h:1128:27: warning: 'v8::HeapProfiler::HeapSnapshotOptions::global_object_name_resolver' is deprecated: Use context_name_resolver callback instead. [-Wdeprecated-declarations]1629 1128 | HeapSnapshotOptions() {}1630 | ^1631../../deps/v8/include/v8-profiler.h:1142:25: note: declared here1632 1142 | ObjectNameResolver* global_object_name_resolver = nullptr;1633 | ^~~~~~~~~~~~~~~~~~~~~~~~~~~1634../../deps/v8/include/v8-profiler.h:1128:27: warning: 'v8::HeapProfiler::HeapSnapshotOptions::global_object_name_resolver' is deprecated: Use context_name_resolver callback instead. [-Wdeprecated-declarations]1635 1128 | HeapSnapshotOptions() {}1636 | ^1637../../deps/v8/include/v8-profiler.h:1142:25: note: declared here1638 1142 | ObjectNameResolver* global_object_name_resolver = nullptr;1639 | ^~~~~~~~~~~~~~~~~~~~~~~~~~~1640../../src/cares_wrap.cc: In function 'v8::Maybe<int> node::cares_wrap::{anonymous}::ParseGeneralReply(node::Environment*, const unsigned char*, int, int*, v8::Local<v8::Array>, void*, int*)':1641../../src/cares_wrap.cc:244:34: warning: 'int ares_parse_a_reply(const unsigned char*, int, hostent**, ares_addrttl*, int*)' is deprecated: Use ares_dns_parse instead [-Wdeprecated-declarations]1642 244 | status = ares_parse_a_reply(buf,1643 | ~~~~~~~~~~~~~~~~~~^~~~~1644 245 | len,1645 | ~~~~1646 246 | &host,1647 | ~~~~~~1648 247 | static_cast<ares_addrttl*>(addrttls),1649 | ~~~~~~~~~~~~~~~~~~~~~~~~~~~~~~~~~~~~~1650 248 | naddrttls);1651 | ~~~~~~~~~~1652In file included from ../../src/cares_wrap.h:17:1653/nix/store/j239p458yixap89j6wpfib9yjypd3ii5-c-ares-1.34.8-dev/include/ares.h:1106:55: note: declared here1654 1106 | CARES_EXTERN CARES_DEPRECATED_FOR(ares_dns_parse) int ares_parse_a_reply(1655 | ^~~~~~~~~~~~~~~~~~1656../../src/cares_wrap.cc:251:37: warning: 'int ares_parse_aaaa_reply(const unsigned char*, int, hostent**, ares_addr6ttl*, int*)' is deprecated: Use ares_dns_parse instead [-Wdeprecated-declarations]1657 251 | status = ares_parse_aaaa_reply(buf,1658 | ~~~~~~~~~~~~~~~~~~~~~^~~~~1659 252 | len,1660 | ~~~~1661 253 | &host,1662 | ~~~~~~1663 254 | static_cast<ares_addr6ttl*>(addrttls),1664 | ~~~~~~~~~~~~~~~~~~~~~~~~~~~~~~~~~~~~~~1665 255 | naddrttls);1666 | ~~~~~~~~~~1667/nix/store/j239p458yixap89j6wpfib9yjypd3ii5-c-ares-1.34.8-dev/include/ares.h:1110:55: note: declared here1668 1110 | CARES_EXTERN CARES_DEPRECATED_FOR(ares_dns_parse) int ares_parse_aaaa_reply(1669 | ^~~~~~~~~~~~~~~~~~~~~1670../../src/cares_wrap.cc:258:35: warning: 'int ares_parse_ns_reply(const unsigned char*, int, hostent**)' is deprecated: Use ares_dns_parse instead [-Wdeprecated-declarations]1671 258 | status = ares_parse_ns_reply(buf, len, &host);1672 | ~~~~~~~~~~~~~~~~~~~^~~~~~~~~~~~~~~~~1673/nix/store/j239p458yixap89j6wpfib9yjypd3ii5-c-ares-1.34.8-dev/include/ares.h:1121:55: note: declared here1674 1121 | CARES_EXTERN CARES_DEPRECATED_FOR(ares_dns_parse) int ares_parse_ns_reply(1675 | ^~~~~~~~~~~~~~~~~~~1676../../src/cares_wrap.cc:261:36: warning: 'int ares_parse_ptr_reply(const unsigned char*, int, const void*, int, int, hostent**)' is deprecated: Use ares_dns_parse instead [-Wdeprecated-declarations]1677 261 | status = ares_parse_ptr_reply(buf, len, nullptr, 0, AF_INET, &host);1678 | ~~~~~~~~~~~~~~~~~~~~^~~~~~~~~~~~~~~~~~~~~~~~~~~~~~~~~~~~~~1679/nix/store/j239p458yixap89j6wpfib9yjypd3ii5-c-ares-1.34.8-dev/include/ares.h:1117:55: note: declared here1680 1117 | CARES_EXTERN CARES_DEPRECATED_FOR(ares_dns_parse) int ares_parse_ptr_reply(1681 | ^~~~~~~~~~~~~~~~~~~~1682../../src/cares_wrap.cc: In function 'v8::Maybe<int> node::cares_wrap::{anonymous}::ParseMxReply(node::Environment*, const unsigned char*, int, v8::Local<v8::Array>, bool)':1683../../src/cares_wrap.cc:337:35: warning: 'int ares_parse_mx_reply(const unsigned char*, int, ares_mx_reply**)' is deprecated: Use ares_dns_parse instead [-Wdeprecated-declarations]1684 337 | int status = ares_parse_mx_reply(buf, len, &mx_start);1685 | ~~~~~~~~~~~~~~~~~~~^~~~~~~~~~~~~~~~~~~~~1686/nix/store/j239p458yixap89j6wpfib9yjypd3ii5-c-ares-1.34.8-dev/include/ares.h:1127:55: note: declared here1687 1127 | CARES_EXTERN CARES_DEPRECATED_FOR(ares_dns_parse) int ares_parse_mx_reply(1688 | ^~~~~~~~~~~~~~~~~~~1689../../src/cares_wrap.cc: In function 'v8::Maybe<int> node::cares_wrap::{anonymous}::ParseCaaReply(node::Environment*, const unsigned char*, int, v8::Local<v8::Array>, bool)':1690../../src/cares_wrap.cc:383:36: warning: 'int ares_parse_caa_reply(const unsigned char*, int, ares_caa_reply**)' is deprecated: Use ares_dns_parse instead [-Wdeprecated-declarations]1691 383 | int status = ares_parse_caa_reply(buf, len, &caa_start);1692 | ~~~~~~~~~~~~~~~~~~~~^~~~~~~~~~~~~~~~~~~~~~1693/nix/store/j239p458yixap89j6wpfib9yjypd3ii5-c-ares-1.34.8-dev/include/ares.h:1114:55: note: declared here1694 1114 | CARES_EXTERN CARES_DEPRECATED_FOR(ares_dns_parse) int ares_parse_caa_reply(1695 | ^~~~~~~~~~~~~~~~~~~~1696../../src/cares_wrap.cc: In function 'v8::Maybe<int> node::cares_wrap::{anonymous}::ParseTxtReply(node::Environment*, const unsigned char*, int, v8::Local<v8::Array>, bool)':1697../../src/cares_wrap.cc:511:40: warning: 'int ares_parse_txt_reply_ext(const unsigned char*, int, ares_txt_ext**)' is deprecated: Use ares_dns_parse instead [-Wdeprecated-declarations]1698 511 | int status = ares_parse_txt_reply_ext(buf, len, &txt_out);1699 | ~~~~~~~~~~~~~~~~~~~~~~~~^~~~~~~~~~~~~~~~~~~~1700/nix/store/j239p458yixap89j6wpfib9yjypd3ii5-c-ares-1.34.8-dev/include/ares.h:1133:55: note: declared here1701 1133 | CARES_EXTERN CARES_DEPRECATED_FOR(ares_dns_parse) int ares_parse_txt_reply_ext(1702 | ^~~~~~~~~~~~~~~~~~~~~~~~1703../../src/cares_wrap.cc: In function 'v8::Maybe<int> node::cares_wrap::{anonymous}::ParseSrvReply(node::Environment*, const unsigned char*, int, v8::Local<v8::Array>, bool)':1704../../src/cares_wrap.cc:598:36: warning: 'int ares_parse_srv_reply(const unsigned char*, int, ares_srv_reply**)' is deprecated: Use ares_dns_parse instead [-Wdeprecated-declarations]1705 598 | int status = ares_parse_srv_reply(buf, len, &srv_start);1706 | ~~~~~~~~~~~~~~~~~~~~^~~~~~~~~~~~~~~~~~~~~~1707/nix/store/j239p458yixap89j6wpfib9yjypd3ii5-c-ares-1.34.8-dev/include/ares.h:1124:55: note: declared here1708 1124 | CARES_EXTERN CARES_DEPRECATED_FOR(ares_dns_parse) int ares_parse_srv_reply(1709 | ^~~~~~~~~~~~~~~~~~~~1710../../src/cares_wrap.cc: In function 'v8::Maybe<int> node::cares_wrap::{anonymous}::ParseNaptrReply(node::Environment*, const unsigned char*, int, v8::Local<v8::Array>, bool)':1711../../src/cares_wrap.cc:653:38: warning: 'int ares_parse_naptr_reply(const unsigned char*, int, ares_naptr_reply**)' is deprecated: Use ares_dns_parse instead [-Wdeprecated-declarations]1712 653 | int status = ares_parse_naptr_reply(buf, len, &naptr_start);1713 | ~~~~~~~~~~~~~~~~~~~~~~^~~~~~~~~~~~~~~~~~~~~~~~1714/nix/store/j239p458yixap89j6wpfib9yjypd3ii5-c-ares-1.34.8-dev/include/ares.h:1136:55: note: declared here1715 1136 | CARES_EXTERN CARES_DEPRECATED_FOR(ares_dns_parse) int ares_parse_naptr_reply(1716 | ^~~~~~~~~~~~~~~~~~~~~~1717../../src/cares_wrap.cc: In member function 'void node::cares_wrap::ChannelWrap::EnsureServers()':1718../../src/cares_wrap.cc:1000:25: warning: 'int ares_get_servers_ports(const ares_channel_t*, ares_addr_port_node**)' is deprecated: Use ares_get_servers_csv instead [-Wdeprecated-declarations]1719 1000 | ares_get_servers_ports(channel_, &servers);1720 | ~~~~~~~~~~~~~~~~~~~~~~^~~~~~~~~~~~~~~~~~~~1721/nix/store/j239p458yixap89j6wpfib9yjypd3ii5-c-ares-1.34.8-dev/include/ares.h:1196:28: note: declared here1722 1196 | int ares_get_servers_ports(const ares_channel_t *channel,1723 | ^~~~~~~~~~~~~~~~~~~~~~1724../../src/cares_wrap.cc: In static member function 'static v8::Maybe<int> node::cares_wrap::SoaTraits::Parse(node::cares_wrap::QuerySoaWrap*, const std::unique_ptr<node::cares_wrap::ResponseData>&)':1725../../src/cares_wrap.cc:1711:36: warning: 'int ares_parse_soa_reply(const unsigned char*, int, ares_soa_reply**)' is deprecated: Use ares_dns_parse instead [-Wdeprecated-declarations]1726 1711 | int status = ares_parse_soa_reply(buf, len, &soa_out);1727 | ~~~~~~~~~~~~~~~~~~~~^~~~~~~~~~~~~~~~~~~~1728/nix/store/j239p458yixap89j6wpfib9yjypd3ii5-c-ares-1.34.8-dev/include/ares.h:1139:55: note: declared here1729 1139 | CARES_EXTERN CARES_DEPRECATED_FOR(ares_dns_parse) int ares_parse_soa_reply(1730 | ^~~~~~~~~~~~~~~~~~~~1731../../src/cares_wrap.cc: In function 'void node::cares_wrap::{anonymous}::GetServers(const v8::FunctionCallbackInfo<v8::Value>&)':1732../../src/cares_wrap.cc:2092:33: warning: 'int ares_get_servers_ports(const ares_channel_t*, ares_addr_port_node**)' is deprecated: Use ares_get_servers_csv instead [-Wdeprecated-declarations]1733 2092 | int r = ares_get_servers_ports(channel->cares_channel(), &servers);1734 | ~~~~~~~~~~~~~~~~~~~~~~^~~~~~~~~~~~~~~~~~~~~~~~~~~~~~~~~~~~1735/nix/store/j239p458yixap89j6wpfib9yjypd3ii5-c-ares-1.34.8-dev/include/ares.h:1196:28: note: declared here1736 1196 | int ares_get_servers_ports(const ares_channel_t *channel,1737 | ^~~~~~~~~~~~~~~~~~~~~~1738../../src/cares_wrap.cc: In function 'void node::cares_wrap::{anonymous}::SetServers(const v8::FunctionCallbackInfo<v8::Value>&)':1739../../src/cares_wrap.cc:2137:30: warning: 'int ares_set_servers(ares_channel_t*, const ares_addr_node*)' is deprecated: Use ares_set_servers_csv instead [-Wdeprecated-declarations]1740 2137 | int rv = ares_set_servers(channel->cares_channel(), nullptr);1741 | ~~~~~~~~~~~~~~~~^~~~~~~~~~~~~~~~~~~~~~~~~~~~~~~~~~~1742/nix/store/j239p458yixap89j6wpfib9yjypd3ii5-c-ares-1.34.8-dev/include/ares.h:1176:61: note: declared here1743 1176 | CARES_EXTERN CARES_DEPRECATED_FOR(ares_set_servers_csv) int ares_set_servers(1744 | ^~~~~~~~~~~~~~~~1745../../src/cares_wrap.cc:2197:33: warning: 'int ares_set_servers_ports(ares_channel_t*, const ares_addr_port_node*)' is deprecated: Use ares_set_servers_ports_csv instead [-Wdeprecated-declarations]1746 2197 | err = ares_set_servers_ports(channel->cares_channel(), servers.data());1747 | ~~~~~~~~~~~~~~~~~~~~~~^~~~~~~~~~~~~~~~~~~~~~~~~~~~~~~~~~~~~~~~~~1748/nix/store/j239p458yixap89j6wpfib9yjypd3ii5-c-ares-1.34.8-dev/include/ares.h:1181:20: note: declared here1749 1181 | int ares_set_servers_ports(ares_channel_t *channel,1750 | ^~~~~~~~~~~~~~~~~~~~~~1751[220/1871] CXX obj/src/node_base.node_serdes.o1752In file included from ../../src/memory_tracker.h:6,1753 from ../../src/base_object.h:29,1754 from ../../src/base_object-inl.h:27,1755 from ../../src/node_serdes.cc:1:1756../../deps/v8/include/v8-profiler.h: In constructor 'v8::HeapProfiler::HeapSnapshotOptions::HeapSnapshotOptions()':1757../../deps/v8/include/v8-profiler.h:1128:27: warning: 'v8::HeapProfiler::HeapSnapshotOptions::global_object_name_resolver' is deprecated: Use context_name_resolver callback instead. [-Wdeprecated-declarations]1758 1128 | HeapSnapshotOptions() {}1759 | ^1760../../deps/v8/include/v8-profiler.h:1142:25: note: declared here1761 1142 | ObjectNameResolver* global_object_name_resolver = nullptr;1762 | ^~~~~~~~~~~~~~~~~~~~~~~~~~~1763../../deps/v8/include/v8-profiler.h:1128:27: warning: 'v8::HeapProfiler::HeapSnapshotOptions::global_object_name_resolver' is deprecated: Use context_name_resolver callback instead. [-Wdeprecated-declarations]1764 1128 | HeapSnapshotOptions() {}1765 | ^1766../../deps/v8/include/v8-profiler.h:1142:25: note: declared here1767 1142 | ObjectNameResolver* global_object_name_resolver = nullptr;1768 | ^~~~~~~~~~~~~~~~~~~~~~~~~~~1769[221/1871] CXX obj/src/tracing/node_base.agent.o1770In file included from ../../src/util.h:29,1771 from ../../src/node_mutex.h:6,1772 from ../../src/tracing/agent_legacy.h:14,1773 from ../../src/tracing/agent.cc:6:1774../../deps/v8/include/v8-profiler.h: In constructor 'v8::HeapProfiler::HeapSnapshotOptions::HeapSnapshotOptions()':1775../../deps/v8/include/v8-profiler.h:1128:27: warning: 'v8::HeapProfiler::HeapSnapshotOptions::global_object_name_resolver' is deprecated: Use context_name_resolver callback instead. [-Wdeprecated-declarations]1776 1128 | HeapSnapshotOptions() {}1777 | ^1778../../deps/v8/include/v8-profiler.h:1142:25: note: declared here1779 1142 | ObjectNameResolver* global_object_name_resolver = nullptr;1780 | ^~~~~~~~~~~~~~~~~~~~~~~~~~~1781../../deps/v8/include/v8-profiler.h:1128:27: warning: 'v8::HeapProfiler::HeapSnapshotOptions::global_object_name_resolver' is deprecated: Use context_name_resolver callback instead. [-Wdeprecated-declarations]1782 1128 | HeapSnapshotOptions() {}1783 | ^1784../../deps/v8/include/v8-profiler.h:1142:25: note: declared here1785 1142 | ObjectNameResolver* global_object_name_resolver = nullptr;1786 | ^~~~~~~~~~~~~~~~~~~~~~~~~~~1787[222/1871] CXX obj/src/node_base.node_watchdog.o1788In file included from ../../src/memory_tracker.h:6,1789 from ../../src/base_object.h:29,1790 from ../../src/async_wrap.h:27,1791 from ../../src/async_wrap-inl.h:27,1792 from ../../src/node_watchdog.cc:24:1793../../deps/v8/include/v8-profiler.h: In constructor 'v8::HeapProfiler::HeapSnapshotOptions::HeapSnapshotOptions()':1794../../deps/v8/include/v8-profiler.h:1128:27: warning: 'v8::HeapProfiler::HeapSnapshotOptions::global_object_name_resolver' is deprecated: Use context_name_resolver callback instead. [-Wdeprecated-declarations]1795 1128 | HeapSnapshotOptions() {}1796 | ^1797../../deps/v8/include/v8-profiler.h:1142:25: note: declared here1798 1142 | ObjectNameResolver* global_object_name_resolver = nullptr;1799 | ^~~~~~~~~~~~~~~~~~~~~~~~~~~1800../../deps/v8/include/v8-profiler.h:1128:27: warning: 'v8::HeapProfiler::HeapSnapshotOptions::global_object_name_resolver' is deprecated: Use context_name_resolver callback instead. [-Wdeprecated-declarations]1801 1128 | HeapSnapshotOptions() {}1802 | ^1803../../deps/v8/include/v8-profiler.h:1142:25: note: declared here1804 1142 | ObjectNameResolver* global_object_name_resolver = nullptr;1805 | ^~~~~~~~~~~~~~~~~~~~~~~~~~~1806[223/1871] CXX obj/src/node_base.node_report.o1807In file included from ../../src/util.h:29,1808 from ../../src/node_report.h:9,1809 from ../../src/node_report.cc:1:1810../../deps/v8/include/v8-profiler.h: In constructor 'v8::HeapProfiler::HeapSnapshotOptions::HeapSnapshotOptions()':1811../../deps/v8/include/v8-profiler.h:1128:27: warning: 'v8::HeapProfiler::HeapSnapshotOptions::global_object_name_resolver' is deprecated: Use context_name_resolver callback instead. [-Wdeprecated-declarations]1812 1128 | HeapSnapshotOptions() {}1813 | ^1814../../deps/v8/include/v8-profiler.h:1142:25: note: declared here1815 1142 | ObjectNameResolver* global_object_name_resolver = nullptr;1816 | ^~~~~~~~~~~~~~~~~~~~~~~~~~~1817../../deps/v8/include/v8-profiler.h:1128:27: warning: 'v8::HeapProfiler::HeapSnapshotOptions::global_object_name_resolver' is deprecated: Use context_name_resolver callback instead. [-Wdeprecated-declarations]1818 1128 | HeapSnapshotOptions() {}1819 | ^1820../../deps/v8/include/v8-profiler.h:1142:25: note: declared here1821 1142 | ObjectNameResolver* global_object_name_resolver = nullptr;1822 | ^~~~~~~~~~~~~~~~~~~~~~~~~~~1823[224/1871] CXX obj/src/node_base.node_process_methods.o1824In file included from ../../src/memory_tracker.h:6,1825 from ../../src/base_object.h:29,1826 from ../../src/async_wrap.h:27,1827 from ../../src/async_wrap-inl.h:27,1828 from ../../src/node_process_methods.cc:1:1829../../deps/v8/include/v8-profiler.h: In constructor 'v8::HeapProfiler::HeapSnapshotOptions::HeapSnapshotOptions()':1830../../deps/v8/include/v8-profiler.h:1128:27: warning: 'v8::HeapProfiler::HeapSnapshotOptions::global_object_name_resolver' is deprecated: Use context_name_resolver callback instead. [-Wdeprecated-declarations]1831 1128 | HeapSnapshotOptions() {}1832 | ^1833../../deps/v8/include/v8-profiler.h:1142:25: note: declared here1834 1142 | ObjectNameResolver* global_object_name_resolver = nullptr;1835 | ^~~~~~~~~~~~~~~~~~~~~~~~~~~1836../../deps/v8/include/v8-profiler.h:1128:27: warning: 'v8::HeapProfiler::HeapSnapshotOptions::global_object_name_resolver' is deprecated: Use context_name_resolver callback instead. [-Wdeprecated-declarations]1837 1128 | HeapSnapshotOptions() {}1838 | ^1839../../deps/v8/include/v8-profiler.h:1142:25: note: declared here1840 1142 | ObjectNameResolver* global_object_name_resolver = nullptr;1841 | ^~~~~~~~~~~~~~~~~~~~~~~~~~~1842[225/1871] CXX obj/src/node_base.node_locks.o1843In file included from ../../src/memory_tracker.h:6,1844 from ../../src/base_object.h:29,1845 from ../../src/node_locks.h:11,1846 from ../../src/node_locks.cc:1:1847../../deps/v8/include/v8-profiler.h: In constructor 'v8::HeapProfiler::HeapSnapshotOptions::HeapSnapshotOptions()':1848../../deps/v8/include/v8-profiler.h:1128:27: warning: 'v8::HeapProfiler::HeapSnapshotOptions::global_object_name_resolver' is deprecated: Use context_name_resolver callback instead. [-Wdeprecated-declarations]1849 1128 | HeapSnapshotOptions() {}1850 | ^1851../../deps/v8/include/v8-profiler.h:1142:25: note: declared here1852 1142 | ObjectNameResolver* global_object_name_resolver = nullptr;1853 | ^~~~~~~~~~~~~~~~~~~~~~~~~~~1854../../deps/v8/include/v8-profiler.h:1128:27: warning: 'v8::HeapProfiler::HeapSnapshotOptions::global_object_name_resolver' is deprecated: Use context_name_resolver callback instead. [-Wdeprecated-declarations]1855 1128 | HeapSnapshotOptions() {}1856 | ^1857../../deps/v8/include/v8-profiler.h:1142:25: note: declared here1858 1142 | ObjectNameResolver* global_object_name_resolver = nullptr;1859 | ^~~~~~~~~~~~~~~~~~~~~~~~~~~1860[226/1871] CXX obj/src/node_base.node_wasm_web_api.o1861In file included from ../../src/memory_tracker.h:6,1862 from ../../src/base_object.h:29,1863 from ../../src/base_object-inl.h:27,1864 from ../../src/node_wasm_web_api.h:6,1865 from ../../src/node_wasm_web_api.cc:1:1866../../deps/v8/include/v8-profiler.h: In constructor 'v8::HeapProfiler::HeapSnapshotOptions::HeapSnapshotOptions()':1867../../deps/v8/include/v8-profiler.h:1128:27: warning: 'v8::HeapProfiler::HeapSnapshotOptions::global_object_name_resolver' is deprecated: Use context_name_resolver callback instead. [-Wdeprecated-declarations]1868 1128 | HeapSnapshotOptions() {}1869 | ^1870../../deps/v8/include/v8-profiler.h:1142:25: note: declared here1871 1142 | ObjectNameResolver* global_object_name_resolver = nullptr;1872 | ^~~~~~~~~~~~~~~~~~~~~~~~~~~1873../../deps/v8/include/v8-profiler.h:1128:27: warning: 'v8::HeapProfiler::HeapSnapshotOptions::global_object_name_resolver' is deprecated: Use context_name_resolver callback instead. [-Wdeprecated-declarations]1874 1128 | HeapSnapshotOptions() {}1875 | ^1876../../deps/v8/include/v8-profiler.h:1142:25: note: declared here1877 1142 | ObjectNameResolver* global_object_name_resolver = nullptr;1878 | ^~~~~~~~~~~~~~~~~~~~~~~~~~~1879[227/1871] CXX obj/src/tracing/node_base.traced_value.o1880In file included from ../../src/util.h:29,1881 from ../../src/tracing/traced_value.cc:16:1882../../deps/v8/include/v8-profiler.h: In constructor 'v8::HeapProfiler::HeapSnapshotOptions::HeapSnapshotOptions()':1883../../deps/v8/include/v8-profiler.h:1128:27: warning: 'v8::HeapProfiler::HeapSnapshotOptions::global_object_name_resolver' is deprecated: Use context_name_resolver callback instead. [-Wdeprecated-declarations]1884 1128 | HeapSnapshotOptions() {}1885 | ^1886../../deps/v8/include/v8-profiler.h:1142:25: note: declared here1887 1142 | ObjectNameResolver* global_object_name_resolver = nullptr;1888 | ^~~~~~~~~~~~~~~~~~~~~~~~~~~1889../../deps/v8/include/v8-profiler.h:1128:27: warning: 'v8::HeapProfiler::HeapSnapshotOptions::global_object_name_resolver' is deprecated: Use context_name_resolver callback instead. [-Wdeprecated-declarations]1890 1128 | HeapSnapshotOptions() {}1891 | ^1892../../deps/v8/include/v8-profiler.h:1142:25: note: declared here1893 1142 | ObjectNameResolver* global_object_name_resolver = nullptr;1894 | ^~~~~~~~~~~~~~~~~~~~~~~~~~~1895[228/1871] CXX obj/src/node_base.node_modules.o1896In file included from ../../src/memory_tracker.h:6,1897 from ../../src/aliased_buffer.h:7,1898 from ../../src/node_snapshotable.h:7,1899 from ../../src/node_modules.h:7,1900 from ../../src/node_modules.cc:1:1901../../deps/v8/include/v8-profiler.h: In constructor 'v8::HeapProfiler::HeapSnapshotOptions::HeapSnapshotOptions()':1902../../deps/v8/include/v8-profiler.h:1128:27: warning: 'v8::HeapProfiler::HeapSnapshotOptions::global_object_name_resolver' is deprecated: Use context_name_resolver callback instead. [-Wdeprecated-declarations]1903 1128 | HeapSnapshotOptions() {}1904 | ^1905../../deps/v8/include/v8-profiler.h:1142:25: note: declared here1906 1142 | ObjectNameResolver* global_object_name_resolver = nullptr;1907 | ^~~~~~~~~~~~~~~~~~~~~~~~~~~1908../../deps/v8/include/v8-profiler.h:1128:27: warning: 'v8::HeapProfiler::HeapSnapshotOptions::global_object_name_resolver' is deprecated: Use context_name_resolver callback instead. [-Wdeprecated-declarations]1909 1128 | HeapSnapshotOptions() {}1910 | ^1911../../deps/v8/include/v8-profiler.h:1142:25: note: declared here1912 1142 | ObjectNameResolver* global_object_name_resolver = nullptr;1913 | ^~~~~~~~~~~~~~~~~~~~~~~~~~~1914[229/1871] CXX obj/src/tracing/node_base.trace_event_helper.o1915[230/1871] CXX obj/deps/v8/src/torque/torque_base.implementation-visitor.o1916[231/1871] CXX obj/deps/v8/src/torque/torque_base.torque-parser.o1917[232/1871] AR obj/tools/v8_gypfiles/libtorque_base.a1918[233/1871] STAMP obj/tools/v8_gypfiles/torque.actions_depends.stamp1919[234/1871] CXX obj/src/ffi/platforms/node_base.loong64.o1920[235/1871] LINK torque1921[236/1871] CXX obj/src/ffi/platforms/node_base.arm64.o1922[237/1871] CXX obj/src/ffi/platforms/node_base.ppc64.o1923[238/1871] CXX obj/src/node_base.node_symbols.o1924In file included from ../../src/memory_tracker.h:6,1925 from ../../src/aliased_buffer.h:7,1926 from ../../src/aliased_buffer-inl.h:6,1927 from ../../src/env-inl.h:27,1928 from ../../src/node_symbols.cc:1:1929../../deps/v8/include/v8-profiler.h: In constructor 'v8::HeapProfiler::HeapSnapshotOptions::HeapSnapshotOptions()':1930../../deps/v8/include/v8-profiler.h:1128:27: warning: 'v8::HeapProfiler::HeapSnapshotOptions::global_object_name_resolver' is deprecated: Use context_name_resolver callback instead. [-Wdeprecated-declarations]1931 1128 | HeapSnapshotOptions() {}1932 | ^1933../../deps/v8/include/v8-profiler.h:1142:25: note: declared here1934 1142 | ObjectNameResolver* global_object_name_resolver = nullptr;1935 | ^~~~~~~~~~~~~~~~~~~~~~~~~~~1936../../deps/v8/include/v8-profiler.h:1128:27: warning: 'v8::HeapProfiler::HeapSnapshotOptions::global_object_name_resolver' is deprecated: Use context_name_resolver callback instead. [-Wdeprecated-declarations]1937 1128 | HeapSnapshotOptions() {}1938 | ^1939../../deps/v8/include/v8-profiler.h:1142:25: note: declared here1940 1142 | ObjectNameResolver* global_object_name_resolver = nullptr;1941 | ^~~~~~~~~~~~~~~~~~~~~~~~~~~1942[239/1871] CXX obj/src/ffi/node_base.jit_memory.o1943[240/1871] CXX obj/src/ffi/platforms/node_base.riscv64.o1944[241/1871] CXX obj/src/node_base.node_sockaddr.o1945In file included from ../../src/memory_tracker.h:6,1946 from ../../src/base_object.h:29,1947 from ../../src/node_sockaddr.h:6,1948 from ../../src/node_sockaddr.cc:1:1949../../deps/v8/include/v8-profiler.h: In constructor 'v8::HeapProfiler::HeapSnapshotOptions::HeapSnapshotOptions()':1950../../deps/v8/include/v8-profiler.h:1128:27: warning: 'v8::HeapProfiler::HeapSnapshotOptions::global_object_name_resolver' is deprecated: Use context_name_resolver callback instead. [-Wdeprecated-declarations]1951 1128 | HeapSnapshotOptions() {}1952 | ^1953../../deps/v8/include/v8-profiler.h:1142:25: note: declared here1954 1142 | ObjectNameResolver* global_object_name_resolver = nullptr;1955 | ^~~~~~~~~~~~~~~~~~~~~~~~~~~1956../../deps/v8/include/v8-profiler.h:1128:27: warning: 'v8::HeapProfiler::HeapSnapshotOptions::global_object_name_resolver' is deprecated: Use context_name_resolver callback instead. [-Wdeprecated-declarations]1957 1128 | HeapSnapshotOptions() {}1958 | ^1959../../deps/v8/include/v8-profiler.h:1142:25: note: declared here1960 1142 | ObjectNameResolver* global_object_name_resolver = nullptr;1961 | ^~~~~~~~~~~~~~~~~~~~~~~~~~~1962[242/1871] CXX obj/src/permission/node_base.fs_permission.o1963In file included from ../../src/util.h:29,1964 from ../../src/permission/fs_permission.h:9,1965 from ../../src/permission/fs_permission.cc:1:1966../../deps/v8/include/v8-profiler.h: In constructor 'v8::HeapProfiler::HeapSnapshotOptions::HeapSnapshotOptions()':1967../../deps/v8/include/v8-profiler.h:1128:27: warning: 'v8::HeapProfiler::HeapSnapshotOptions::global_object_name_resolver' is deprecated: Use context_name_resolver callback instead. [-Wdeprecated-declarations]1968 1128 | HeapSnapshotOptions() {}1969 | ^1970../../deps/v8/include/v8-profiler.h:1142:25: note: declared here1971 1142 | ObjectNameResolver* global_object_name_resolver = nullptr;1972 | ^~~~~~~~~~~~~~~~~~~~~~~~~~~1973../../deps/v8/include/v8-profiler.h:1128:27: warning: 'v8::HeapProfiler::HeapSnapshotOptions::global_object_name_resolver' is deprecated: Use context_name_resolver callback instead. [-Wdeprecated-declarations]1974 1128 | HeapSnapshotOptions() {}1975 | ^1976../../deps/v8/include/v8-profiler.h:1142:25: note: declared here1977 1142 | ObjectNameResolver* global_object_name_resolver = nullptr;1978 | ^~~~~~~~~~~~~~~~~~~~~~~~~~~1979[243/1871] CXX obj/src/node_base.node_task_queue.o1980In file included from ../../src/memory_tracker.h:6,1981 from ../../src/base_object.h:29,1982 from ../../src/async_wrap.h:27,1983 from ../../src/node_task_queue.cc:1:1984../../deps/v8/include/v8-profiler.h: In constructor 'v8::HeapProfiler::HeapSnapshotOptions::HeapSnapshotOptions()':1985../../deps/v8/include/v8-profiler.h:1128:27: warning: 'v8::HeapProfiler::HeapSnapshotOptions::global_object_name_resolver' is deprecated: Use context_name_resolver callback instead. [-Wdeprecated-declarations]1986 1128 | HeapSnapshotOptions() {}1987 | ^1988../../deps/v8/include/v8-profiler.h:1142:25: note: declared here1989 1142 | ObjectNameResolver* global_object_name_resolver = nullptr;1990 | ^~~~~~~~~~~~~~~~~~~~~~~~~~~1991../../deps/v8/include/v8-profiler.h:1128:27: warning: 'v8::HeapProfiler::HeapSnapshotOptions::global_object_name_resolver' is deprecated: Use context_name_resolver callback instead. [-Wdeprecated-declarations]1992 1128 | HeapSnapshotOptions() {}1993 | ^1994../../deps/v8/include/v8-profiler.h:1142:25: note: declared here1995 1142 | ObjectNameResolver* global_object_name_resolver = nullptr;1996 | ^~~~~~~~~~~~~~~~~~~~~~~~~~~1997[244/1871] CXX obj/src/node_base.pipe_wrap.o1998In file included from ../../src/memory_tracker.h:6,1999 from ../../src/base_object.h:29,2000 from ../../src/async_wrap.h:27,loading 24,277 hidden lines…
26278ok 5022 parallel/test-worker-init-failure26279 ---26280 duration_ms: 2578.7710026281 ...26282ok 5023 parallel/test-zlib-zip-encoding26283 ---26284 duration_ms: 298.5450026285 ...26286ok 5024 parallel/test-zlib-type-error26287 ---26288 duration_ms: 358.5000026289 ...26290ok 5025 parallel/test-zlib-truncated26291 ---26292 duration_ms: 386.9550026293 ...26294ok 5026 parallel/test-zlib-zstd-from-string26295 ---26296 duration_ms: 214.1840026297 ...26298ok 5027 parallel/test-zlib-zstd-flush26299 ---26300 duration_ms: 215.2820026301 ...26302ok 5028 parallel/test-zlib-zstd-kmaxlength-rangeerror26303 ---26304 duration_ms: 199.5300026305 ...26306ok 5029 parallel/test-zlib-zip-edgecases26307 ---26308 duration_ms: 379.5630026309 ...26310ok 5030 parallel/test-zlib-zip26311 ---26312 duration_ms: 390.1910026313 ...26314ok 5031 parallel/test-zlib-zip-sync26315 ---26316 duration_ms: 283.3130026317 ...26318ok 5032 parallel/test-zlib-zip-metadata26319 ---26320 duration_ms: 312.2840026321 ...26322ok 5033 client-proxy/test-http-proxy-request-authority-construction26323 ---26324 duration_ms: 292.1960026325 ...26326ok 5034 parallel/test-zlib-zstd-from-zstd26327 ---26328 duration_ms: 312.7970026329 ...26330ok 5035 parallel/test-zlib-zstd-pledged-src-size26331 ---26332 duration_ms: 324.6400026333 ...26334ok 5036 client-proxy/test-http-proxy-request-invalid-char-in-options26335 ---26336 duration_ms: 281.0860026337 ...26338ok 5037 parallel/test-zlib-zstd-dictionary26339 ---26340 duration_ms: 367.6670026341 ...26342ok 5038 parallel/test-zlib-zip-internals26343 ---26344 duration_ms: 420.2610026345 ...26346ok 5039 client-proxy/test-http-proxy-request-invalid-credentials26347 ---26348 duration_ms: 314.1000026349 ...26350ok 5040 parallel/test-zlib-zip-hardening26351 ---26352 duration_ms: 490.5750026353 ...26354ok 5041 parallel/test-zlib-zip-writable26355 ---26356 duration_ms: 427.5430026357 ...26358ok 5042 parallel/test-zlib-brotli-16GB26359 ---26360 duration_ms: 944.1620026361 ...26362ok 5043 client-proxy/test-http-proxy-request-invalid-proxy26363 ---26364 duration_ms: 346.2950026365 ...26366ok 5044 parallel/test-zlib26367 ---26368 duration_ms: 972.4250026369 ...26370ok 5045 parallel/test-zlib-zip-vfs26371 ---26372 duration_ms: 461.9390026373 ...26374ok 5046 parallel/test-zlib-zip-security-hardening26375 ---26376 duration_ms: 487.9140026377 ...26378ok 5047 client-proxy/test-http-proxy-request-max-sockets26379 ---26380 duration_ms: 371.2670026381 ...26382ok 5048 parallel/test-zlib-zero-windowBits26383 ---26384 duration_ms: 664.7760026385 ...26386ok 5049 parallel/test-zlib-zip-file-lifecycle26387 ---26388 duration_ms: 629.6620026389 ...26390ok 5050 client-proxy/test-http-proxy-request-origin-form-path26391 ---26392 duration_ms: 307.1310026393 ...26394ok 5051 parallel/test-zlib-zip-files26395 ---26396 duration_ms: 635.5200026397 ...26398ok 5052 parallel/test-x509-escaping26399 ---26400 duration_ms: 1095.1850026401 ...26402ok 5053 parallel/test-zlib-zip-interop26403 ---26404 duration_ms: 605.7450026405 ...26406ok 5054 client-proxy/test-http-proxy-request-validation-errors26407 ---26408 duration_ms: 297.7100026409 ...26410ok 5055 client-proxy/test-http-proxy-request-socket-keep-alive26411 ---26412 duration_ms: 381.1600026413 ...26414ok 5056 client-proxy/test-http-proxy-request-absolute-path-authority-match26415 ---26416 duration_ms: 633.9450026417 ...26418ok 5057 parallel/test-zlib-zstd26419 ---26420 duration_ms: 685.1080026421 ...26422ok 5058 parallel/test-zlib-zip-property26423 ---26424 duration_ms: 730.5470026425 ...26426ok 5059 client-proxy/test-http-proxy-request-connection-refused26427 ---26428 duration_ms: 659.8240026429 ...26430ok 5060 client-proxy/test-http-set-global-proxy-from-env-invalid-type26431 ---26432 duration_ms: 251.8060026433 ...26434ok 5061 client-proxy/test-http-set-global-proxy-from-env-invalid-url26435 ---26436 duration_ms: 246.5990026437 ...26438ok 5062 client-proxy/test-http-proxy-request-ipv626439 ---26440 duration_ms: 631.3180026441 ...26442ok 5063 client-proxy/test-http-proxy-perf-hooks26443 ---26444 duration_ms: 710.6510026445 ...26446ok 5064 client-proxy/test-http-set-global-proxy-from-env-http-request-empty26447 ---26448 duration_ms: 390.6320026449 ...26450ok 5065 client-proxy/test-http-proxy-request-proxy-failure-hang-up26451 ---26452 duration_ms: 577.8840026453 ...26454ok 5066 client-proxy/test-http-proxy-request-invalid-char-in-url26455 ---26456 duration_ms: 759.5510026457 ...26458ok 5067 client-proxy/test-https-proxy-request-invalid-char-in-options26459 ---26460 duration_ms: 194.1310026461 ...26462ok 5068 client-proxy/test-http-set-global-proxy-from-env-fetch26463 ---26464 duration_ms: 566.6510026465 ...26466ok 5069 client-proxy/test-https-proxy-request-invalid-credentials26467 ---26468 duration_ms: 201.3690026469 ...26470ok 5070 parallel/test-zlib-zip-experimental-warning26471 ---26472 duration_ms: 1038.6600026473 ...26474ok 5071 client-proxy/test-http-proxy-request-no-proxy-asterisk26475 ---26476 duration_ms: 749.9250026477 ...26478ok 5072 client-proxy/test-http-proxy-request-invalid-url26479 ---26480 duration_ms: 852.3690026481 ...26482ok 5073 client-proxy/test-http-set-global-proxy-from-env-fetch-no-proxy26483 ---26484 duration_ms: 571.4200026485 ...26486ok 5074 client-proxy/test-http-proxy-request-proxy-failure-50026487 ---26488 duration_ms: 718.6740026489 ...26490ok 5075 client-proxy/test-http-set-global-proxy-from-env-http-request-default26491 ---26492 duration_ms: 549.4170026493 ...26494ok 5076 client-proxy/test-http-request-proxy-post-server-failure26495 ---26496 duration_ms: 640.1570026497 ...26498ok 5077 client-proxy/test-http-set-global-proxy-from-env-http-request26499 ---26500 duration_ms: 601.5400026501 ...26502ok 5078 client-proxy/test-http-set-global-proxy-from-env-fetch-empty26503 ---26504 duration_ms: 652.1950026505 ...26506ok 5079 client-proxy/test-http-set-global-proxy-from-env-http-request-restore26507 ---26508 duration_ms: 588.8520026509 ...26510ok 5080 client-proxy/test-https-proxy-request-auth-failure26511 ---26512 duration_ms: 464.8820026513 ...26514ok 5081 client-proxy/test-http-proxy-request-https-proxy26515 ---26516 duration_ms: 956.1370026517 ...26518ok 5082 client-proxy/test-http-proxy-request-no-proxy-port-specific26519 ---26520 duration_ms: 810.9760026521 ...26522ok 5083 client-proxy/test-http-set-global-proxy-from-env-fetch-default26523 ---26524 duration_ms: 694.5800026525 ...26526ok 5084 client-proxy/test-http-proxy-fetch26527 ---26528 duration_ms: 1025.0700026529 ...26530ok 5085 client-proxy/test-http-set-global-proxy-from-env-fetch-restore26531 ---26532 duration_ms: 676.6800026533 ...26534ok 5086 client-proxy/test-https-proxy-request-invalid-char-in-url26535 ---26536 duration_ms: 386.7130026537 ...26538ok 5087 client-proxy/test-http-set-global-proxy-from-env-https-request26539 ---26540 duration_ms: 707.0840026541 ...26542ok 5088 client-proxy/test-http-proxy-request-no-proxy-ip26543 ---26544 duration_ms: 924.1890026545 ...26546ok 5089 client-proxy/test-https-proxy-request-connection-refused26547 ---26548 duration_ms: 588.8320026549 ...26550ok 5090 client-proxy/test-https-proxy-request-empty-response26551 ---26552 duration_ms: 596.6010026553 ...26554ok 5091 parallel/test-zlib-zip-fuzz26555 ---26556 duration_ms: 1269.6950026557 ...26558ok 5092 client-proxy/test-http-proxy-request26559 ---26560 duration_ms: 1147.9250026561 ...26562ok 5093 client-proxy/test-http-set-global-proxy-from-env-no-proxy26563 ---26564 duration_ms: 693.1810026565 ...26566ok 5094 client-proxy/test-http-request-proxy-post26567 ---26568 duration_ms: 918.8390026569 ...26570ok 5095 message/console_assert26571 ---26572 duration_ms: 172.2850026573 ...26574ok 5096 client-proxy/test-https-proxy-request-handshake-failure26575 ---26576 duration_ms: 564.5700026577 ...26578ok 5097 client-proxy/test-http-set-global-proxy-from-env-override-http26579 ---26580 duration_ms: 693.0740026581 ...26582ok 5098 message/assert_throws_stack26583 ---26584 duration_ms: 213.4310026585 ...26586ok 5099 client-proxy/test-http-set-global-proxy-from-env-fetch-https26587 ---26588 duration_ms: 888.3760026589 ...26590ok 5100 message/internal_assert26591 ---26592 duration_ms: 238.1470026593 ...26594ok 5101 client-proxy/test-https-proxy-request-invalid-url26595 ---26596 duration_ms: 555.6720026597 ...26598ok 5102 client-proxy/test-https-proxy-request-max-sockets26599 ---26600 duration_ms: 454.2930026601 ...26602ok 5103 client-proxy/test-https-proxy-request-socket-keep-alive26603 ---26604 duration_ms: 343.0200026605 ...26606ok 5104 client-proxy/test-http-set-global-proxy-from-env-override-fetch26607 ---26608 duration_ms: 781.2720026609 ...26610ok 5105 message/internal_assert_fail26611 ---26612 duration_ms: 273.4870026613 ...26614ok 5106 client-proxy/test-http-proxy-request-no-proxy26615 ---26616 duration_ms: 1140.6130026617 ...26618ok 5107 message/node_run_non_existent26619 ---26620 duration_ms: 248.5540026621 ...26622ok 5108 message/max_tick_depth26623 ---26624 duration_ms: 295.4510026625 ...26626ok 5109 client-proxy/test-https-proxy-request-https-proxy26627 ---26628 duration_ms: 671.0300026629 ...26630ok 5110 sea/test-build-sea-custom-argv0 # skip Running the resultant binary fails with `/home/iojs/node-tmp/.tmp.2379/sea: error while loading shared libraries: libicui18n.so.71: cannot open shared object file: No such file or directory`.26631 ---26632 duration_ms: 197.4490026633 ...26634ok 5111 message/nexttick_throw26635 ---26636 duration_ms: 345.3170026637 ...26638ok 5112 message/util_inspect_error26639 ---26640 duration_ms: 251.3300026641 ...26642ok 5113 message/node_run_list26643 ---26644 duration_ms: 350.5620026645 ...26646ok 5114 message/test-testpy-env-var-via-comment26647 ---26648 duration_ms: 296.0870026649 ...26650ok 5115 client-proxy/test-https-proxy-request-header-overflow26651 ---26652 duration_ms: 770.5390026653 ...26654ok 5116 sea/test-build-sea-elf-segments # skip Running the resultant binary fails with `/home/iojs/node-tmp/.tmp.2379/sea: error while loading shared libraries: libicui18n.so.71: cannot open shared object file: No such file or directory`.26655 ---26656 duration_ms: 248.0390026657 ...26658ok 5117 sea/test-build-sea-executable-field # skip Running the resultant binary fails with `/home/iojs/node-tmp/.tmp.2379/sea: error while loading shared libraries: libicui18n.so.71: cannot open shared object file: No such file or directory`.26659 ---26660 duration_ms: 262.0030026661 ...26662ok 5118 sea/test-build-sea-vfs-incompatible-options # skip Running the resultant binary fails with `/home/iojs/node-tmp/.tmp.2379/sea: error while loading shared libraries: libicui18n.so.71: cannot open shared object file: No such file or directory`.26663 ---26664 duration_ms: 166.5410026665 ...26666ok 5119 sea/test-build-sea-invalid-executable # skip Running the resultant binary fails with `/home/iojs/node-tmp/.tmp.2379/sea: error while loading shared libraries: libicui18n.so.71: cannot open shared object file: No such file or directory`.26667 ---26668 duration_ms: 204.0220026669 ...26670ok 5120 message/util-inspect-error-cause26671 ---26672 duration_ms: 350.1870026673 ...26674ok 5121 sea/test-build-sea-invalid-assets # skip Running the resultant binary fails with `/home/iojs/node-tmp/.tmp.2379/sea: error while loading shared libraries: libicui18n.so.71: cannot open shared object file: No such file or directory`.26675 ---26676 duration_ms: 303.9720026677 ...26678ok 5122 sea/test-build-sea-missing-output # skip Running the resultant binary fails with `/home/iojs/node-tmp/.tmp.2379/sea: error while loading shared libraries: libicui18n.so.71: cannot open shared object file: No such file or directory`.26679 ---26680 duration_ms: 223.0760026681 ...26682ok 5123 sea/test-build-sea-missing-main # skip Running the resultant binary fails with `/home/iojs/node-tmp/.tmp.2379/sea: error while loading shared libraries: libicui18n.so.71: cannot open shared object file: No such file or directory`.26683 ---26684 duration_ms: 225.2530026685 ...26686ok 5124 sea/test-build-sea-already-exists # skip Running the resultant binary fails with `/home/iojs/node-tmp/.tmp.2379/sea: error while loading shared libraries: libicui18n.so.71: cannot open shared object file: No such file or directory`.26687 ---26688 duration_ms: 348.8610026689 ...26690ok 5125 client-proxy/test-https-proxy-request-proxy-failure-40426691 ---26692 duration_ms: 626.1350026693 ...26694ok 5126 client-proxy/test-https-proxy-request-proxy-failure-50226695 ---26696 duration_ms: 606.6620026697 ...26698ok 5127 client-proxy/test-https-proxy-request-malformed-response26699 ---26700 duration_ms: 715.9340026701 ...26702ok 5128 sea/test-build-sea-invalid-exec-argv # skip Running the resultant binary fails with `/home/iojs/node-tmp/.tmp.2379/sea: error while loading shared libraries: libicui18n.so.71: cannot open shared object file: No such file or directory`.26703 ---26704 duration_ms: 307.4390026705 ...26706ok 5129 client-proxy/test-https-proxy-request-no-proxy26707 ---26708 duration_ms: 701.0250026709 ...26710ok 5130 client-proxy/test-https-proxy-request-proxy-failure-hang-up26711 ---26712 duration_ms: 609.7920026713 ...26714ok 5131 sea/test-single-executable-application-asset-keys-empty # skip Running the resultant binary fails with `/home/iojs/node-tmp/.tmp.2379/sea: error while loading shared libraries: libicui18n.so.71: cannot open shared object file: No such file or directory`.26715 ---26716 duration_ms: 229.2460026717 ...26718ok 5132 sea/test-build-sea-config-not-found # skip Running the resultant binary fails with `/home/iojs/node-tmp/.tmp.2379/sea: error while loading shared libraries: libicui18n.so.71: cannot open shared object file: No such file or directory`.26719 ---26720 duration_ms: 367.5190026721 ...26722ok 5133 sea/test-single-executable-application # skip Running the resultant binary fails with `/home/iojs/node-tmp/.tmp.2379/sea: error while loading shared libraries: libicui18n.so.71: cannot open shared object file: No such file or directory`.26723 ---26724 duration_ms: 244.9940026725 ...26726ok 5134 sea/test-build-sea # skip Running the resultant binary fails with `/home/iojs/node-tmp/.tmp.2379/sea: error while loading shared libraries: libicui18n.so.71: cannot open shared object file: No such file or directory`.26727 ---26728 duration_ms: 413.5360026729 ...26730ok 5135 sea/test-build-sea-invalid-boolean-fields # skip Running the resultant binary fails with `/home/iojs/node-tmp/.tmp.2379/sea: error while loading shared libraries: libicui18n.so.71: cannot open shared object file: No such file or directory`.26731 ---26732 duration_ms: 368.7360026733 ...26734ok 5136 sea/test-build-sea-invalid-json # skip Running the resultant binary fails with `/home/iojs/node-tmp/.tmp.2379/sea: error while loading shared libraries: libicui18n.so.71: cannot open shared object file: No such file or directory`.26735 ---26736 duration_ms: 335.7970026737 ...26738ok 5137 sea/test-single-executable-application-asset-keys # skip Running the resultant binary fails with `/home/iojs/node-tmp/.tmp.2379/sea: error while loading shared libraries: libicui18n.so.71: cannot open shared object file: No such file or directory`.26739 ---26740 duration_ms: 304.9650026741 ...26742ok 5138 sea/test-single-executable-application-empty # skip Running the resultant binary fails with `/home/iojs/node-tmp/.tmp.2379/sea: error while loading shared libraries: libicui18n.so.71: cannot open shared object file: No such file or directory`.26743 ---26744 duration_ms: 215.0640026745 ...26746ok 5139 client-proxy/test-https-proxy-request-proxy-failure-50026747 ---26748 duration_ms: 719.2010026749 ...26750ok 5140 parallel/test-zlib-zip-coverage26751 ---26752 duration_ms: 1757.5880026753 ...26754ok 5141 sea/test-single-executable-application-esm # skip Running the resultant binary fails with `/home/iojs/node-tmp/.tmp.2379/sea: error while loading shared libraries: libicui18n.so.71: cannot open shared object file: No such file or directory`.26755 ---26756 duration_ms: 210.1580026757 ...26758ok 5142 sea/test-single-executable-application-esm-code-cache # skip Running the resultant binary fails with `/home/iojs/node-tmp/.tmp.2379/sea: error while loading shared libraries: libicui18n.so.71: cannot open shared object file: No such file or directory`.26759 ---26760 duration_ms: 203.4420026761 ...26762ok 5143 sea/test-single-executable-application-disable-experimental-sea-warning # skip Running the resultant binary fails with `/home/iojs/node-tmp/.tmp.2379/sea: error while loading shared libraries: libicui18n.so.71: cannot open shared object file: No such file or directory`.26763 ---26764 duration_ms: 248.7740026765 ...26766ok 5144 sea/test-single-executable-application-exec-argv-extension-env # skip Running the resultant binary fails with `/home/iojs/node-tmp/.tmp.2379/sea: error while loading shared libraries: libicui18n.so.71: cannot open shared object file: No such file or directory`.26767 ---26768 duration_ms: 193.7860026769 ...26770ok 5145 client-proxy/test-https-proxy-request-server-failure-hang-up26771 ---26772 duration_ms: 715.6130026773 ...26774ok 5146 sea/test-single-executable-application-snapshot-worker # skip Running the resultant binary fails with `/home/iojs/node-tmp/.tmp.2379/sea: error while loading shared libraries: libicui18n.so.71: cannot open shared object file: No such file or directory`.26775 ---26776 duration_ms: 163.4640026777 ...26778ok 5147 parallel/test-zlib-zip-security26779 ---26780 duration_ms: 1714.7570026781 ...26782ok 5148 sea/test-single-executable-application-assets # skip Running the resultant binary fails with `/home/iojs/node-tmp/.tmp.2379/sea: error while loading shared libraries: libicui18n.so.71: cannot open shared object file: No such file or directory`.26783 ---26784 duration_ms: 357.0120026785 ...26786ok 5149 sea/test-single-executable-application-assets-invalid-type26787 ---26788 duration_ms: 352.4620026789 ...26790ok 5150 sea/test-single-executable-application-assets-raw # skip Running the resultant binary fails with `/home/iojs/node-tmp/.tmp.2379/sea: error while loading shared libraries: libicui18n.so.71: cannot open shared object file: No such file or directory`.26791 ---26792 duration_ms: 323.5540026793 ...26794ok 5151 sea/test-single-executable-application-inspect # skip Running the resultant binary fails with `/home/iojs/node-tmp/.tmp.2379/sea: error while loading shared libraries: libicui18n.so.71: cannot open shared object file: No such file or directory`.26795 ---26796 duration_ms: 230.4670026797 ...26798ok 5152 sea/test-single-executable-application-exec-argv-empty # skip Running the resultant binary fails with `/home/iojs/node-tmp/.tmp.2379/sea: error while loading shared libraries: libicui18n.so.71: cannot open shared object file: No such file or directory`.26799 ---26800 duration_ms: 302.2350026801 ...26802ok 5153 sea/test-single-executable-application-vfs-esm # skip Running the resultant binary fails with `/home/iojs/node-tmp/.tmp.2379/sea: error while loading shared libraries: libicui18n.so.71: cannot open shared object file: No such file or directory`.26803 ---26804 duration_ms: 223.5940026805 ...26806ok 5154 sea/test-single-executable-application-exec-argv # skip Running the resultant binary fails with `/home/iojs/node-tmp/.tmp.2379/sea: error while loading shared libraries: libicui18n.so.71: cannot open shared object file: No such file or directory`.26807 ---26808 duration_ms: 312.8030026809 ...26810ok 5155 sea/test-single-executable-application-exec-argv-extension-cli # skip Running the resultant binary fails with `/home/iojs/node-tmp/.tmp.2379/sea: error while loading shared libraries: libicui18n.so.71: cannot open shared object file: No such file or directory`.26811 ---26812 duration_ms: 301.9840026813 ...26814ok 5156 sea/test-single-executable-application-snapshot-and-code-cache # skip Running the resultant binary fails with `/home/iojs/node-tmp/.tmp.2379/sea: error while loading shared libraries: libicui18n.so.71: cannot open shared object file: No such file or directory`.26815 ---26816 duration_ms: 263.8100026817 ...26818ok 5157 sea/test-single-executable-application-snapshot # skip Running the resultant binary fails with `/home/iojs/node-tmp/.tmp.2379/sea: error while loading shared libraries: libicui18n.so.71: cannot open shared object file: No such file or directory`.26819 ---26820 duration_ms: 276.4360026821 ...26822ok 5158 sea/test-single-executable-application-assets-nonexistent-file26823 ---26824 duration_ms: 450.4330026825 ...26826ok 5159 client-proxy/test-https-proxy-fetch26827 ---26828 duration_ms: 1291.7700026829 ...26830ok 5160 client-proxy/test-use-env-proxy-cli-https26831 ---26832 duration_ms: 819.2870026833 ...26834ok 5161 sea/test-single-executable-application-use-code-cache # skip Running the resultant binary fails with `/home/iojs/node-tmp/.tmp.2379/sea: error while loading shared libraries: libicui18n.so.71: cannot open shared object file: No such file or directory`.26835 ---26836 duration_ms: 312.5880026837 ...26838ok 5162 sea/test-single-executable-application-inspect-in-sea-flags # skip Running the resultant binary fails with `/home/iojs/node-tmp/.tmp.2379/sea: error while loading shared libraries: libicui18n.so.71: cannot open shared object file: No such file or directory`.26839 ---26840 duration_ms: 335.8970026841 ...26842ok 5163 sea/test-single-executable-application-vfs # skip Running the resultant binary fails with `/home/iojs/node-tmp/.tmp.2379/sea: error while loading shared libraries: libicui18n.so.71: cannot open shared object file: No such file or directory`.26843 ---26844 duration_ms: 361.8430026845 ...26846ok 5164 client-proxy/test-http-proxy-request-no-proxy-domain26847 ---26848 duration_ms: 1683.0490026849 ...26850ok 5165 test-runner/test-output-arbitrary-output-colored # skip Forced colors not supported in this build26851 ---26852 duration_ms: 396.6350026853 ...26854ok 5166 client-proxy/test-https-request-proxy-post26855 ---26856 duration_ms: 1032.2780026857 ...26858ok 5167 test-runner/test-output-abort-hooks26859 ---26860 duration_ms: 454.6160026861 ...26862ok 5168 sea/test-single-executable-application-exec-argv-extension-none # skip Running the resultant binary fails with `/home/iojs/node-tmp/.tmp.2379/sea: error while loading shared libraries: libicui18n.so.71: cannot open shared object file: No such file or directory`.26863 ---26864 duration_ms: 553.2240026865 ...26866ok 5169 client-proxy/test-https-proxy-request-ipv626867 ---26868 duration_ms: 1288.8060026869 ...26870ok 5170 client-proxy/test-use-env-proxy-cli-http26871 ---26872 duration_ms: 1159.2910026873 ...26874ok 5171 test-runner/test-output-coverage-failure26875 ---26876 duration_ms: 530.9660026877 ...26878ok 5172 test-runner/test-output-before-and-after-each-too-many-listeners26879 ---26880 duration_ms: 640.4990026881 ...26882ok 5173 test-runner/test-output-coverage-width-100-uncovered-lines26883 ---26884 duration_ms: 617.9480026885 ...26886ok 5174 client-proxy/test-https-proxy-request-incomplete-headers26887 ---26888 duration_ms: 1605.1310026889 ...26890ok 5175 test-runner/test-output-coverage-width-80-color26891 ---26892 duration_ms: 616.8840026893 ...26894ok 5176 test-runner/test-output-eval-spec26895 ---26896 duration_ms: 470.8420026897 ...26898ok 5177 test-runner/test-output-eval-tap26899 ---26900 duration_ms: 438.1780026901 ...26902ok 5178 test-runner/test-output-arbitrary-output26903 ---26904 duration_ms: 753.7960026905 ...26906ok 5179 test-runner/test-output-abort-runs-after-hook26907 ---26908 duration_ms: 782.5090026909 ...26910ok 5180 test-runner/test-output-coverage-width-infinity26911 ---26912 duration_ms: 612.6940026913 ...26914ok 5181 test-runner/test-output-before-and-after-each-with-timeout-too-many-listeners26915 ---26916 duration_ms: 732.0250026917 ...26918ok 5182 client-proxy/test-https-proxy-request26919 ---26920 duration_ms: 1836.7400026921 ...26922ok 5183 test-runner/test-output-coverage-short-filename26923 ---26924 duration_ms: 747.0490026925 ...26926ok 5184 test-runner/test-output-coverage-width-15026927 ---26928 duration_ms: 729.8680026929 ...26930ok 5185 test-runner/test-output-coverage-width-80-uncovered-lines-color26931 ---26932 duration_ms: 681.5320026933 ...26934ok 5186 test-runner/test-output-coverage-width-4026935 ---26936 duration_ms: 729.5710026937 ...26938ok 5187 test-runner/test-output-coverage-width-80-uncovered-lines26939 ---26940 duration_ms: 719.1220026941 ...26942ok 5188 test-runner/test-output-coverage-with-mock26943 ---26944 duration_ms: 671.5000026945 ...26946ok 5189 test-runner/test-output-coverage-with-mock-cjs26947 ---26948 duration_ms: 679.7560026949 ...26950ok 5190 test-runner/test-output-coverage-width-infinity-uncovered-lines26951 ---26952 duration_ms: 689.8450026953 ...26954ok 5191 sea/test-single-executable-blob-config26955 ---26956 duration_ms: 913.1340026957 ...26958ok 5192 test-runner/test-output-async-test-scheduling26959 ---26960 duration_ms: 835.5700026961 ...26962ok 5193 test-runner/test-output-describe-nested26963 ---26964 duration_ms: 683.3360026965 ...26966ok 5194 test-runner/test-output-coverage-width-10026967 ---26968 duration_ms: 849.0020026969 ...26970ok 5195 test-runner/test-output-coverage-width-150-uncovered-lines26971 ---26972 duration_ms: 841.7720026973 ...26974ok 5196 test-runner/test-output-global-after-should-fail-the-test26975 ---26976 duration_ms: 487.4750026977 ...26978ok 5197 test-runner/test-output-coverage-width-8026979 ---26980 duration_ms: 825.5890026981 ...26982ok 5198 client-proxy/test-https-proxy-request-tunnel-timeout26983 ---26984 duration_ms: 1566.6430026985 ...26986ok 5199 test-runner/test-output-eval-dot26987 ---26988 duration_ms: 701.4520026989 ...26990ok 5200 test-runner/test-output-assertion-color-tty26991 ---26992 duration_ms: 928.6470026993 ...26994ok 5201 test-runner/test-output-filtered-suite-throws26995 ---26996 duration_ms: 598.5870026997 ...26998ok 5202 test-runner/test-output-default-output26999 ---27000 duration_ms: 888.4070027001 ...27002ok 5203 client-proxy/test-use-env-proxy-precedence27003 ---27004 duration_ms: 1654.6190027005 ...27006ok 5204 client-proxy/test-https-proxy-request-tunnel-timeout-agent27007 ---27008 duration_ms: 1764.2500027009 ...27010ok 5205 test-runner/test-output-dot-output-custom-columns27011 ---27012 duration_ms: 935.0150027013 ...27014ok 5206 test-runner/test-output-filtered-suite-order27015 ---27016 duration_ms: 788.6120027017 ...27018ok 5207 test-runner/test-output-global-hooks-with-no-tests27019 ---27020 duration_ms: 772.8180027021 ...27022ok 5208 test-runner/test-output-non-tty-forced-color-output27023 ---27024 duration_ms: 450.5010027025 ...27026ok 5209 test-runner/test-output-spec-reporter-watch-restart27027 ---27028 duration_ms: 337.6220027029 ...27030ok 5210 test-runner/test-output-hooks-with-no-global-test27031 ---27032 duration_ms: 596.6090027033 ...27034ok 5211 test-runner/test-output-dot-reporter-coverage-threshold27035 ---27036 duration_ms: 1061.8800027037 ...27038ok 5212 test-runner/test-output-force-exit27039 ---27040 duration_ms: 898.3890027041 ...27042ok 5213 test-runner/test-output-hooks27043 ---27044 duration_ms: 811.6540027045 ...27046ok 5214 test-runner/test-output-filtered-suite-delayed-build27047 ---27048 duration_ms: 1059.1360027049 ...27050ok 5215 test-runner/test-output-name-and-skip-patterns27051 ---27052 duration_ms: 661.5120027053 ...27054ok 5216 test-runner/test-output-only-tests27055 ---27056 duration_ms: 618.4830027057 ...27058ok 5217 test-runner/test-output-name-pattern27059 ---27060 duration_ms: 687.4830027061 ...27062ok 5218 test-runner/test-output-skip-each-hooks27063 ---27064 duration_ms: 600.5370027065 ...27066ok 5219 sea/test-single-executable-blob-config-errors27067 ---27068 duration_ms: 1504.0750027069 ...27070ok 5220 test-runner/test-output-describe-it27071 ---27072 duration_ms: 1286.9460027073 ...27074ok 5221 test-runner/test-output-junit-classname-hierarchy27075 ---27076 duration_ms: 813.9230027077 ...27078ok 5222 test-runner/test-output-no-tests27079 ---27080 duration_ms: 733.7270027081 ...27082ok 5223 test-runner/test-output-tap-escape27083 ---27084 duration_ms: 575.8370027085 ...27086ok 5224 test-runner/test-output-abort-suite27087 ---27088 duration_ms: 1580.5410027089 ...27090ok 5225 test-runner/test-output-skip-pattern27091 ---27092 duration_ms: 704.5030027093 ...27094ok 5226 test-runner/test-output-source-mapped-locations27095 ---27096 duration_ms: 706.6610027097 ...27098ok 5227 test-runner/test-output-spec-reporter-successful27099 ---27100 duration_ms: 697.7430027101 ...27102ok 5228 test-runner/test-output-test-runner-plan27103 ---27104 duration_ms: 679.8690027105 ...27106ok 5229 test-runner/test-output-test-diagnostic-warning-without-test-only-flag27107 ---27108 duration_ms: 687.6160027109 ...27110ok 5230 test-runner/test-output-hooks-spec-reporter27111 ---27112 duration_ms: 1072.1300027113 ...27114ok 5231 test-runner/test-output-abort27115 ---27116 duration_ms: 1696.0540027117 ...27118ok 5232 test-runner/test-output-unfinished-suite-async-error27119 ---27120 duration_ms: 489.1630027121 ...27122ok 5233 test-runner/test-output-junit-empty-diagnostic27123 ---27124 duration_ms: 1004.2780027125 ...27126ok 5234 test-runner/test-run-watch-cwd27127 ---27128 duration_ms: 469.2730027129 ...27130ok 5235 test-runner/test-output-name-pattern-with-only27131 ---27132 duration_ms: 992.7350027133 ...27134ok 5236 test-runner/test-output-randomize-nested-scenarios-output-cli-none27135 ---27136 duration_ms: 932.5560027137 ...27138ok 5237 test-runner/test-run-watch-cwd-isolation-none-argv27139 ---27140 duration_ms: 462.2750027141 ...27142ok 5238 test-runner/test-output-randomize-output-cli-none27143 ---27144 duration_ms: 941.4920027145 ...27146ok 5239 test-runner/test-output-suite-skip-hooks27147 ---27148 duration_ms: 860.6320027149 ...27150ok 5240 test-runner/test-output-test-timeout-flag27151 ---27152 duration_ms: 788.4980027153 ...27154ok 5241 test-runner/test-output-randomize-nested-scenarios-output-cli-process27155 ---27156 duration_ms: 1116.8340027157 ...27158ok 5242 test-runner/test-run-watch-no-emit-restarted-disabled27159 ---27160 duration_ms: 456.4250027161 ...27162ok 5243 test-runner/test-run-watch-cwd-isolation-none27163 ---27164 duration_ms: 683.5570027165 ...27166ok 5244 test-runner/test-run-watch-cwd-isolation-process27167 ---27168 duration_ms: 675.5630027169 ...27170ok 5245 test-runner/test-output-test-timeout-flag-with-test27171 ---27172 duration_ms: 882.4530027173 ...27174ok 5246 test-runner/test-output-test-runner-watch-spec27175 ---27176 duration_ms: 971.0330027177 ...27178ok 5247 test-runner/test-output-typescript-coverage27179 ---27180 duration_ms: 895.9270027181 ...27182ok 5248 pseudo-tty/console-dumb-tty27183 ---27184 duration_ms: 377.2430027185 ...27186ok 5249 pseudo-tty/console_colors27187 ---27188 duration_ms: 310.8040027189 ...27190ok 5250 pseudo-tty/no_dropped_stdio27191 ---27192 duration_ms: 233.1630027193 ...27194ok 5251 test-runner/test-output-dot-reporter27195 ---27196 duration_ms: 1942.9540027197 ...27198ok 5252 pseudo-tty/readline-dumb-tty27199 ---27200 duration_ms: 270.1800027201 ...27202ok 5253 test-runner/test-output-output27203 ---27204 duration_ms: 1442.7450027205 ...27206ok 5254 pseudo-tty/no_interleaved_stdio27207 ---27208 duration_ms: 325.6280027209 ...27210ok 5255 pseudo-tty/ref_keeps_node_running27211 ---27212 duration_ms: 289.4570027213 ...27214ok 5256 test-runner/test-output-lcov-reporter27215 ---27216 duration_ms: 1554.7590027217 ...27218ok 5257 pseudo-tty/stdin-setrawmode27219 ---27220 duration_ms: 267.2130027221 ...27222ok 5258 pseudo-tty/test-assert-colors27223 ---27224 duration_ms: 236.0750027225 ...27226ok 5259 test-runner/test-output-junit-reporter27227 ---27228 duration_ms: 1617.9570027229 ...27230ok 5260 pseudo-tty/repl-dumb-tty27231 ---27232 duration_ms: 334.0930027233 ...27234ok 5261 test-runner/test-run-watch-emit-restarted27235 ---27236 duration_ms: 897.5860027237 ...27238ok 5262 pseudo-tty/test-assert-position-indicator27239 ---27240 duration_ms: 221.7000027241 ...27242ok 5263 pseudo-tty/test-assert-no-color27243 ---27244 duration_ms: 233.9250027245 ...27246ok 5264 pseudo-tty/test-async-wrap-getasyncid-tty27247 ---27248 duration_ms: 237.3500027249 ...27250ok 5265 test-runner/test-output-no-refs27251 ---27252 duration_ms: 1670.8420027253 ...27254ok 5266 pseudo-tty/test-fatal-error27255 ---27256 duration_ms: 252.4050027257 ...27258ok 5267 pseudo-tty/test-handle-wrap-hasref-tty27259 ---27260 duration_ms: 255.8220027261 ...27262ok 5268 test-runner/test-output-output-cli27263 ---27264 duration_ms: 1689.6240027265 ...27266ok 5269 pseudo-tty/test-readable-tty-keepalive27267 ---27268 duration_ms: 252.0420027269 ...27270ok 5270 parallel/test-runner-execution-ordered-bypass27271 ---27272 duration_ms: 30719.9530027273 ...27274ok 5271 test-runner/test-output-spec-reporter27275 ---27276 duration_ms: 1744.3220027277 ...27278ok 5272 pseudo-tty/test-stderr-stdout-handle-sigwinch27279 ---27280 duration_ms: 322.3310027281 ...27282ok 5273 pseudo-tty/test-stdin-write27283 ---27284 duration_ms: 344.4020027285 ...27286ok 5274 pseudo-tty/test-set-raw-mode-modes27287 ---27288 duration_ms: 444.1810027289 ...27290ok 5275 test-runner/test-output-spec-reporter-cli27291 ---27292 duration_ms: 1827.1550027293 ...27294ok 5276 pseudo-tty/test-repl-external-module27295 ---27296 duration_ms: 457.5930027297 ...27298ok 5277 pseudo-tty/test-set-raw-mode-reset-process-exit27299 ---27300 duration_ms: 445.8120027301 ...27302ok 5278 pseudo-tty/test-testpy-env-var-via-comment27303 ---27304 duration_ms: 343.5780027305 ...27306ok 5279 pseudo-tty/test-tty-color-support27307 ---27308 duration_ms: 290.8340027309 ...27310ok 5280 pseudo-tty/test-stdout-read27311 ---27312 duration_ms: 412.5170027313 ...27314ok 5281 pseudo-tty/test-tty-color-support-warning27315 ---27316 duration_ms: 340.6180027317 ...27318ok 5282 pseudo-tty/test-tty-color-support-warning-227319 ---27320 duration_ms: 252.0710027321 ...27322ok 5283 pseudo-tty/test-set-raw-mode-reset-signal27323 ---27324 duration_ms: 519.7680027325 ...27326ok 5284 pseudo-tty/test-set-raw-mode-reset27327 ---27328 duration_ms: 572.2490027329 ...27330ok 5285 pseudo-tty/test-stop-trace-sigint27331 ---27332 duration_ms: 478.7920027333 ...27334ok 5286 pseudo-tty/test-tty-isatty27335 ---27336 duration_ms: 261.9510027337 ...27338ok 5287 pseudo-tty/test-tty-stdin-call-end27339 ---27340 duration_ms: 240.8380027341 ...27342ok 5288 test-runner/test-output-timeout-in-before-each27343 ---27344 duration_ms: 1788.1760027345 ...27346ok 5289 pseudo-tty/test-tty-stdin-end27347 ---27348 duration_ms: 288.1360027349 ...27350ok 5290 pseudo-tty/test-trace-sigint-disabled27351 ---27352 duration_ms: 563.8610027353 ...27354ok 5291 pseudo-tty/test-start-trace-sigint27355 ---27356 duration_ms: 663.3120027357 ...27358ok 5292 pseudo-tty/test-tty-wrap27359 ---27360 duration_ms: 255.6540027361 ...27362ok 5293 pseudo-tty/test-trace-sigint27363 ---27364 duration_ms: 596.7920027365 ...27366ok 5294 pseudo-tty/test-tty-stdout-end27367 ---27368 duration_ms: 320.2070027369 ...27370ok 5295 pseudo-tty/test-tty-stream-constructors27371 ---27372 duration_ms: 322.6880027373 ...27374ok 5296 pseudo-tty/test-tty-window-size27375 ---27376 duration_ms: 327.0630027377 ...27378ok 5297 test-runner/test-output-test-runner-plan-timeout27379 ---27380 duration_ms: 2108.3110027381 ...27382ok 5298 pseudo-tty/test-trace-sigint-on-idle27383 ---27384 duration_ms: 679.8820027385 ...27386ok 5299 pseudo-tty/test-tty-stdout-resize27387 ---27388 duration_ms: 466.9450027389 ...27390ok 5300 module-hooks/test-async-loader-hooks-initialize-invoke27391 ---27392 duration_ms: 389.0310027393 ...27394ok 5301 module-hooks/test-async-loader-hooks-called-with-register27395 ---27396 duration_ms: 451.6740027397 ...27398ok 5302 test-runner/test-run-watch-different-cwd-dependency27399 ---27400 duration_ms: 1873.2690027401 ...27402ok 5303 module-hooks/test-async-loader-hooks-globalpreload-no-warning-with-initialize27403 ---27404 duration_ms: 488.6550027405 ...27406ok 5304 module-hooks/test-async-loader-hooks-initialize-in-sequence27407 ---27408 duration_ms: 492.9590027409 ...27410ok 5305 test-runner/test-watch-dependency-isolation-none27411 ---27412 duration_ms: 1707.7640027413 ...27414ok 5306 test-runner/test-watch-dependency-isolation-process27415 ---27416 duration_ms: 1701.7710027417 ...27418ok 5307 module-hooks/test-async-loader-hooks-initialize-rejecting27419 ---27420 duration_ms: 443.2070027421 ...27422ok 5308 test-runner/test-watch-create-isolation-process27423 ---27424 duration_ms: 1796.7780027425 ...27426ok 5309 test-runner/test-run-watch-dependency-repeatedly27427 ---27428 duration_ms: 1996.3430027429 ...27430ok 5310 module-hooks/test-async-loader-hooks-initialize-process-exit27431 ---27432 duration_ms: 480.1680027433 ...27434ok 5311 module-hooks/test-async-loader-hooks-mixed-opt-in27435 ---27436 duration_ms: 387.6640027437 ...27438ok 5312 test-runner/test-watch-no-file-isolation-process27439 ---27440 duration_ms: 1683.2900027441 ...27442ok 5313 test-runner/test-run-watch-different-cwd-rename27443 ---27444 duration_ms: 2004.3960027445 ...27446ok 5314 test-runner/test-watch-no-file-isolation-none27447 ---27448 duration_ms: 1700.6640027449 ...27450ok 5315 test-runner/test-run-watch-create27451 ---27452 duration_ms: 2183.3590027453 ...27454ok 5316 test-runner/test-watch-rename-isolation-none27455 ---27456 duration_ms: 1682.2610027457 ...27458ok 5317 module-hooks/test-async-loader-hooks-never-settling-race-cjs27459 ---27460 duration_ms: 376.0410027461 ...27462ok 5318 module-hooks/test-async-loader-hooks-never-settling-load-esm-no-warning27463 ---27464 duration_ms: 404.0780027465 ...27466ok 5319 test-runner/test-output-randomize-output-cli27467 ---27468 duration_ms: 2585.4270027469 ...27470ok 5320 module-hooks/test-async-loader-hooks-initialize-throw-null27471 ---27472 duration_ms: 479.9290027473 ...27474ok 5321 test-runner/test-watch-esm-dependency-isolation-process27475 ---27476 duration_ms: 1721.0820027477 ...27478ok 5322 test-runner/test-run-watch-different-runner-cwd27479 ---27480 duration_ms: 1998.3830027481 ...27482ok 5323 module-hooks/test-async-loader-hooks-initialize-never-settling27483 ---27484 duration_ms: 547.4570027485 ...27486ok 5324 test-runner/test-watch-esm-dependency-isolation-none27487 ---27488 duration_ms: 1810.8480027489 ...27490ok 5325 module-hooks/test-async-loader-hooks-never-settling-import-meta-resolve27491 ---27492 duration_ms: 461.7680027493 ...27494ok 5326 test-runner/test-watch-run-repeatedly-isolation-none27495 ---27496 duration_ms: 1716.6790027497 ...27498ok 5327 module-hooks/test-async-loader-hooks-never-settling-resolve-esm-no-warning27499 ---27500 duration_ms: 359.8670027501 ...27502ok 5328 test-runner/test-watch-rename-isolation-process27503 ---27504 duration_ms: 1744.8320027505 ...27506ok 5329 module-hooks/test-async-loader-hooks-never-settling-load-esm-with-warning27507 ---27508 duration_ms: 485.5960027509 ...27510ok 5330 test-runner/test-watch-run-repeatedly-isolation-process27511 ---27512 duration_ms: 1726.7900027513 ...27514ok 5331 test-runner/test-run-watch-rename27515 ---27516 duration_ms: 2015.3210027517 ...27518ok 5332 module-hooks/test-async-loader-hooks-globalpreload-warning27519 ---27520 duration_ms: 689.1550027521 ...27522ok 5333 module-hooks/test-async-loader-hooks-never-settling-resolve-esm-with-warning27523 ---27524 duration_ms: 384.7740027525 ...27526ok 5334 test-runner/test-run-watch-esm-dependency27527 ---27528 duration_ms: 2100.0710027529 ...27530ok 5335 module-hooks/test-async-loader-hooks-never-settling-resolve-cjs27531 ---27532 duration_ms: 493.6920027533 ...27534ok 5336 module-hooks/test-async-loader-hooks-never-settling-race-esm27535 ---27536 duration_ms: 514.5640027537 ...27538ok 5337 module-hooks/test-async-loader-hooks-called-with-expected-args27539 ---27540 duration_ms: 806.1940027541 ...27542ok 5338 test-runner/test-run-watch-run-duration27543 ---27544 duration_ms: 2060.8470027545 ...27546ok 5339 module-hooks/test-async-loader-hooks-never-settling-load-cjs27547 ---27548 duration_ms: 619.4600027549 ...27550ok 5340 test-runner/test-run-watch-without-file27551 ---27552 duration_ms: 2066.6830027553 ...27554ok 5341 test-runner/test-run-watch-repeatedly27555 ---27556 duration_ms: 2131.6530027557 ...27558ok 5342 test-runner/test-run-watch-different-runner-cwd-isolation-process27559 ---27560 duration_ms: 2193.7190027561 ...27562ok 5343 module-hooks/test-module-hooks-create-require-with-url27563 ---27564 duration_ms: 205.4380027565 ...27566ok 5344 module-hooks/test-module-hooks-custom-conditions27567 ---27568 duration_ms: 203.0440027569 ...27570ok 5345 module-hooks/test-async-loader-hooks-register-with-cjs27571 ---27572 duration_ms: 390.8990027573 ...27574ok 5346 module-hooks/test-module-hooks-dispose27575 ---27576 duration_ms: 193.5090027577 ...27578ok 5347 module-hooks/test-async-loader-hooks-process-exit-async27579 ---27580 duration_ms: 483.6640027581 ...27582ok 5348 module-hooks/test-async-loader-hooks-process-exit-top-level27583 ---27584 duration_ms: 467.3420027585 ...27586ok 5349 module-hooks/test-async-loader-hooks-register-with-require27587 ---27588 duration_ms: 402.5620027589 ...27590ok 5350 module-hooks/test-module-hooks-builtin-require27591 ---27592 duration_ms: 273.5920027593 ...27594ok 5351 module-hooks/test-module-hooks-load-buffers27595 ---27596 duration_ms: 187.4610027597 ...27598ok 5352 module-hooks/test-async-loader-hooks-require-resolve-opt-in27599 ---27600 duration_ms: 404.9970027601 ...27602ok 5353 module-hooks/test-async-loader-hooks-register-with-url-parenturl27603 ---27604 duration_ms: 418.7380027605 ...27606ok 5354 module-hooks/test-async-loader-hooks-no-leak-internals27607 ---27608 duration_ms: 577.3270027609 ...27610ok 5355 module-hooks/test-module-hooks-custom-conditions-cjs27611 ---27612 duration_ms: 272.8120027613 ...27614ok 5356 module-hooks/test-async-loader-hooks-process-exit-sync27615 ---27616 duration_ms: 524.8520027617 ...27618ok 5357 module-hooks/test-module-hooks-import-wasm27619 ---27620 duration_ms: 259.7620027621 ...27622ok 5358 module-hooks/test-module-hooks-load-builtin-override-module27623 ---27624 duration_ms: 192.6230027625 ...27626ok 5359 module-hooks/test-module-hooks-load-builtin-import27627 ---27628 duration_ms: 260.1370027629 ...27630ok 5360 module-hooks/test-module-hooks-custom-conditions-special-values27631 ---27632 duration_ms: 326.7390027633 ...27634ok 5361 module-hooks/test-module-hooks-load-builtin-require27635 ---27636 duration_ms: 218.7420027637 ...27638ok 5362 module-hooks/test-module-hooks-load-builtin-override-json27639 ---27640 duration_ms: 253.7290027641 ...27642ok 5363 module-hooks/test-async-loader-hooks-throw-bigint27643 ---27644 duration_ms: 448.0570027645 ...27646ok 5364 module-hooks/test-async-loader-hooks-source-maps-cjs27647 ---27648 duration_ms: 488.0100027649 ...27650ok 5365 module-hooks/test-module-hooks-load-context-merged27651 ---27652 duration_ms: 222.6890027653 ...27654ok 5366 module-hooks/test-async-loader-hooks-register-with-ports27655 ---27656 duration_ms: 522.3510027657 ...27658ok 5367 module-hooks/test-module-hooks-load-builtin-override-commonjs27659 ---27660 duration_ms: 280.4840027661 ...27662ok 5368 module-hooks/test-async-loader-hooks-throw-string27663 ---27664 duration_ms: 443.7330027665 ...27666ok 5369 module-hooks/test-module-hooks-load-chained27667 ---27668 duration_ms: 237.0590027669 ...27670ok 5370 module-hooks/test-async-loader-hooks-register-with-import27671 ---27672 duration_ms: 540.2330027673 ...27674ok 5371 module-hooks/test-async-loader-hooks-throw-error27675 ---27676 duration_ms: 463.8100027677 ...27678ok 5372 module-hooks/test-module-hooks-load-context-merged-esm27679 ---27680 duration_ms: 189.7980027681 ...27682ok 5373 module-hooks/test-async-loader-hooks-throw-object27683 ---27684 duration_ms: 479.4820027685 ...27686ok 5374 module-hooks/test-async-loader-hooks-throw-symbol27687 ---27688 duration_ms: 450.3180027689 ...27690ok 5375 module-hooks/test-module-hooks-load-detection27691 ---27692 duration_ms: 185.8070027693 ...27694ok 5376 module-hooks/test-async-loader-hooks-without-worker-permission27695 ---27696 duration_ms: 452.5250027697 ...27698ok 5377 module-hooks/test-module-hooks-load-import-cjs27699 ---27700 duration_ms: 184.6950027701 ...27702ok 5378 module-hooks/test-async-loader-hooks-with-worker-permission-restricted27703 ---27704 duration_ms: 456.6470027705 ...27706ok 5379 module-hooks/test-module-hooks-load-esm-mock27707 ---27708 duration_ms: 209.6180027709 ...27710ok 5380 module-hooks/test-module-hooks-load-esm27711 ---27712 duration_ms: 211.1280027713 ...27714ok 5381 module-hooks/test-async-loader-hooks-throw-undefined27715 ---27716 duration_ms: 486.2450027717 ...27718ok 5382 module-hooks/test-async-loader-hooks-require-resolve-default27719 ---27720 duration_ms: 584.0630027721 ...27722ok 5383 module-hooks/test-async-loader-hooks-throw-null27723 ---27724 duration_ms: 522.1480027725 ...27726ok 5384 module-hooks/test-module-hooks-load-short-circuit27727 ---27728 duration_ms: 176.2100027729 ...27730ok 5385 module-hooks/test-async-loader-hooks-throw-number27731 ---27732 duration_ms: 525.9090027733 ...27734ok 5386 module-hooks/test-async-loader-hooks-remove-beforeexit-listener27735 ---27736 duration_ms: 591.7960027737 ...27738ok 5387 module-hooks/test-module-hooks-load-url-change-import27739 ---27740 duration_ms: 176.3410027741 ...27742ok 5388 module-hooks/test-module-hooks-load-import-cjs-custom-source27743 ---27744 duration_ms: 217.6270027745 ...27746ok 5389 module-hooks/test-async-loader-hooks-throw-boolean27747 ---27748 duration_ms: 557.2630027749 ...27750ok 5390 module-hooks/test-module-hooks-load-context-optional27751 ---27752 duration_ms: 279.9430027753 ...27754ok 5391 module-hooks/test-async-loader-hooks-throw-function27755 ---27756 duration_ms: 562.6280027757 ...27758ok 5392 module-hooks/test-module-hooks-load-url-change-require27759 ---27760 duration_ms: 190.7050027761 ...27762ok 5393 module-hooks/test-module-hooks-load-mock27763 ---27764 duration_ms: 223.4490027765 ...27766ok 5394 module-hooks/test-module-hooks-require-wasm27767 ---27768 duration_ms: 175.8580027769 ...27770ok 5395 module-hooks/test-async-loader-hooks-throw-empty-object27771 ---27772 duration_ms: 596.6030027773 ...27774ok 5396 module-hooks/test-module-hooks-load-invalid27775 ---27776 duration_ms: 234.8320027777 ...27778ok 5397 module-hooks/test-module-hooks-load-context-optional-esm27779 ---27780 duration_ms: 309.5800027781 ...27782ok 5398 module-hooks/test-module-hooks-load-short-circuit-required-middle27783 ---27784 duration_ms: 258.0130027785 ...27786ok 5399 module-hooks/test-module-hooks-resolve-builtin-on-disk-import27787 ---27788 duration_ms: 194.3750027789 ...27790ok 5400 module-hooks/test-module-hooks-resolve-context-merged-esm27791 ---27792 duration_ms: 193.5490027793 ...27794ok 5401 module-hooks/test-module-hooks-resolve-builtin-builtin-require27795 ---27796 duration_ms: 213.6520027797 ...27798ok 5402 module-hooks/test-module-hooks-resolve-builtin-on-disk-require-with-prefix27799 ---27800 duration_ms: 210.2490027801 ...27802ok 5403 module-hooks/test-module-hooks-resolve-invalid27803 ---27804 duration_ms: 186.0830027805 ...27806ok 5404 module-hooks/test-module-hooks-load-short-circuit-required-start27807 ---27808 duration_ms: 294.2060027809 ...27810ok 5405 module-hooks/test-async-loader-hooks-use-hooks-require-esm27811 ---27812 duration_ms: 640.8770027813 ...27814ok 5406 module-hooks/test-module-hooks-resolve-builtin-builtin-import27815 ---27816 duration_ms: 238.6830027817 ...27818ok 5407 module-hooks/test-module-hooks-resolve-load-builtin-override-both-prefix27819 ---27820 duration_ms: 205.8930027821 ...27822ok 5408 module-hooks/test-module-hooks-resolve-load-builtin-override-both27823 ---27824 duration_ms: 216.8250027825 ...27826ok 5409 module-hooks/test-module-hooks-resolve-context-optional-esm27827 ---27828 duration_ms: 240.5090027829 ...27830ok 5410 module-hooks/test-module-hooks-resolve-context-optional27831 ---27832 duration_ms: 252.8220027833 ...27834ok 5411 module-hooks/test-module-hooks-resolve-builtin-on-disk-require27835 ---27836 duration_ms: 271.4030027837 ...27838ok 5412 module-hooks/test-module-hooks-resolve-import-cjs27839 ---27840 duration_ms: 258.1340027841 ...27842ok 5413 module-hooks/test-module-hooks-resolve-load-builtin-redirect-prefix27843 ---27844 duration_ms: 223.0540027845 ...27846ok 5414 module-hooks/test-async-loader-hooks-with-worker-permission-allowed27847 ---27848 duration_ms: 673.5730027849 ...27850ok 5415 module-hooks/test-module-hooks-resolve-require-resolve-create-require27851 ---27852 duration_ms: 183.0890027853 ...27854ok 5416 module-hooks/test-module-hooks-resolve-load-builtin-redirect27855 ---27856 duration_ms: 241.9460027857 ...27858ok 5417 module-hooks/test-module-hooks-resolve-require-resolve-consistency27859 ---27860 duration_ms: 215.0330027861 ...27862ok 5418 module-hooks/test-module-hooks-resolve-require-resolve-fallthrough27863 ---27864 duration_ms: 198.0260027865 ...27866ok 5419 module-hooks/test-module-hooks-resolve-require-resolve-builtin27867 ---27868 duration_ms: 227.0800027869 ...27870ok 5420 module-hooks/test-module-hooks-resolve-require-resolve-paths27871 ---27872 duration_ms: 194.5650027873 ...27874ok 5421 async-hooks/test-async-await27875 ---27876 duration_ms: 196.5400027877 ...27878ok 5422 module-hooks/test-module-hooks-resolve-context-merged27879 ---27880 duration_ms: 282.4980027881 ...27882ok 5423 async-hooks/test-async-local-storage-dgram27883 ---27884 duration_ms: 143.8120027885 ...27886ok 5424 async-hooks/test-async-local-storage-args27887 ---27888 duration_ms: 183.5290027889 ...27890ok 5425 module-hooks/test-module-hooks-resolve-short-circuit-required-start27891 ---27892 duration_ms: 211.4980027893 ...27894ok 5426 module-hooks/test-module-hooks-resolve-require-resolve-redirect27895 ---27896 duration_ms: 225.6750027897 ...27898ok 5427 async-hooks/test-async-local-storage-enable-disable27899 ---27900 duration_ms: 156.3420027901 ...27902ok 5428 async-hooks/test-async-local-storage-async-functions27903 ---27904 duration_ms: 193.3080027905 ...27906ok 5429 test-runner/test-run-watch-delete27907 ---27908 duration_ms: 2876.6780027909 ...27910ok 5430 module-hooks/test-module-hooks-resolve-short-circuit-required-middle27911 ---27912 duration_ms: 235.2610027913 ...27914ok 5431 module-hooks/test-module-hooks-resolve-short-circuit27915 ---27916 duration_ms: 242.7150027917 ...27918ok 5432 async-hooks/test-async-exec-resource-match27919 ---27920 duration_ms: 229.2230027921 ...27922ok 5433 async-hooks/test-async-local-storage-enter-with27923 ---27924 duration_ms: 192.2710027925 ...27926ok 5434 module-hooks/test-module-hooks-resolve-require-resolve-loaded-with-source27927 ---27928 duration_ms: 277.4910027929 ...27930ok 5435 async-hooks/test-async-local-storage-errors27931 ---27932 duration_ms: 200.2440027933 ...27934ok 5436 async-hooks/test-async-local-storage-gcable27935 ---27936 duration_ms: 206.8880027937 ...27938ok 5437 test-runner/test-watch-delete-isolation-none27939 ---27940 duration_ms: 2687.4190027941 ...27942ok 5438 async-hooks/test-async-local-storage-async-await27943 ---27944 duration_ms: 259.6790027945 ...27946ok 5439 async-hooks/test-async-local-storage-promises27947 ---27948 duration_ms: 177.0290027949 ...27950ok 5440 async-hooks/test-async-local-storage-misc-stores27951 ---27952 duration_ms: 201.8120027953 ...27954ok 5441 test-runner/test-watch-delete-isolation-process27955 ---27956 duration_ms: 2692.4230027957 ...27958ok 5442 async-hooks/test-crypto-pbkdf227959 ---27960 duration_ms: 172.5030027961 ...27962ok 5443 async-hooks/test-async-local-storage-stream-finished27963 ---27964 duration_ms: 199.8580027965 ...27966ok 5444 async-hooks/test-async-exec-resource-http-agent27967 ---27968 duration_ms: 320.6200027969 ...27970ok 5445 async-hooks/test-async-local-storage-nested27971 ---27972 duration_ms: 233.6610027973 ...27974ok 5446 async-hooks/test-embedder.api.async-resource.runInAsyncScope27975 ---27976 duration_ms: 147.8780027977 ...27978ok 5447 async-hooks/test-async-exec-resource-http27979 ---27980 duration_ms: 343.5060027981 ...27982ok 5448 async-hooks/test-disable-in-init27983 ---27984 duration_ms: 182.6920027985 ...27986ok 5449 async-hooks/test-async-local-storage-http-agent27987 ---27988 duration_ms: 270.6900027989 ...27990ok 5450 async-hooks/test-async-local-storage-thenable27991 ---27992 duration_ms: 248.5880027993 ...27994ok 5451 async-hooks/test-async-local-storage-tlssocket27995 ---27996 duration_ms: 256.0880027997 ...27998ok 5452 async-hooks/test-async-local-storage-http27999 ---28000 duration_ms: 308.4320028001 ...28002ok 5453 async-hooks/test-async-local-storage-socket28003 ---28004 duration_ms: 271.4740028005 ...28006ok 5454 async-hooks/test-enable-disable28007 ---28008 duration_ms: 174.3210028009 ...28010ok 5455 async-hooks/test-embedder.api.async-resource28011 ---28012 duration_ms: 218.9250028013 ...28014ok 5456 module-hooks/test-module-hooks-resolve-require-resolve-imported-cjs28015 ---28016 duration_ms: 438.2310028017 ...28018ok 5457 async-hooks/test-async-wrap-providers28019 ---28020 duration_ms: 265.0140028021 ...28022ok 5458 async-hooks/test-emit-before-after28023 ---28024 duration_ms: 219.3160028025 ...28026ok 5459 async-hooks/test-crypto-randomBytes28027 ---28028 duration_ms: 282.6050028029 ...28030ok 5460 async-hooks/test-graph.intervals28031 ---28032 duration_ms: 176.9980028033 ...28034ok 5461 async-hooks/test-fsreqcallback-access28035 ---28036 duration_ms: 238.2110028037 ...28038ok 5462 async-hooks/test-destroy-not-blocked28039 ---28040 duration_ms: 307.9140028041 ...28042ok 5463 async-hooks/test-graph.statwatcher28043 ---28044 duration_ms: 184.1090028045 ...28046ok 5464 async-hooks/test-graph.tcp28047 ---28048 duration_ms: 191.1840028049 ...28050ok 5465 async-hooks/test-graph.fsreq-readFile28051 ---28052 duration_ms: 261.2900028053 ...28054ok 5466 async-hooks/test-getnameinforeqwrap28055 ---28056 duration_ms: 273.3690028057 ...28058ok 5467 async-hooks/test-graph.timeouts28059 ---28060 duration_ms: 208.4190028061 ...28062ok 5468 async-hooks/test-graph.http28063 ---28064 duration_ms: 263.1230028065 ...28066ok 5469 async-hooks/test-enable-in-init28067 ---28068 duration_ms: 332.6960028069 ...28070ok 5470 async-hooks/test-graph.pipeconnect28071 ---28072 duration_ms: 279.3590028073 ...28074ok 5471 module-hooks/test-module-hooks-resolve-load-require-inline-typescript-override28075 ---28076 duration_ms: 617.8250028077 ...28078ok 5472 async-hooks/test-net-get-connections28079 ---28080 duration_ms: 158.6910028081 ...28082ok 5473 module-hooks/test-module-hooks-require-esm28083 ---28084 duration_ms: 744.2410028085 ...28086ok 5474 async-hooks/test-fsreqcallback-readFile28087 ---28088 duration_ms: 335.5180028089 ...28090ok 5475 async-hooks/test-fseventwrap28091 ---28092 duration_ms: 365.6640028093 ...28094ok 5476 module-hooks/test-module-hooks-resolve-load-import-inline-typescript28095 ---28096 duration_ms: 672.3850028097 ...28098ok 5477 async-hooks/test-graph.tls-write28099 ---28100 duration_ms: 256.6710028101 ...28102ok 5478 async-hooks/test-emit-init28103 ---28104 duration_ms: 387.3020028105 ...28106ok 5479 async-hooks/test-filehandle-no-reuse28107 ---28108 duration_ms: 385.9460028109 ...28110ok 5480 async-hooks/test-embedder.api.async-resource-no-type28111 ---28112 duration_ms: 434.3660028113 ...28114ok 5481 async-hooks/test-immediate28115 ---28116 duration_ms: 234.9400028117 ...28118ok 5482 async-hooks/test-nexttick-default-trigger28119 ---28120 duration_ms: 212.4540028121 ...28122ok 5483 async-hooks/test-late-hook-enable28123 ---28124 duration_ms: 227.8570028125 ...28126ok 5484 async-hooks/test-no-assert-when-disabled28127 ---28128 duration_ms: 228.7690028129 ...28130ok 5485 async-hooks/test-graph.pipe28131 ---28132 duration_ms: 340.3000028133 ...28134ok 5486 async-hooks/test-graph.tls-write-1228135 ---28136 duration_ms: 302.7970028137 ...28138ok 5487 async-hooks/test-httpparser.request28139 ---28140 duration_ms: 269.6140028141 ...28142ok 5488 async-hooks/test-graph.signal28143 ---28144 duration_ms: 337.7050028145 ...28146ok 5489 async-hooks/test-httpparser.response28147 ---28148 duration_ms: 267.6460028149 ...28150ok 5490 async-hooks/test-promise28151 ---28152 duration_ms: 183.6780028153 ...28154ok 5491 async-hooks/test-promise.chain-promise-before-init-hooks28155 ---28156 duration_ms: 185.8480028157 ...28158ok 5492 async-hooks/test-getaddrinforeqwrap28159 ---28160 duration_ms: 408.6270028161 ...28162ok 5493 async-hooks/test-queue-microtask28163 ---28164 duration_ms: 167.0690028165 ...28166ok 5494 module-hooks/test-module-hooks-resolve-load-require-inline-typescript28167 ---28168 duration_ms: 788.9410028169 ...28170ok 5495 async-hooks/test-graph.shutdown28171 ---28172 duration_ms: 429.4670028173 ...28174ok 5496 async-hooks/test-emit-after-on-destroyed28175 ---28176 duration_ms: 543.9130028177 ...28178ok 5497 async-hooks/test-async-local-storage-no-mix-contexts28179 ---28180 duration_ms: 637.0790028181 ...28182ok 5498 async-hooks/test-http-agent-handle-reuse-serial28183 ---28184 duration_ms: 399.3370028185 ...28186ok 5499 async-hooks/test-track-promises-false28187 ---28188 duration_ms: 186.4630028189 ...28190ok 5500 async-hooks/test-track-promises-default28191 ---28192 duration_ms: 201.5370028193 ...28194ok 5501 async-hooks/test-promise.promise-before-init-hooks28195 ---28196 duration_ms: 263.2800028197 ...28198ok 5502 module-hooks/test-module-hooks-resolve-load-import-inline-typescript-override28199 ---28200 duration_ms: 871.7510028201 ...28202ok 5503 async-hooks/test-emit-before-on-destroyed28203 ---28204 duration_ms: 588.9610028205 ...28206ok 5504 async-hooks/test-http-agent-handle-reuse-parallel28207 ---28208 duration_ms: 456.6000028209 ...28210ok 5505 async-hooks/test-ttywrap.readstream # skip no valid readable TTY available28211 ---28212 duration_ms: 216.7900028213 ...28214ok 5506 async-hooks/test-unhandled-exception-valid-ids28215 ---28216 duration_ms: 197.3170028217 ...28218ok 5507 async-hooks/test-zlib.zlib-binding.deflate28219 ---28220 duration_ms: 192.3910028221 ...28222ok 5508 async-hooks/test-pipeconnectwrap28223 ---28224 duration_ms: 394.0510028225 ...28226ok 5509 async-hooks/test-track-promises-true28227 ---28228 duration_ms: 257.0440028229 ...28230ok 5510 async-hooks/test-track-promises-false-check28231 ---28232 duration_ms: 263.0610028233 ...28234ok 5511 async-hooks/test-unhandled-rejection-context28235 ---28236 duration_ms: 225.3240028237 ...28238ok 5512 async-hooks/test-track-promises-validation28239 ---28240 duration_ms: 255.5340028241 ...28242ok 5513 async-hooks/test-tcpwrap28243 ---28244 duration_ms: 301.4930028245 ...28246ok 5514 async-hooks/test-udpsendwrap28247 ---28248 duration_ms: 251.8630028249 ...28250ok 5515 async-hooks/test-udpwrap28251 ---28252 duration_ms: 232.0250028253 ...28254ok 5516 async-hooks/test-signalwrap28255 ---28256 duration_ms: 352.7070028257 ...28258ok 5517 async-hooks/test-writewrap28259 ---28260 duration_ms: 275.4640028261 ...28262ok 5518 async-hooks/test-improper-unwind28263 ---28264 duration_ms: 508.2440028265 ...28266ok 5519 async-hooks/test-improper-order28267 ---28268 duration_ms: 527.7250028269 ...28270ok 5520 async-hooks/test-pipewrap28271 ---28272 duration_ms: 524.9540028273 ...28274ok 5521 async-hooks/test-httpparser-reuse28275 ---28276 duration_ms: 621.9990028277 ...28278ok 5522 async-hooks/test-shutdownwrap28279 ---28280 duration_ms: 471.7310028281 ...28282ok 5523 async-hooks/test-statwatcher28283 ---28284 duration_ms: 542.9510028285 ...28286ok 5524 async-hooks/test-timers.setInterval28287 ---28288 duration_ms: 528.6140028289 ...28290ok 5525 async-hooks/test-timers.setTimeout28291 ---28292 duration_ms: 531.9150028293 ...28294ok 5526 module-hooks/test-module-hooks-load-async-and-sync28295 ---28296 duration_ms: 1586.2830028297 ...28298ok 5527 async-hooks/test-callback-error28299 ---28300 duration_ms: 1182.3750028301 ...28302ok 5528 async-hooks/test-querywrap28303 ---28304 duration_ms: 829.8960028305 ...28306ok 5529 parallel/test-zlib-zip-zip6428307 ---28308 duration_ms: 6992.4470028309 ...28310ok 5530 async-hooks/test-async-exec-resource-http-3206028311 ---28312 duration_ms: 1367.5700028313 ...28314ok 5531 async-hooks/test-tlswrap28315 ---28316 duration_ms: 827.3060028317 ...28318ok 5532 pummel/test-array-hash-collision28319 ---28320 duration_ms: 758.1010028321 ...28322ok 5533 module-hooks/test-module-hooks-preload28323 ---28324 duration_ms: 2267.4330028325 ...28326ok 5534 pummel/test-blob-slice-with-large-size28327 ---28328 duration_ms: 2532.2970028329 ...28330ok 5535 pummel/test-buffer-large-size-buffer-alloc28331 ---28332 duration_ms: 2420.5730028333 ...28334ok 5536 pummel/test-buffer-large-size-buffer-alloc-unsafe28335 ---28336 duration_ms: 2216.4260028337 ...28338ok 5537 pummel/test-buffer-large-size-buffer-alloc-unsafe-slow28339 ---28340 duration_ms: 2108.6020028341 ...28342ok 5538 pummel/test-buffer-large-size-buffer-write28343 ---28344 duration_ms: 134.8560028345 ...28346ok 5539 pummel/test-buffer-large-size-copy28347 ---28348 duration_ms: 3210.4510028349 ...28350ok 5540 pummel/test-buffer-large-size-slowbuffer28351 ---28352 duration_ms: 1909.7580028353 ...28354ok 5541 pummel/test-child-process-spawn-loop28355 ---28356 duration_ms: 1108.2450028357 ...28358ok 5542 pummel/test-crypto-argon2-nonblocking-constructor28359 ---28360 duration_ms: 2009.2090028361 ...28362ok 5543 pummel/test-crypto-dh-hash28363 ---28364 duration_ms: 209.9310028365 ...28366ok 5544 pummel/test-crypto-dh-keys28367 ---28368 duration_ms: 327.2480028369 ...28370ok 5545 pummel/test-crypto-pqc-sign-verify-slh-dsa28371 ---28372 duration_ms: 12222.9410028373 ...28374ok 5546 pummel/test-dh-regr28375 ---28376 duration_ms: 22538.2960028377 ...28378ok 5547 pummel/test-fs-largefile28379 ---28380 duration_ms: 135.6180028381 ...28382ok 5548 pummel/test-fs-read-file-sync-utf8-memory28383 ---28384 duration_ms: 407.8880028385 ...28386ok 5549 pummel/test-fs-readfile-tostring-fail28387 ---28388 duration_ms: 1108.7920028389 ...28390ok 5550 pummel/test-heap-profile-and-snapshot-near-heap-limit28391 ---28392 duration_ms: 1209.7210028393 ...28394ok 5551 pummel/test-heap-profile-near-heap-limit28395 ---28396 duration_ms: 1109.1810028397 ...28398ok 5552 pummel/test-heapdump-dns28399 ---28400 duration_ms: 2611.2310028401 ...28402ok 5553 pummel/test-heapdump-env28403 ---28404 duration_ms: 1520.4150028405 ...28406ok 5554 pummel/test-heapdump-fs-promise28407 ---28408 duration_ms: 3569.7200028409 ...28410ok 5555 pummel/test-heapdump-http228411 ---28412 duration_ms: 7445.4450028413 ...28414ok 5556 pummel/test-heapdump-inspector28415 ---28416 duration_ms: 3075.6800028417 ...28418ok 5557 pummel/test-heapdump-shadow-realm28419 ---28420 duration_ms: 8344.5030028421 ...28422ok 5558 pummel/test-heapdump-tls28423 ---28424 duration_ms: 3884.3960028425 ...28426ok 5559 pummel/test-heapdump-urlpattern28427 ---28428 duration_ms: 3086.4880028429 ...28430ok 5560 pummel/test-heapdump-vm-script28431 ---28432 duration_ms: 2078.6750028433 ...28434ok 5561 pummel/test-heapdump-worker28435 ---28436 duration_ms: 3790.4350028437 ...28438ok 5562 pummel/test-heapdump-zlib28439 ---28440 duration_ms: 24215.4330028441 ...28442ok 5563 pummel/test-heapdump-zstd28443 ---28444 duration_ms: 4186.3440028445 ...28446ok 5564 pummel/test-heapsnapshot-near-heap-limit28447 ---28448 duration_ms: 7224.4640028449 ...28450ok 5565 pummel/test-heapsnapshot-near-heap-limit-big28451 ---28452 duration_ms: 7922.2870028453 ...28454ok 5566 pummel/test-heapsnapshot-near-heap-limit-bounded28455 ---28456 duration_ms: 5108.2310028457 ...28458ok 5567 pummel/test-heapsnapshot-near-heap-limit-by-api28459 ---28460 duration_ms: 10153.7760028461 ...28462ok 5568 pummel/test-http-many-keep-alive-connections28463 ---28464 duration_ms: 1762.9790028465 ...28466ok 5569 pummel/test-http-upload-timeout28467 ---28468 duration_ms: 3597.5520028469 ...28470ok 5570 pummel/test-https-large-response28471 ---28472 duration_ms: 550.9710028473 ...28474ok 5571 pummel/test-https-no-reader28475 ---28476 duration_ms: 2772.4640028477 ...28478ok 5572 pummel/test-keep-alive # skip test requires `wrk` to be installed first28479 ---28480 duration_ms: 311.1220028481 ...28482ok 5573 pummel/test-net-many-clients28483 ---28484 duration_ms: 452.8510028485 ...28486ok 5574 pummel/test-net-pause28487 ---28488 duration_ms: 2575.2540028489 ...28490ok 5575 pummel/test-net-pingpong28491 ---28492 duration_ms: 759.3330028493 ...28494ok 5576 pummel/test-net-pingpong-delay28495 ---28496 duration_ms: 1265.9230028497 ...28498ok 5577 pummel/test-net-timeout28499 ---28500 duration_ms: 3986.4860028501 ...28502ok 5578 pummel/test-net-timeout228503 ---28504 duration_ms: 5397.6370028505 ...28506ok 5579 pummel/test-net-write-callbacks28507 ---28508 duration_ms: 1361.5980028509 ...28510ok 5580 pummel/test-next-tick-infinite-calls28511 ---28512 duration_ms: 11147.6030028513 ...28514ok 5581 pummel/test-process-cpuUsage28515 ---28516 duration_ms: 715.1010028517 ...28518ok 5582 pummel/test-process-hrtime28519 ---28520 duration_ms: 2224.7390028521 ...28522ok 5583 pummel/test-regress-GH-89228523 ---28524 duration_ms: 513.3580028525 ...28526ok 5584 pummel/test-repl-paste-big-data28527 ---28528 duration_ms: 709.2910028529 ...28530ok 5585 pummel/test-stream-pipe-multi28531 ---28532 duration_ms: 1135.1040028533 ...28534ok 5586 pummel/test-string-decoder-large-buffer28535 ---28536 duration_ms: 135.2010028537 ...28538ok 5587 pummel/test-structuredclone-jstransferable28539 ---28540 duration_ms: 1208.8230028541 ...28542ok 5588 pummel/test-timers28543 ---28544 duration_ms: 3311.8600028545 ...28546ok 5589 pummel/test-tls-server-large-request28547 ---28548 duration_ms: 262.2350028549 ...28550ok 5590 pummel/test-tls-throttle28551 ---28552 duration_ms: 262.6950028553 ...28554ok 5591 pummel/test-vm-memleak28555 ---28556 duration_ms: 5612.9100028557 ...28558ok 5592 pummel/test-vm-race28559 ---28560 duration_ms: 5212.2820028561 ...28562ok 5593 pummel/test-watch-file28563 ---28564 duration_ms: 5213.2620028565 ...28566ok 5594 pummel/test-webcrypto-derivebits-pbkdf228567 ---28568 duration_ms: 5113.1040028569 ...28570ok 5595 pummel/test-webcrypto-kangarootwelve-32bit-overflow # skip only relevant when kMaxLength < 2^3228571 ---28572 duration_ms: 109.2530028573 ...28574ok 5596 pummel/test-worker-take-heapsnapshot28575 ---28576 duration_ms: 608.2370028577 ...28578ok 5597 pummel/test-zlib-zip-slow28579 ---28580 duration_ms: 9219.4300028581 ...28582ok 5598 sequential/test-async-wrap-getasyncid28583 ---28584 duration_ms: 328.0430028585 ...28586ok 5599 sequential/test-buffer-creation-regression28587 ---28588 duration_ms: 109.0600028589 ...28590ok 5600 sequential/test-child-process-emfile28591 ---28592 duration_ms: 262.4620028593 ...28594ok 5601 sequential/test-child-process-execsync28595 ---28596 duration_ms: 808.8260028597 ...28598ok 5602 sequential/test-child-process-exit28599 ---28600 duration_ms: 608.6200028601 ...28602ok 5603 sequential/test-child-process-pass-fd28603 ---28604 duration_ms: 608.3330028605 ...28606ok 5604 sequential/test-cli-syntax-bad28607 ---28608 duration_ms: 807.9230028609 ...28610ok 5605 sequential/test-cli-syntax-file-not-found28611 ---28612 duration_ms: 261.5310028613 ...28614ok 5606 sequential/test-cli-syntax-good28615 ---28616 duration_ms: 262.3410028617 ...28618ok 5607 sequential/test-cli-syntax-require28619 ---28620 duration_ms: 407.2390028621 ...28622ok 5608 sequential/test-cluster-inspect-brk28623 ---28624 duration_ms: 210.0020028625 ...28626ok 5609 sequential/test-cluster-net-listen-ipv6only-none28627 ---28628 duration_ms: 262.4250028629 ...28630ok 5610 sequential/test-cluster-net-listen-ipv6only-rr28631 ---28632 duration_ms: 262.5500028633 ...28634ok 5611 sequential/test-cluster-port-reuse-between-workers28635 ---28636 duration_ms: 326.6230028637 ...28638ok 5612 sequential/test-cluster-send-handle-large-payload28639 ---28640 duration_ms: 327.2840028641 ...28642ok 5613 sequential/test-cpu-prof-default28643 ---28644 duration_ms: 1108.6680028645 ...28646ok 5614 sequential/test-cpu-prof-dir-absolute28647 ---28648 duration_ms: 1108.9470028649 ...28650ok 5615 sequential/test-cpu-prof-dir-and-name28651 ---28652 duration_ms: 1108.6020028653 ...28654ok 5616 sequential/test-cpu-prof-dir-relative28655 ---28656 duration_ms: 1108.8550028657 ...28658ok 5617 sequential/test-cpu-prof-drained28659 ---28660 duration_ms: 1108.7310028661 ...28662ok 5618 sequential/test-cpu-prof-exit28663 ---28664 duration_ms: 408.3720028665 ...28666ok 5619 sequential/test-cpu-prof-invalid-options28667 ---28668 duration_ms: 327.3510028669 ...28670ok 5620 sequential/test-cpu-prof-kill28671 ---28672 duration_ms: 408.4070028673 ...28674ok 5621 sequential/test-cpu-prof-name28675 ---28676 duration_ms: 2310.1010028677 ...28678ok 5622 sequential/test-cpu-prof-worker-argv28679 ---28680 duration_ms: 1509.1030028681 ...28682ok 5623 sequential/test-crypto-timing-safe-equal28683 ---28684 duration_ms: 169.3690028685 ...28686ok 5624 sequential/test-crypto-timing-safe-equal-fast28687 ---28688 duration_ms: 170.0080028689 ...28690ok 5625 sequential/test-debug-prompt28691 ---28692 duration_ms: 708.8680028693 ...28694ok 5626 sequential/test-debugger-custom-port28695 ---28696 duration_ms: 708.5500028697 ...28698ok 5627 sequential/test-debugger-debug-brk28699 ---28700 duration_ms: 210.6660028701 ...28702ok 5628 sequential/test-debugger-invalid-args28703 ---28704 duration_ms: 5414.3570028705 ...28706ok 5629 sequential/test-debugger-launch28707 ---28708 duration_ms: 809.1070028709 ...28710ok 5630 sequential/test-debugger-pid28711 ---28712 duration_ms: 507.9160028713 ...28714ok 5631 sequential/test-deprecation-flags28715 ---28716 duration_ms: 262.7400028717 ...28718ok 5632 sequential/test-dgram-bind-shared-ports28719 ---28720 duration_ms: 408.5190028721 ...28722ok 5633 sequential/test-dgram-implicit-bind-failure28723 ---28724 duration_ms: 136.3460028725 ...28726ok 5634 sequential/test-dgram-pingpong28727 ---28728 duration_ms: 168.6910028729 ...28730ok 5635 sequential/test-diagnostic-dir-cpu-prof28731 ---28732 duration_ms: 2610.5560028733 ...28734ok 5636 sequential/test-diagnostic-dir-heap-prof28735 ---28736 duration_ms: 1709.8570028737 ...28738ok 5637 sequential/test-dtls-interop-openssl-client # skip DTLS is not enabled28739 ---28740 duration_ms: 136.3600028741 ...28742ok 5638 sequential/test-dtls-interop-openssl-server # skip DTLS is not enabled28743 ---28744 duration_ms: 136.6130028745 ...28746ok 5639 sequential/test-error-serdes28747 ---28748 duration_ms: 136.3470028749 ...28750ok 5640 sequential/test-fs-opendir-recursive28751 ---28752 duration_ms: 262.2390028753 ...28754ok 5641 sequential/test-fs-readdir-recursive28755 ---28756 duration_ms: 136.1990028757 ...28758ok 5642 sequential/test-fs-stat-sync-overflow28759 ---28760 duration_ms: 263.3770028761 ...28762ok 5643 sequential/test-gc-http-client28763 ---28764 duration_ms: 1009.3590028765 ...28766ok 5644 sequential/test-gc-http-client-onerror28767 ---28768 duration_ms: 1108.6210028769 ...28770ok 5645 sequential/test-gc-http-client-timeout28771 ---28772 duration_ms: 810.0710028773 ...28774ok 5646 sequential/test-get-heapsnapshot-options28775 ---28776 duration_ms: 2612.0730028777 ...28778ok 5647 sequential/test-heapdump28779 ---28780 duration_ms: 910.1330028781 ...28782ok 5648 sequential/test-heapdump-flag28783 ---28784 duration_ms: 810.1540028785 ...28786ok 5649 sequential/test-heapdump-flag-custom-dir28787 ---28788 duration_ms: 709.9800028789 ...28790ok 5650 sequential/test-http-econnrefused28791 ---28792 duration_ms: 210.7710028793 ...28794ok 5651 sequential/test-http-keep-alive-large-write28795 ---28796 duration_ms: 210.7780028797 ...28798ok 5652 sequential/test-http-keepalive-maxsockets28799 ---28800 duration_ms: 508.9910028801 ...28802ok 5653 sequential/test-http-regr-gh-292828803 ---28804 duration_ms: 169.2640028805 ...28806ok 5654 sequential/test-http-server-keep-alive-timeout-slow-client-headers28807 ---28808 duration_ms: 2010.2690028809 ...28810ok 5655 sequential/test-http-server-keep-alive-timeout-slow-server28811 ---28812 duration_ms: 808.4880028813 ...28814ok 5656 sequential/test-http2-max-session-memory28815 ---28816 duration_ms: 210.5310028817 ...28818ok 5657 sequential/test-http2-ping-flood28819 ---28820 duration_ms: 210.4390028821 ...28822ok 5658 sequential/test-http2-settings-flood28823 ---28824 duration_ms: 210.4720028825 ...28826ok 5659 sequential/test-http2-timeout-large-write28827 ---28828 duration_ms: 2911.5840028829 ...28830ok 5660 sequential/test-http2-timeout-large-write-file28831 ---28832 duration_ms: 2912.5350028833 ...28834ok 5661 sequential/test-https-connect-localport28835 ---28836 duration_ms: 6317.0060028837 ...28838ok 5662 sequential/test-https-server-keep-alive-timeout28839 ---28840 duration_ms: 1912.0370028841 ...28842ok 5663 sequential/test-init28843 ---28844 duration_ms: 328.1630028845 ...28846ok 5664 sequential/test-inspector-network-resource28847 ---28848 duration_ms: 1911.3650028849 ...28850ok 5665 sequential/test-inspector-open-dispose28851 ---28852 duration_ms: 327.0860028853 ...28854ok 5666 sequential/test-inspector-port-cluster28855 ---28856 duration_ms: 607.3880028857 ...28858ok 5667 sequential/test-module-loading28859 ---28860 duration_ms: 169.5670028861 ...28862ok 5668 sequential/test-net-GH-550428863 ---28864 duration_ms: 508.2720028865 ...28866ok 5669 sequential/test-net-better-error-messages-port28867 ---28868 duration_ms: 170.4450028869 ...28870ok 5670 sequential/test-net-connect-econnrefused28871 ---28872 duration_ms: 263.0890028873 ...28874ok 5671 sequential/test-net-connect-handle-econnrefused28875 ---28876 duration_ms: 170.7450028877 ...28878ok 5672 sequential/test-net-connect-local-error28879 ---28880 duration_ms: 170.5120028881 ...28882ok 5673 sequential/test-net-listen-ipv6only28883 ---28884 duration_ms: 170.3380028885 ...28886ok 5674 sequential/test-net-listen-shared-ports28887 ---28888 duration_ms: 508.8570028889 ...28890ok 5675 sequential/test-net-localport28891 ---28892 duration_ms: 169.8110028893 ...28894ok 5676 sequential/test-net-reconnect-error28895 ---28896 duration_ms: 168.7640028897 ...28898ok 5677 sequential/test-net-response-size28899 ---28900 duration_ms: 1408.1510028901 ...28902ok 5678 sequential/test-net-server-address28903 ---28904 duration_ms: 168.4940028905 ...28906ok 5679 sequential/test-net-server-bind28907 ---28908 duration_ms: 326.2340028909 ...28910ok 5680 sequential/test-net-server-listen-ipv6-link-local28911 ---28912 duration_ms: 168.4100028913 ...28914ok 5681 sequential/test-next-tick-error-spin28915 ---28916 duration_ms: 326.4430028917 ...28918ok 5682 sequential/test-perf-hooks28919 ---28920 duration_ms: 1309.1390028921 ...28922ok 5683 sequential/test-performance-eventloopdelay28923 ---28924 duration_ms: 7318.5640028925 ...28926ok 5684 sequential/test-pipe28927 ---28928 duration_ms: 4415.5080028929 ...28930ok 5685 sequential/test-process-title28931 ---28932 duration_ms: 263.9960028933 ...28934ok 5686 sequential/test-process-warnings28935 ---28936 duration_ms: 263.6870028937 ...28938ok 5687 sequential/test-repl-timeout-throw28939 ---28940 duration_ms: 409.6350028941 ...28942ok 5688 sequential/test-require-cache-without-stat28943 ---28944 duration_ms: 170.2300028945 ...28946ok 5689 sequential/test-resolution-inspect-brk28947 ---28948 duration_ms: 263.8050028949 ...28950ok 5690 sequential/test-stream2-fs28951 ---28952 duration_ms: 171.4140028953 ...28954ok 5691 sequential/test-stream2-stderr-sync28955 ---28956 duration_ms: 409.4370028957 ...28958ok 5692 sequential/test-timers-block-eventloop28959 ---28960 duration_ms: 211.5360028961 ...28962ok 5693 sequential/test-timers-set-interval-excludes-callback-duration28963 ---28964 duration_ms: 609.9970028965 ...28966ok 5694 sequential/test-tls-connect28967 ---28968 duration_ms: 170.6540028969 ...28970ok 5695 sequential/test-tls-lookup28971 ---28972 duration_ms: 170.4090028973 ...28974ok 5696 sequential/test-tls-psk-client # skip missing openssl cli28975 ---28976 duration_ms: 169.9140028977 ...28978ok 5697 sequential/test-tls-session-timeout # skip node compiled without OpenSSL CLI.28979 ---28980 duration_ms: 170.2680028981 ...28982ok 5698 sequential/test-util-debug28983 ---28984 duration_ms: 609.7300028985 ...28986ok 5699 sequential/test-vm-break-on-sigint28987 ---28988 duration_ms: 328.5960028989 ...28990ok 5700 sequential/test-vm-timeout-escape-promise-module-228991 ---28992 duration_ms: 170.7920028993 ...28994ok 5701 sequential/test-vm-timeout-rethrow28995 ---28996 duration_ms: 328.2300028997 ...28998ok 5702 sequential/test-watch-mode-restart-esm-loading-error28999 ---29000 duration_ms: 2412.3710029001 ...29002ok 5703 sequential/test-watch-mode-watch-flags29003 ---29004 duration_ms: 609.9240029005 ...29006ok 5704 sequential/test-watch-mode-worker29007 ---29008 duration_ms: 3213.9370029009 ...29010ok 5705 sequential/test-without-async-context-frame29011 ---29012 duration_ms: 1811.7520029013 ...29014ok 5706 sequential/test-worker-eventlooputil29015 ---29016 duration_ms: 409.0300029017 ...29018ok 5707 sequential/test-worker-fshandles-error-on-termination29019 ---29020 duration_ms: 510.3820029021 ...29022ok 5708 sequential/test-worker-fshandles-open-close-on-termination29023 ---29024 duration_ms: 509.9040029025 ...29026ok 5709 sequential/test-worker-heapsnapshot-options29027 ---29028 duration_ms: 1111.3480029029 ...29030ok 5710 sequential/test-worker-prof29031 ---29032 duration_ms: 2112.0740029033 ...29034ok 5711 sequential/test-write-heapsnapshot-options29035 ---29036 duration_ms: 2512.5700029037 ...29038ok 5712 sequential/test-zlib-crc32-fast-api29039 ---29040 duration_ms: 212.0270029041 ...29042ok 5713 known_issues/test-cli-print-var-crypto29043 ---29044 duration_ms: 328.3430029045 ...29046ok 5714 known_issues/test-cwd-enoent-file29047 ---29048 duration_ms: 263.3220029049 ...29050ok 5715 known_issues/test-dgram-bind-shared-ports-after-port-029051 ---29052 duration_ms: 509.9530029053 ...29054ok 5716 known_issues/test-fs-cp-async-buffer29055 ---29056 duration_ms: 137.4050029057 ...29058ok 5717 known_issues/test-fs-cp-filter29059 ---29060 duration_ms: 170.1790029061 ...29062ok 5718 known_issues/test-fs-cp-non-utf829063 ---29064 duration_ms: 170.4790029065 ...29066ok 5719 known_issues/test-fs-writeFileSync-invalid-windows29067 ---29068 duration_ms: 136.9750029069 ...29070ok 5720 known_issues/test-http-clientrequest-end-contentlength29071 ---29072 duration_ms: 211.7260029073 ...29074ok 5721 known_issues/test-http-clientrequest-end-empty-response-body29075 ---29076 duration_ms: 211.7150029077 ...29078ok 5722 known_issues/test-http-clientrequest-write-chunked29079 ---29080 duration_ms: 212.0990029081 ...29082ok 5723 known_issues/test-http-path-contains-unicode29083 ---29084 duration_ms: 170.6310029085 ...29086ok 5724 known_issues/test-inspector-cluster-port-clash29087 ---29088 duration_ms: 328.5360029089 ...29090ok 5725 known_issues/test-inspector-instrumentation-breakpoint29091 ---29092 duration_ms: 15430.3000029093 ...29094ok 5726 known_issues/test-repl-require-context29095 ---29096 duration_ms: 210.9530029097 ...29098ok 5727 known_issues/test-stdin-is-always-net.socket29099 ---29100 duration_ms: 328.1430029101 ...29102ok 5728 known_issues/test-stream-writable-sync-error29103 ---29104 duration_ms: 168.8880029105 ...29106ok 5729 known_issues/test-url-parse-conformance29107 ---29108 duration_ms: 212.0320029109 ...29110ok 5730 known_issues/test-vm-function-declaration-uses-define29111 ---29112 duration_ms: 170.3590029113 ...29114ok 5731 known_issues/test-vm-timeout-escape-nexttick29115 ---29116 duration_ms: 909.5610029117 ...29118ok 5732 wpt/test-abort29119 ---29120 duration_ms: 2411.1020029121 ...29122ok 5733 wpt/test-atob29123 ---29124 duration_ms: 326.1840029125 ...29126ok 5734 wpt/test-blob29127 ---29128 duration_ms: 407.3540029129 ...29130ok 5735 wpt/test-broadcastchannel29131 ---29132 duration_ms: 328.0080029133 ...29134ok 5736 wpt/test-compression29135 ---29136 duration_ms: 1208.8140029137 ...29138ok 5737 wpt/test-console29139 ---29140 duration_ms: 407.8300029141 ...29142ok 5738 wpt/test-encoding29143 ---29144 duration_ms: 713.3520029145 ...29146ok 5739 wpt/test-events29147 ---29148 duration_ms: 326.3410029149 ...29150ok 5740 wpt/test-file29151 ---29152 duration_ms: 261.7090029153 ...29154ok 5741 wpt/test-hr-time29155 ---29156 duration_ms: 2309.4080029157 ...29158ok 5742 wpt/test-microtask-queuing29159 ---29160 duration_ms: 261.8820029161 ...29162ok 5743 wpt/test-performance-timeline29163 ---29164 duration_ms: 2410.6070029165 ...29166ok 5744 wpt/test-resource-timing29167 ---29168 duration_ms: 408.0100029169 ...29170ok 5745 wpt/test-streams29171 ---29172 duration_ms: 2812.2580029173 ...29174ok 5746 wpt/test-structured-clone29175 ---29176 duration_ms: 261.9380029177 ...29178ok 5747 wpt/test-timers29179 ---29180 duration_ms: 1208.2100029181 ...29182ok 5748 wpt/test-url # skip Different versions of Ada affect the WPT tests29183 ---29184 duration_ms: 108.3070029185 ...29186ok 5749 wpt/test-urlpattern29187 ---29188 duration_ms: 327.0890029189 ...29190ok 5750 wpt/test-wasm-jsapi29191 ---29192 duration_ms: 1108.6690029193 ...29194ok 5751 wpt/test-wasm-webapi29195 ---29196 duration_ms: 327.6930029197 ...29198ok 5752 wpt/test-web-locks29199 ---29200 duration_ms: 2710.0540029201 ...29202ok 5753 wpt/test-webcrypto29203 ---29204 duration_ms: 6147.1080029205 ...29206ok 5754 wpt/test-webidl29207 ---29208 duration_ms: 407.5080029209 ...29210ok 5755 wpt/test-webstorage29211 ---29212 duration_ms: 1809.2590029213 ...29214ok 5756 wpt/test-workers29215 ---29216 duration_ms: 807.5370029217 ...29218ok 5757 abort/test-abort-backtrace29219 ---29220 duration_ms: 332.6570029221 ...29222ok 5758 abort/test-abort-fatal-error29223 ---29224 duration_ms: 411.3030029225 ...29226ok 5759 abort/test-abort-uncaught-exception29227 ---29228 duration_ms: 331.6080029229 ...29230ok 5760 abort/test-addon-register-signal-handler # skip binding not built yet29231 ---29232 duration_ms: 114.6480029233 ...29234ok 5761 abort/test-addon-uv-handle-leak # skip binding not built yet29235 ---29236 duration_ms: 112.7340029237 ...29238ok 5762 abort/test-http-parser-consume29239 ---29240 duration_ms: 331.0690029241 ...29242ok 5763 abort/test-process-abort-exitcode29243 ---29244 duration_ms: 332.8680029245 ...29246ok 5764 abort/test-signal-handler29247 ---29248 duration_ms: 329.9040029249 ...29250ok 5765 abort/test-worker-abort-uncaught-exception29251 ---29252 duration_ms: 410.8230029253 ...29254ok 5766 abort/test-zlib-invalid-internals-usage29255 ---29256 duration_ms: 331.6630029257 ...29258ok 5767 wasm-allocation/test-wasm-allocation29259 ---29260 duration_ms: 139.0770029261 ...29262ok 5768 wasm-allocation/test-wasm-allocation-auto-adapt29263 ---29264 duration_ms: 115.0740029265 ...29266ok 5769 wasm-allocation/test-wasm-allocation-disable-trap-handler29267 ---29268 duration_ms: 112.1640029269 ...29270ok 5770 wasm-allocation/test-wasm-allocation-memory6429271 ---29272 duration_ms: 140.9320029273 ...2927429275Failed tests:29276out/Release/node /build/node-v26.9.0/test/parallel/test-fs-cp-async-file-modes.mjs29277make: *** [Makefile:631: test-ci-js] Error 1