nixbot

builds

failed nodejs-slim-26.9.0 checks.x86_64-linux.pkgs-hermes-desktop · build #5024 · raw

1structuredAttrs is enabled
unpackPhase
2unpacking source archive /nix/store/7ajvk1c4mspigbdgf21bn9d7f7p9kmgk-node-v26.9.0.tar.xz3source root is node-v26.9.04setting SOURCE_DATE_EPOCH to timestamp 1789550914 of file "node-v26.9.0/tools/nix/v8.nix"
patchPhase
5applying patch /nix/store/j4p9lc7z8hi4g40cpqpj3qxb9a7bvanp-configure-armv6-vfpv2.patch6patching file configure.py7Hunk #1 succeeded at 49 with fuzz 1 (offset -1 lines).8applying patch /nix/store/igz0qnjkvwi4f2mn7i13h3ndxl9n5ryi-node-npm-build-npm-package-logic.patch9patching file deps/npm/node_modules/@npmcli/run-script/lib/set-path.js10Hunk #1 succeeded at 13 with fuzz 2 (offset 1 line).11Hunk #2 succeeded at 37 (offset 8 lines).12patching file deps/npm/node_modules/pacote/lib/git.js13Hunk #1 succeeded at 186 (offset -2 lines).14patching file deps/npm/node_modules/@npmcli/arborist/lib/arborist/build-ideal-tree.js15Hunk #1 succeeded at 802 (offset 62 lines).16patching file deps/npm/node_modules/@npmcli/arborist/lib/arborist/load-actual.js17Hunk #1 succeeded at 121 with fuzz 1 (offset -26 lines).18applying patch /nix/store/57n0csr7hpdd0y91ljxpiwlfw7fsx3kl-use-correct-env-in-tests.patch19patching file test/parallel/test-child-process-default-options.js20patching file test/parallel/test-child-process-env.js21patching file test/parallel/test-child-process-exec-env.js22applying patch /nix/store/p2mhv95s89kaqmdynhz6y6asalf8y4dh-bin-sh-node-run-v22.patch23patching file test/fixtures/run-script/node_modules/.bin/positional-args24Hunk #1 succeeded at 1 with fuzz 1.25applying patch /nix/store/3za8p3x3hjfr1a9b1lc3z4aapp9sm2ja-use-nix-codesign.patch26patching file test/parallel/test-macos-app-sandbox.js27applying patch /nix/store/6whc7i794ygkcwjwrprw7y9aglfl238g-fix-temporal-integration-with-shared-icu.patch28patching file deps/v8/src/objects/js-temporal-zoneinfo64.cc29patching file tools/v8_gypfiles/v8.gyp30Hunk #1 succeeded at 1398 (offset 19 lines).31Hunk #2 succeeded at 2051 (offset 93 lines).
updateAutotoolsGnuConfigScriptsPhase
32Updating Autotools / GNU config script to a newer upstream version: ./deps/ngtcp2/ngtcp2/third-party/libev/config.sub33Updating Autotools / GNU config script to a newer upstream version: ./deps/cares/config/config.sub34Updating Autotools / GNU config script to a newer upstream version: ./deps/libffi/config.sub35Updating Autotools / GNU config script to a newer upstream version: ./deps/ngtcp2/ngtcp2/third-party/libev/config.guess36Updating Autotools / GNU config script to a newer upstream version: ./deps/cares/config/config.guess37Updating Autotools / GNU config script to a newer upstream version: ./deps/libffi/config.guess
configurePhase
38fixing libtool script ./deps/ngtcp2/ngtcp2/third-party/libev/ltmain.sh39fixing libtool script ./deps/cares/config/ltmain.sh40fixing libtool script ./deps/libffi/ltmain.sh41./deps/ngtcp2/ngtcp2/third-party/libev/configure42./deps/cares/configure43./deps/libffi/configure44configure flags: --prefix=/nix/store/mn8r5sjblqmigxv5lg89q4wcj5zqb16n-nodejs-slim-26.9.0 --ninja --with-intl=system-icu --openssl-use-def-ca-store --no-cross-compiling --dest-os=linux --dest-cpu=x64 --v8-enable-temporal-support --use-prefix-to-find-headers --shared-abseil --shared-abseil-libpath=/nix/store/iqvb7h1ykhm12304qwx17xbncrhhy1g4-abseil-cpp-20260107.1/lib --shared-ada --shared-ada-libpath=/nix/store/vk3yq4nzlrdvq1qxgy3764qaycanr0mc-ada-4.0.0/lib --shared-brotli --shared-brotli-libpath=/nix/store/xhgd6rb4h8ssid9yw8nvw74cwq69md5y-brotli-1.2.0-lib/lib --shared-cares --shared-cares-libpath=/nix/store/68syfccdbv3hlz7imlc9xl9fzyz4v8gx-c-ares-1.34.8/lib --shared-ffi --shared-ffi-libpath=/nix/store/3r5wfb1dl3sfknvy1yringvmap0hxj4r-libffi-3.8.0/lib --shared-gtest --shared-gtest-libpath=/nix/store/5sdsmm8s00hck28yp95fk993rg42mqsp-gtest-1.18.0/lib --shared-hdr-histogram --shared-hdr-histogram-libpath=/nix/store/9g532g9jf92xy9xh68p99ml815q11zs0-hdrhistogram_c-0.11.10/lib --shared-highway --shared-highway-libpath=/nix/store/xs1jbkdzxs4ym0rh89nx8xfwj387x3aj-libhwy-1.4.0/lib --shared-http-parser --shared-http-parser-libpath=/nix/store/1lw7d9jsv7qb6nvc4fmvvqsyphaacqcs-llhttp-9.4.3/lib --shared-libuv --shared-libuv-libpath=/nix/store/68b1blnvl4scgdq48d4p7h4lw4pm5w0w-libuv-1.52.1/lib --shared-lief --shared-lief-libpath=/nix/store/nx4g3j20wvgq36b406q6rysvqzzrxaci-lief-0.17.6/lib --shared-merve --shared-merve-libpath=/nix/store/2gj58j8rd88kaan7bsqhl9fjxxp11qqi-merve-1.2.2/lib --shared-nbytes --shared-nbytes-libpath=/nix/store/zf8c839ahp1fn736lih7ai2y14rrx2gn-nbytes-0.1.4/lib --shared-nghttp2 --shared-nghttp2-libpath=/nix/store/6avzrsm02jh7q48ym3hgznj3ypc2shc2-nghttp2-1.70.0-lib/lib --shared-nghttp3 --shared-nghttp3-libpath=/nix/store/dki4fkk75v2x4aqkszmi257wxq6rkkyr-nghttp3-1.16.0/lib --shared-ngtcp2 --shared-ngtcp2-libpath=/nix/store/2hc131frgdz45bjbajmpvlrj185lah7p-ngtcp2-1.23.0/lib --shared-openssl --shared-openssl-libpath=/nix/store/yj34vymbqf7mf4lmffipy8jqc4kwr1mc-openssl-3.6.4/lib --shared-simdjson --shared-simdjson-libpath=/nix/store/129shchmqszagbb0m8kk7ddzb7nnklxv-simdjson-4.6.8/lib --shared-simdutf --shared-simdutf-libpath=/nix/store/dw6xlar7m4qfrhbk63zhcc5pmixa1ga1-simdutf-9.1.0/lib --shared-sqlite --shared-sqlite-libpath=/nix/store/7a0nx1a0rdc5s07vxrsdhplqnzncl5z9-sqlite-3.53.3/lib --shared-temporal_capi --shared-temporal_capi-libpath=/nix/store/7hrx4vyx67h46xxwqj3zw4nafa1m8d04-temporal_capi-0.2.6/lib --shared-uvwasi --shared-uvwasi-libpath=/nix/store/qnbgx63w8yya5330xcxyixja3ah6gfzm-uvwasi-0.0.23/lib --shared-zlib --shared-zlib-libpath=/nix/store/lw86vj9kfwgvlivg3p8qg2nibpmhmsl9-zlib-1.3.2/lib --shared-zstd --shared-zstd-libpath=/nix/store/8ik1d1r4l2jzm9mjh6bc0a13yczx62wg-zstd-1.5.7/lib45INFO: configure completed successfully
buildPhase
46build flags: -j48 SHELL=/nix/store/svx59425zxp552p2b8gm11qj5r09b56i-bash-5.3p15/bin/bash47TERM=dumb ninja -C out/Release -j4848ninja: Entering directory `out/Release'49[1/1871] CXX obj/deps/v8/src/base/v8_libbase.abort-mode.o50[2/1871] CXX obj/deps/v8/src/base/v8_libbase.fpu.o51[3/1871] CXX obj/deps/v8/src/base/v8_libbase.once.o52[4/1871] CXX obj/deps/v8/src/base/v8_libbase.vlq-base64.o53[5/1871] CXX obj/deps/v8/src/base/v8_libbase.sys-info.o54[6/1871] CXX obj/deps/v8/src/base/v8_libbase.bits.o55[7/1871] CXX obj/deps/v8/src/base/v8_libbase.division-by-constant.o56[8/1871] CXX obj/deps/v8/src/base/numbers/v8_libbase.cached-powers.o57[9/1871] CXX obj/deps/v8/src/base/numbers/v8_libbase.diy-fp.o58[10/1871] CXX obj/deps/v8/src/base/platform/v8_libbase.semaphore.o59[11/1871] CXX obj/deps/v8/src/base/platform/v8_libbase.platform.o60[12/1871] CXX obj/deps/v8/src/base/v8_libbase.file-utils.o61[13/1871] CXX obj/deps/v8/src/base/debug/v8_libbase.stack_trace.o62[14/1871] CXX obj/deps/v8/src/base/numbers/v8_libbase.dtoa.o63[15/1871] CXX obj/deps/v8/src/base/v8_libbase.page-allocator.o64[16/1871] CXX obj/deps/v8/src/base/platform/v8_libbase.platform-posix-time.o65[17/1871] CXX obj/deps/v8/src/base/numbers/v8_libbase.bignum-dtoa.o66[18/1871] CXX obj/deps/v8/src/base/sanitizer/v8_libbase.lsan-page-allocator.o67[19/1871] CXX obj/deps/v8/src/base/platform/v8_libbase.memory-protection-key.o68[20/1871] CXX obj/deps/v8/src/base/v8_libbase.region-allocator.o69[21/1871] CXX obj/deps/v8/src/base/v8_libbase.strings.o70[22/1871] CXX obj/deps/v8/src/base/sanitizer/v8_libbase.lsan-virtual-address-space.o71[23/1871] CXX obj/deps/v8/src/base/numbers/v8_libbase.fast-dtoa.o72[24/1871] CXX obj/deps/v8/src/base/numbers/v8_libbase.bignum.o73[25/1871] ACTION Checking inspector protocol compatibility74[26/1871] CXX obj/deps/v8/src/base/numbers/v8_libbase.fixed-dtoa.o75[27/1871] CXX obj/deps/v8/src/base/v8_libbase.cpu.o76[28/1871] ACTION Generating temporal zoneinfo static data77[29/1871] CC obj/deps/v8/third_party/zlib/v8_zlib.cpu_features.o78cc1: warning: command-line option '-fvisibility-inlines-hidden' is valid for C++/ObjC++ but not for C79[30/1871] CXX obj/deps/v8/src/base/numbers/v8_libbase.strtod.o80[31/1871] CXX obj/deps/v8/src/base/platform/v8_libbase.platform-linux.o81[32/1871] CC obj/deps/v8/third_party/zlib/v8_zlib.gzclose.o82cc1: warning: command-line option '-fvisibility-inlines-hidden' is valid for C++/ObjC++ but not for C83[33/1871] CC obj/deps/v8/third_party/zlib/v8_zlib.compress.o84cc1: warning: command-line option '-fvisibility-inlines-hidden' is valid for C++/ObjC++ but not for C85[34/1871] CC obj/deps/v8/third_party/zlib/v8_zlib.adler32.o86cc1: warning: command-line option '-fvisibility-inlines-hidden' is valid for C++/ObjC++ but not for C87[35/1871] CC obj/deps/v8/third_party/zlib/v8_zlib.gzlib.o88cc1: warning: command-line option '-fvisibility-inlines-hidden' is valid for C++/ObjC++ but not for C89[36/1871] CXX obj/deps/v8/src/base/debug/v8_libbase.stack_trace_posix.o90[37/1871] CC obj/deps/v8/third_party/zlib/v8_zlib.crc32.o91cc1: warning: command-line option '-fvisibility-inlines-hidden' is valid for C++/ObjC++ but not for C92[38/1871] CXX obj/deps/v8/src/base/v8_libbase.ieee754.o93[39/1871] CXX obj/deps/v8/src/base/platform/v8_libbase.condition-variable.o94[40/1871] CC obj/deps/v8/third_party/zlib/v8_zlib.gzread.o95cc1: warning: command-line option '-fvisibility-inlines-hidden' is valid for C++/ObjC++ but not for C96[41/1871] CC obj/deps/v8/third_party/zlib/v8_zlib.gzwrite.o97cc1: warning: command-line option '-fvisibility-inlines-hidden' is valid for C++/ObjC++ but not for C98[42/1871] CC obj/deps/v8/third_party/zlib/v8_zlib.uncompr.o99cc1: warning: command-line option '-fvisibility-inlines-hidden' is valid for C++/ObjC++ but not for C100[43/1871] CC obj/deps/v8/third_party/zlib/v8_zlib.zutil.o101cc1: warning: command-line option '-fvisibility-inlines-hidden' is valid for C++/ObjC++ but not for C102[44/1871] CXX obj/deps/v8/third_party/zlib/google/v8_zlib.compression_utils_portable.o103[45/1871] CXX obj/deps/v8/src/base/platform/v8_libbase.mutex.o104[46/1871] CXX obj/deps/v8/src/base/v8_libbase.virtual-address-space-page-allocator.o105[47/1871] CC obj/deps/v8/third_party/zlib/v8_zlib.inftrees.o106cc1: warning: command-line option '-fvisibility-inlines-hidden' is valid for C++/ObjC++ but not for C107[48/1871] CXX obj/deps/v8/src/base/platform/v8_libbase.time.o108[49/1871] CXX obj/deps/v8/src/base/v8_libbase.emulated-virtual-address-subspace.o109[50/1871] CC obj/deps/v8/third_party/zlib/v8_zlib.inffast.o110cc1: warning: command-line option '-fvisibility-inlines-hidden' is valid for C++/ObjC++ but not for C111[51/1871] CXX obj/deps/v8/src/base/v8_libbase.logging.o112[52/1871] CXX obj/deps/v8/src/base/v8_libbase.bounded-page-allocator.o113[53/1871] ACTION Generating inspector protocol sources from protocol json114[54/1871] STAMP obj/tools/v8_gypfiles/v8_inspector_headers.actions_rules_copies.stamp115[55/1871] CXX obj/deps/v8/src/base/v8_libbase.virtual-address-space.o116[56/1871] CC obj/deps/v8/third_party/zlib/v8_zlib.infback.o117cc1: warning: command-line option '-fvisibility-inlines-hidden' is valid for C++/ObjC++ but not for C118[57/1871] CC obj/deps/v8/third_party/zlib/v8_zlib.deflate.o119cc1: warning: command-line option '-fvisibility-inlines-hidden' is valid for C++/ObjC++ but not for C120[58/1871] CXX obj/deps/v8/src/interpreter/bytecode_builtins_list_generator.bytecode-operands.o121[59/1871] CC obj/deps/v8/third_party/zlib/v8_zlib.trees.o122cc1: warning: command-line option '-fvisibility-inlines-hidden' is valid for C++/ObjC++ but not for C123[60/1871] CXX obj/deps/v8/src/base/utils/v8_libbase.random-number-generator.o124[61/1871] CXX obj/deps/v8/src/torque/torque_base.cpp-builder.o125[62/1871] CXX obj/deps/v8/src/regexp/gen-regexp-special-case.gen-regexp-special-case.o126[63/1871] CXX obj/deps/v8/src/torque/torque_base.source-positions.o127[64/1871] CC obj/deps/v8/third_party/zlib/v8_zlib.inflate.o128cc1: warning: command-line option '-fvisibility-inlines-hidden' is valid for C++/ObjC++ but not for C129[65/1871] AR obj/tools/v8_gypfiles/libv8_zlib.a130[66/1871] CXX obj/deps/v8/src/builtins/bytecode_builtins_list_generator.generate-bytecodes-builtins-list.o131[67/1871] CXX obj/deps/v8/src/interpreter/bytecode_builtins_list_generator.bytecodes.o132[68/1871] CXX obj/deps/v8/src/base/platform/v8_libbase.platform-posix.o133[69/1871] AR obj/tools/v8_gypfiles/libv8_libbase.a134[70/1871] CXX obj/src/node_js2c.embedded_data.o135[71/1871] STAMP obj/tools/v8_gypfiles/v8_flags.actions_depends.stamp136[72/1871] CXX obj/deps/v8/src/libplatform/v8_libplatform.default-thread-isolated-allocator.o137[73/1871] CXX obj/src/node_js2c.builtin_info.o138[74/1871] CXX obj/deps/v8/src/libplatform/tracing/v8_libplatform.trace-config.o139[75/1871] CXX obj/deps/v8/src/libplatform/tracing/v8_libplatform.trace-object.o140[76/1871] CXX obj/deps/inspector_protocol/crdtp/crdtp.error_support.o141[77/1871] CXX obj/deps/v8/src/torque/torque_base.declarable.o142[78/1871] CXX obj/deps/v8/src/libplatform/tracing/v8_libplatform.trace-writer.o143[79/1871] CC obj/test/overlapped-checker/overlapped-checker.main_unix.o144[80/1871] CC obj/test/nop/nop.nop.o145[81/1871] CXX obj/deps/inspector_protocol/crdtp/crdtp.json_platform.o146[82/1871] CXX obj/deps/ncrypto/ncrypto_engine.engine.o147[83/1871] AR obj/deps/ncrypto/libncrypto_engine.a148[84/1871] LINK gen-regexp-special-case149[85/1871] LINK bytecode_builtins_list_generator150[86/1871] CXX obj/deps/v8/src/torque/torque_base.type-inference.o151[87/1871] CXX obj/deps/v8/src/torque/torque_base.global-context.o152[88/1871] ACTION generate_bytecode_builtins_list: generate_bytecode_builtins_list_action_73a03d1964edbe79fc19deb968fa21d5c456544c3d095b62158c8959ed2aeed1153[89/1871] ACTION run_gen-regexp-special-case: run_gen-regexp-special-case_action_72d03329d19e24c609ee6e65eeeb110034e9261c37b8a8d83522628d574e9fa7154[90/1871] CXX obj/deps/inspector_protocol/crdtp/crdtp.span.o155[91/1871] CXX obj/deps/v8/src/torque/torque_base.torque-code-generator.o156[92/1871] LINK overlapped-checker157[93/1871] LINK nop158[94/1871] CXX obj/deps/inspector_protocol/crdtp/crdtp.status.o159[95/1871] CXX obj/deps/v8/src/torque/torque_base.type-oracle.o160[96/1871] CXX obj/deps/inspector_protocol/crdtp/crdtp.serializable.o161[97/1871] CXX obj/deps/v8/src/libplatform/v8_libplatform.default-job.o162[98/1871] CXX obj/deps/v8/src/libplatform/v8_libplatform.task-queue.o163[99/1871] CXX obj/deps/v8/src/libplatform/tracing/v8_libplatform.trace-buffer.o164[100/1871] CXX obj/deps/v8/src/libplatform/v8_libplatform.worker-thread.o165[101/1871] CXX obj/deps/v8/src/libplatform/v8_libplatform.delayed-task-queue.o166[102/1871] CXX obj/deps/v8/src/libplatform/v8_libplatform.default-worker-threads-task-runner.o167[103/1871] CXX obj/deps/v8/src/torque/torque_base.server-data.o168[104/1871] CXX obj/deps/inspector_protocol/crdtp/crdtp.protocol_core.o169[105/1871] CXX obj/deps/v8/src/libplatform/tracing/v8_libplatform.tracing-controller.o170[106/1871] CXX obj/deps/v8/src/torque/torque_base.earley-parser.o171[107/1871] CXX obj/deps/v8/src/torque/torque_base.cfg.o172[108/1871] CXX obj/deps/v8/src/torque/torque_base.utils.o173[109/1871] CXX obj/deps/inspector_protocol/crdtp/crdtp.cbor.o174[110/1871] CXX obj/deps/v8/src/libplatform/v8_libplatform.default-foreground-task-runner.o175[111/1871] CXX obj/deps/v8/src/libplatform/v8_libplatform.default-platform.o176[112/1871] AR obj/tools/v8_gypfiles/libv8_libplatform.a177[113/1871] CXX obj/deps/v8/src/torque/torque_base.kythe-data.o178[114/1871] CXX obj/deps/inspector_protocol/crdtp/crdtp.dispatch.o179[115/1871] CXX obj/deps/v8/src/torque/torque_base.class-debug-reader-generator.o180[116/1871] CXX obj/deps/v8/src/torque/torque_base.cc-generator.o181[117/1871] CXX obj/deps/v8/src/torque/torque_base.instance-type-generator.o182[118/1871] CXX obj/deps/v8/src/torque/torque.torque.o183[119/1871] CXX obj/deps/v8/src/torque/torque_base.declaration-visitor.o184[120/1871] CXX obj/tools/node_js2c.js2c.o185[121/1871] CXX obj/deps/v8/src/torque/torque_base.declarations.o186[122/1871] CXX obj/deps/v8/src/torque/torque_base.csa-generator.o187[123/1871] LINK node_js2c188[124/1871] STAMP obj/node_base.actions_depends.stamp189[125/1871] CXX obj/deps/inspector_protocol/crdtp/crdtp.json.o190[126/1871] AR obj/deps/inspector_protocol/libcrdtp.a191[127/1871] ACTION node_base: convert_node_protocol_to_json_f26a10641803f604d1307d23f68bde8b450ad8f073bd43313642df31e7a3478c192[128/1871] ACTION node_base: node_js2c_f26a10641803f604d1307d23f68bde8b450ad8f073bd43313642df31e7a3478c193[129/1871] ACTION node_base: concatenate_protocols_f26a10641803f604d1307d23f68bde8b450ad8f073bd43313642df31e7a3478c194[130/1871] ACTION node_base: v8_inspector_compress_protocol_json_f26a10641803f604d1307d23f68bde8b450ad8f073bd43313642df31e7a3478c195[131/1871] CXX obj/deps/v8/src/torque/torque_base.instructions.o196[132/1871] ACTION Generating node protocol sources from protocol json197[133/1871] STAMP obj/node_base.actions_rules_copies.stamp198[134/1871] CXX obj/deps/v8/src/torque/torque_base.torque-compiler.o199[135/1871] CXX obj/deps/v8/src/torque/torque_base.type-visitor.o200[136/1871] CXX obj/src/node_base.embedded_data.o201[137/1871] CXX obj/src/node_base.builtin_info.o202[138/1871] CXX obj/src/api/node_base.utils.o203[139/1871] CXX obj/deps/ncrypto/ncrypto.ncrypto.o204[140/1871] CXX obj/src/node_base.json_utils.o205[141/1871] CXX obj/src/node_base.internal_only_v8.o206In file included from ../../src/util.h:29,207 from ../../src/util-inl.h:33,208 from ../../src/internal_only_v8.cc:3:209../../deps/v8/include/v8-profiler.h: In constructor 'v8::HeapProfiler::HeapSnapshotOptions::HeapSnapshotOptions()':210../../deps/v8/include/v8-profiler.h:1128:27: warning: 'v8::HeapProfiler::HeapSnapshotOptions::global_object_name_resolver' is deprecated: Use context_name_resolver callback instead. [-Wdeprecated-declarations]211 1128 | HeapSnapshotOptions() {}212 | ^213../../deps/v8/include/v8-profiler.h:1142:25: note: declared here214 1142 | ObjectNameResolver* global_object_name_resolver = nullptr;215 | ^~~~~~~~~~~~~~~~~~~~~~~~~~~216../../deps/v8/include/v8-profiler.h:1128:27: warning: 'v8::HeapProfiler::HeapSnapshotOptions::global_object_name_resolver' is deprecated: Use context_name_resolver callback instead. [-Wdeprecated-declarations]217 1128 | HeapSnapshotOptions() {}218 | ^219../../deps/v8/include/v8-profiler.h:1142:25: note: declared here220 1142 | ObjectNameResolver* global_object_name_resolver = nullptr;221 | ^~~~~~~~~~~~~~~~~~~~~~~~~~~222[142/1871] CXX obj/src/node_base.cleanup_queue.o223In file included from ../../src/memory_tracker.h:6,224 from ../../src/cleanup_queue.h:11,225 from ../../src/cleanup_queue.cc:1:226../../deps/v8/include/v8-profiler.h: In constructor 'v8::HeapProfiler::HeapSnapshotOptions::HeapSnapshotOptions()':227../../deps/v8/include/v8-profiler.h:1128:27: warning: 'v8::HeapProfiler::HeapSnapshotOptions::global_object_name_resolver' is deprecated: Use context_name_resolver callback instead. [-Wdeprecated-declarations]228 1128 | HeapSnapshotOptions() {}229 | ^230../../deps/v8/include/v8-profiler.h:1142:25: note: declared here231 1142 | ObjectNameResolver* global_object_name_resolver = nullptr;232 | ^~~~~~~~~~~~~~~~~~~~~~~~~~~233../../deps/v8/include/v8-profiler.h:1128:27: warning: 'v8::HeapProfiler::HeapSnapshotOptions::global_object_name_resolver' is deprecated: Use context_name_resolver callback instead. [-Wdeprecated-declarations]234 1128 | HeapSnapshotOptions() {}235 | ^236../../deps/v8/include/v8-profiler.h:1142:25: note: declared here237 1142 | ObjectNameResolver* global_object_name_resolver = nullptr;238 | ^~~~~~~~~~~~~~~~~~~~~~~~~~~239[143/1871] CXX obj/gen/src/node/inspector/protocol/node_base.IO.o240In file included from ../../src/util.h:29,241 from ../../src/inspector/node_string.h:10,242 from gen/src/node/inspector/protocol/Forward.h:19,243 from gen/src/node/inspector/protocol/Protocol.h:18,244 from gen/src/node/inspector/protocol/IO.h:10,245 from gen/src/node/inspector/protocol/IO.cpp:7:246../../deps/v8/include/v8-profiler.h: In constructor 'v8::HeapProfiler::HeapSnapshotOptions::HeapSnapshotOptions()':247../../deps/v8/include/v8-profiler.h:1128:27: warning: 'v8::HeapProfiler::HeapSnapshotOptions::global_object_name_resolver' is deprecated: Use context_name_resolver callback instead. [-Wdeprecated-declarations]248 1128 | HeapSnapshotOptions() {}249 | ^250../../deps/v8/include/v8-profiler.h:1142:25: note: declared here251 1142 | ObjectNameResolver* global_object_name_resolver = nullptr;252 | ^~~~~~~~~~~~~~~~~~~~~~~~~~~253../../deps/v8/include/v8-profiler.h:1128:27: warning: 'v8::HeapProfiler::HeapSnapshotOptions::global_object_name_resolver' is deprecated: Use context_name_resolver callback instead. [-Wdeprecated-declarations]254 1128 | HeapSnapshotOptions() {}255 | ^256../../deps/v8/include/v8-profiler.h:1142:25: note: declared here257 1142 | ObjectNameResolver* global_object_name_resolver = nullptr;258 | ^~~~~~~~~~~~~~~~~~~~~~~~~~~259[144/1871] CXX obj/gen/src/node/inspector/protocol/node_base.NodeRuntime.o260In file included from ../../src/util.h:29,261 from ../../src/inspector/node_string.h:10,262 from gen/src/node/inspector/protocol/Forward.h:19,263 from gen/src/node/inspector/protocol/Protocol.h:18,264 from gen/src/node/inspector/protocol/NodeRuntime.h:10,265 from gen/src/node/inspector/protocol/NodeRuntime.cpp:7:266../../deps/v8/include/v8-profiler.h: In constructor 'v8::HeapProfiler::HeapSnapshotOptions::HeapSnapshotOptions()':267../../deps/v8/include/v8-profiler.h:1128:27: warning: 'v8::HeapProfiler::HeapSnapshotOptions::global_object_name_resolver' is deprecated: Use context_name_resolver callback instead. [-Wdeprecated-declarations]268 1128 | HeapSnapshotOptions() {}269 | ^270../../deps/v8/include/v8-profiler.h:1142:25: note: declared here271 1142 | ObjectNameResolver* global_object_name_resolver = nullptr;272 | ^~~~~~~~~~~~~~~~~~~~~~~~~~~273../../deps/v8/include/v8-profiler.h:1128:27: warning: 'v8::HeapProfiler::HeapSnapshotOptions::global_object_name_resolver' is deprecated: Use context_name_resolver callback instead. [-Wdeprecated-declarations]274 1128 | HeapSnapshotOptions() {}275 | ^276../../deps/v8/include/v8-profiler.h:1142:25: note: declared here277 1142 | ObjectNameResolver* global_object_name_resolver = nullptr;278 | ^~~~~~~~~~~~~~~~~~~~~~~~~~~279[145/1871] CXX obj/gen/src/node/inspector/protocol/node_base.Storage.o280In file included from ../../src/util.h:29,281 from ../../src/inspector/node_string.h:10,282 from gen/src/node/inspector/protocol/Forward.h:19,283 from gen/src/node/inspector/protocol/Protocol.h:18,284 from gen/src/node/inspector/protocol/Storage.h:10,285 from gen/src/node/inspector/protocol/Storage.cpp:7:286../../deps/v8/include/v8-profiler.h: In constructor 'v8::HeapProfiler::HeapSnapshotOptions::HeapSnapshotOptions()':287../../deps/v8/include/v8-profiler.h:1128:27: warning: 'v8::HeapProfiler::HeapSnapshotOptions::global_object_name_resolver' is deprecated: Use context_name_resolver callback instead. [-Wdeprecated-declarations]288 1128 | HeapSnapshotOptions() {}289 | ^290../../deps/v8/include/v8-profiler.h:1142:25: note: declared here291 1142 | ObjectNameResolver* global_object_name_resolver = nullptr;292 | ^~~~~~~~~~~~~~~~~~~~~~~~~~~293../../deps/v8/include/v8-profiler.h:1128:27: warning: 'v8::HeapProfiler::HeapSnapshotOptions::global_object_name_resolver' is deprecated: Use context_name_resolver callback instead. [-Wdeprecated-declarations]294 1128 | HeapSnapshotOptions() {}295 | ^296../../deps/v8/include/v8-profiler.h:1142:25: note: declared here297 1142 | ObjectNameResolver* global_object_name_resolver = nullptr;298 | ^~~~~~~~~~~~~~~~~~~~~~~~~~~299[146/1871] CXX obj/gen/src/node/inspector/protocol/node_base.Target.o300In file included from ../../src/util.h:29,301 from ../../src/inspector/node_string.h:10,302 from gen/src/node/inspector/protocol/Forward.h:19,303 from gen/src/node/inspector/protocol/Protocol.h:18,304 from gen/src/node/inspector/protocol/Target.h:10,305 from gen/src/node/inspector/protocol/Target.cpp:7:306../../deps/v8/include/v8-profiler.h: In constructor 'v8::HeapProfiler::HeapSnapshotOptions::HeapSnapshotOptions()':307../../deps/v8/include/v8-profiler.h:1128:27: warning: 'v8::HeapProfiler::HeapSnapshotOptions::global_object_name_resolver' is deprecated: Use context_name_resolver callback instead. [-Wdeprecated-declarations]308 1128 | HeapSnapshotOptions() {}309 | ^310../../deps/v8/include/v8-profiler.h:1142:25: note: declared here311 1142 | ObjectNameResolver* global_object_name_resolver = nullptr;312 | ^~~~~~~~~~~~~~~~~~~~~~~~~~~313../../deps/v8/include/v8-profiler.h:1128:27: warning: 'v8::HeapProfiler::HeapSnapshotOptions::global_object_name_resolver' is deprecated: Use context_name_resolver callback instead. [-Wdeprecated-declarations]314 1128 | HeapSnapshotOptions() {}315 | ^316../../deps/v8/include/v8-profiler.h:1142:25: note: declared here317 1142 | ObjectNameResolver* global_object_name_resolver = nullptr;318 | ^~~~~~~~~~~~~~~~~~~~~~~~~~~319[147/1871] CXX obj/gen/src/node/inspector/protocol/node_base.NodeWorker.o320In file included from ../../src/util.h:29,321 from ../../src/inspector/node_string.h:10,322 from gen/src/node/inspector/protocol/Forward.h:19,323 from gen/src/node/inspector/protocol/Protocol.h:18,324 from gen/src/node/inspector/protocol/NodeWorker.h:10,325 from gen/src/node/inspector/protocol/NodeWorker.cpp:7:326../../deps/v8/include/v8-profiler.h: In constructor 'v8::HeapProfiler::HeapSnapshotOptions::HeapSnapshotOptions()':327../../deps/v8/include/v8-profiler.h:1128:27: warning: 'v8::HeapProfiler::HeapSnapshotOptions::global_object_name_resolver' is deprecated: Use context_name_resolver callback instead. [-Wdeprecated-declarations]328 1128 | HeapSnapshotOptions() {}329 | ^330../../deps/v8/include/v8-profiler.h:1142:25: note: declared here331 1142 | ObjectNameResolver* global_object_name_resolver = nullptr;332 | ^~~~~~~~~~~~~~~~~~~~~~~~~~~333../../deps/v8/include/v8-profiler.h:1128:27: warning: 'v8::HeapProfiler::HeapSnapshotOptions::global_object_name_resolver' is deprecated: Use context_name_resolver callback instead. [-Wdeprecated-declarations]334 1128 | HeapSnapshotOptions() {}335 | ^336../../deps/v8/include/v8-profiler.h:1142:25: note: declared here337 1142 | ObjectNameResolver* global_object_name_resolver = nullptr;338 | ^~~~~~~~~~~~~~~~~~~~~~~~~~~339[148/1871] CXX obj/src/node_base.node_debug.o340[149/1871] CXX obj/gen/src/node/inspector/protocol/node_base.NodeTracing.o341In file included from ../../src/util.h:29,342 from ../../src/inspector/node_string.h:10,343 from gen/src/node/inspector/protocol/Forward.h:19,344 from gen/src/node/inspector/protocol/Protocol.h:18,345 from gen/src/node/inspector/protocol/NodeTracing.h:10,346 from gen/src/node/inspector/protocol/NodeTracing.cpp:7:347../../deps/v8/include/v8-profiler.h: In constructor 'v8::HeapProfiler::HeapSnapshotOptions::HeapSnapshotOptions()':348../../deps/v8/include/v8-profiler.h:1128:27: warning: 'v8::HeapProfiler::HeapSnapshotOptions::global_object_name_resolver' is deprecated: Use context_name_resolver callback instead. [-Wdeprecated-declarations]349 1128 | HeapSnapshotOptions() {}350 | ^351../../deps/v8/include/v8-profiler.h:1142:25: note: declared here352 1142 | ObjectNameResolver* global_object_name_resolver = nullptr;353 | ^~~~~~~~~~~~~~~~~~~~~~~~~~~354../../deps/v8/include/v8-profiler.h:1128:27: warning: 'v8::HeapProfiler::HeapSnapshotOptions::global_object_name_resolver' is deprecated: Use context_name_resolver callback instead. [-Wdeprecated-declarations]355 1128 | HeapSnapshotOptions() {}356 | ^357../../deps/v8/include/v8-profiler.h:1142:25: note: declared here358 1142 | ObjectNameResolver* global_object_name_resolver = nullptr;359 | ^~~~~~~~~~~~~~~~~~~~~~~~~~~360[150/1871] CXX obj/gen/src/node/inspector/protocol/node_base.DOMStorage.o361In file included from ../../src/util.h:29,362 from ../../src/inspector/node_string.h:10,363 from gen/src/node/inspector/protocol/Forward.h:19,364 from gen/src/node/inspector/protocol/Protocol.h:18,365 from gen/src/node/inspector/protocol/DOMStorage.h:10,366 from gen/src/node/inspector/protocol/DOMStorage.cpp:7:367../../deps/v8/include/v8-profiler.h: In constructor 'v8::HeapProfiler::HeapSnapshotOptions::HeapSnapshotOptions()':368../../deps/v8/include/v8-profiler.h:1128:27: warning: 'v8::HeapProfiler::HeapSnapshotOptions::global_object_name_resolver' is deprecated: Use context_name_resolver callback instead. [-Wdeprecated-declarations]369 1128 | HeapSnapshotOptions() {}370 | ^371../../deps/v8/include/v8-profiler.h:1142:25: note: declared here372 1142 | ObjectNameResolver* global_object_name_resolver = nullptr;373 | ^~~~~~~~~~~~~~~~~~~~~~~~~~~374../../deps/v8/include/v8-profiler.h:1128:27: warning: 'v8::HeapProfiler::HeapSnapshotOptions::global_object_name_resolver' is deprecated: Use context_name_resolver callback instead. [-Wdeprecated-declarations]375 1128 | HeapSnapshotOptions() {}376 | ^377../../deps/v8/include/v8-profiler.h:1142:25: note: declared here378 1142 | ObjectNameResolver* global_object_name_resolver = nullptr;379 | ^~~~~~~~~~~~~~~~~~~~~~~~~~~380[151/1871] CXX obj/deps/v8/src/torque/torque_base.types.o381[152/1871] CXX obj/gen/src/node/inspector/protocol/node_base.Network.o382In file included from ../../src/util.h:29,383 from ../../src/inspector/node_string.h:10,384 from gen/src/node/inspector/protocol/Forward.h:19,385 from gen/src/node/inspector/protocol/Protocol.h:18,386 from gen/src/node/inspector/protocol/Network.h:10,387 from gen/src/node/inspector/protocol/Network.cpp:7:388../../deps/v8/include/v8-profiler.h: In constructor 'v8::HeapProfiler::HeapSnapshotOptions::HeapSnapshotOptions()':389../../deps/v8/include/v8-profiler.h:1128:27: warning: 'v8::HeapProfiler::HeapSnapshotOptions::global_object_name_resolver' is deprecated: Use context_name_resolver callback instead. [-Wdeprecated-declarations]390 1128 | HeapSnapshotOptions() {}391 | ^392../../deps/v8/include/v8-profiler.h:1142:25: note: declared here393 1142 | ObjectNameResolver* global_object_name_resolver = nullptr;394 | ^~~~~~~~~~~~~~~~~~~~~~~~~~~395../../deps/v8/include/v8-profiler.h:1128:27: warning: 'v8::HeapProfiler::HeapSnapshotOptions::global_object_name_resolver' is deprecated: Use context_name_resolver callback instead. [-Wdeprecated-declarations]396 1128 | HeapSnapshotOptions() {}397 | ^398../../deps/v8/include/v8-profiler.h:1142:25: note: declared here399 1142 | ObjectNameResolver* global_object_name_resolver = nullptr;400 | ^~~~~~~~~~~~~~~~~~~~~~~~~~~401[153/1871] CXX obj/gen/src/node/inspector/protocol/node_base.Protocol.o402In file included from ../../src/util.h:29,403 from ../../src/inspector/node_string.h:10,404 from gen/src/node/inspector/protocol/Forward.h:19,405 from gen/src/node/inspector/protocol/Protocol.h:18,406 from gen/src/node/inspector/protocol/Protocol.cpp:7:407../../deps/v8/include/v8-profiler.h: In constructor 'v8::HeapProfiler::HeapSnapshotOptions::HeapSnapshotOptions()':408../../deps/v8/include/v8-profiler.h:1128:27: warning: 'v8::HeapProfiler::HeapSnapshotOptions::global_object_name_resolver' is deprecated: Use context_name_resolver callback instead. [-Wdeprecated-declarations]409 1128 | HeapSnapshotOptions() {}410 | ^411../../deps/v8/include/v8-profiler.h:1142:25: note: declared here412 1142 | ObjectNameResolver* global_object_name_resolver = nullptr;413 | ^~~~~~~~~~~~~~~~~~~~~~~~~~~414../../deps/v8/include/v8-profiler.h:1128:27: warning: 'v8::HeapProfiler::HeapSnapshotOptions::global_object_name_resolver' is deprecated: Use context_name_resolver callback instead. [-Wdeprecated-declarations]415 1128 | HeapSnapshotOptions() {}416 | ^417../../deps/v8/include/v8-profiler.h:1142:25: note: declared here418 1142 | ObjectNameResolver* global_object_name_resolver = nullptr;419 | ^~~~~~~~~~~~~~~~~~~~~~~~~~~420[154/1871] CXX obj/src/node_base.debug_utils.o421In file included from ../../src/memory_tracker.h:6,422 from ../../src/base_object.h:29,423 from ../../src/async_wrap.h:27,424 from ../../src/debug_utils.h:6,425 from ../../src/debug_utils-inl.h:6,426 from ../../src/debug_utils.cc:1:427../../deps/v8/include/v8-profiler.h: In constructor 'v8::HeapProfiler::HeapSnapshotOptions::HeapSnapshotOptions()':428../../deps/v8/include/v8-profiler.h:1128:27: warning: 'v8::HeapProfiler::HeapSnapshotOptions::global_object_name_resolver' is deprecated: Use context_name_resolver callback instead. [-Wdeprecated-declarations]429 1128 | HeapSnapshotOptions() {}430 | ^431../../deps/v8/include/v8-profiler.h:1142:25: note: declared here432 1142 | ObjectNameResolver* global_object_name_resolver = nullptr;433 | ^~~~~~~~~~~~~~~~~~~~~~~~~~~434../../deps/v8/include/v8-profiler.h:1128:27: warning: 'v8::HeapProfiler::HeapSnapshotOptions::global_object_name_resolver' is deprecated: Use context_name_resolver callback instead. [-Wdeprecated-declarations]435 1128 | HeapSnapshotOptions() {}436 | ^437../../deps/v8/include/v8-profiler.h:1142:25: note: declared here438 1142 | ObjectNameResolver* global_object_name_resolver = nullptr;439 | ^~~~~~~~~~~~~~~~~~~~~~~~~~~440[155/1871] CXX obj/src/api/node_base.encoding.o441In file included from ../../src/memory_tracker.h:6,442 from ../../src/aliased_buffer.h:7,443 from ../../src/aliased_buffer-inl.h:6,444 from ../../src/env-inl.h:27,445 from ../../src/string_bytes.h:30,446 from ../../src/api/encoding.cc:2:447../../deps/v8/include/v8-profiler.h: In constructor 'v8::HeapProfiler::HeapSnapshotOptions::HeapSnapshotOptions()':448../../deps/v8/include/v8-profiler.h:1128:27: warning: 'v8::HeapProfiler::HeapSnapshotOptions::global_object_name_resolver' is deprecated: Use context_name_resolver callback instead. [-Wdeprecated-declarations]449 1128 | HeapSnapshotOptions() {}450 | ^451../../deps/v8/include/v8-profiler.h:1142:25: note: declared here452 1142 | ObjectNameResolver* global_object_name_resolver = nullptr;453 | ^~~~~~~~~~~~~~~~~~~~~~~~~~~454../../deps/v8/include/v8-profiler.h:1128:27: warning: 'v8::HeapProfiler::HeapSnapshotOptions::global_object_name_resolver' is deprecated: Use context_name_resolver callback instead. [-Wdeprecated-declarations]455 1128 | HeapSnapshotOptions() {}456 | ^457../../deps/v8/include/v8-profiler.h:1142:25: note: declared here458 1142 | ObjectNameResolver* global_object_name_resolver = nullptr;459 | ^~~~~~~~~~~~~~~~~~~~~~~~~~~460[156/1871] CXX obj/src/api/node_base.callback.o461In file included from ../../src/memory_tracker.h:6,462 from ../../src/base_object.h:29,463 from ../../src/async_context_frame.h:6,464 from ../../src/api/callback.cc:1:465../../deps/v8/include/v8-profiler.h: In constructor 'v8::HeapProfiler::HeapSnapshotOptions::HeapSnapshotOptions()':466../../deps/v8/include/v8-profiler.h:1128:27: warning: 'v8::HeapProfiler::HeapSnapshotOptions::global_object_name_resolver' is deprecated: Use context_name_resolver callback instead. [-Wdeprecated-declarations]467 1128 | HeapSnapshotOptions() {}468 | ^469../../deps/v8/include/v8-profiler.h:1142:25: note: declared here470 1142 | ObjectNameResolver* global_object_name_resolver = nullptr;471 | ^~~~~~~~~~~~~~~~~~~~~~~~~~~472../../deps/v8/include/v8-profiler.h:1128:27: warning: 'v8::HeapProfiler::HeapSnapshotOptions::global_object_name_resolver' is deprecated: Use context_name_resolver callback instead. [-Wdeprecated-declarations]473 1128 | HeapSnapshotOptions() {}474 | ^475../../deps/v8/include/v8-profiler.h:1142:25: note: declared here476 1142 | ObjectNameResolver* global_object_name_resolver = nullptr;477 | ^~~~~~~~~~~~~~~~~~~~~~~~~~~478[157/1871] CXX obj/src/api/node_base.hooks.o479In file included from ../../src/memory_tracker.h:6,480 from ../../src/aliased_buffer.h:7,481 from ../../src/aliased_buffer-inl.h:6,482 from ../../src/env-inl.h:27,483 from ../../src/api/hooks.cc:1:484../../deps/v8/include/v8-profiler.h: In constructor 'v8::HeapProfiler::HeapSnapshotOptions::HeapSnapshotOptions()':485../../deps/v8/include/v8-profiler.h:1128:27: warning: 'v8::HeapProfiler::HeapSnapshotOptions::global_object_name_resolver' is deprecated: Use context_name_resolver callback instead. [-Wdeprecated-declarations]486 1128 | HeapSnapshotOptions() {}487 | ^488../../deps/v8/include/v8-profiler.h:1142:25: note: declared here489 1142 | ObjectNameResolver* global_object_name_resolver = nullptr;490 | ^~~~~~~~~~~~~~~~~~~~~~~~~~~491../../deps/v8/include/v8-profiler.h:1128:27: warning: 'v8::HeapProfiler::HeapSnapshotOptions::global_object_name_resolver' is deprecated: Use context_name_resolver callback instead. [-Wdeprecated-declarations]492 1128 | HeapSnapshotOptions() {}493 | ^494../../deps/v8/include/v8-profiler.h:1142:25: note: declared here495 1142 | ObjectNameResolver* global_object_name_resolver = nullptr;496 | ^~~~~~~~~~~~~~~~~~~~~~~~~~~497[158/1871] CXX obj/src/api/node_base.exceptions.o498In file included from ../../src/memory_tracker.h:6,499 from ../../src/aliased_buffer.h:7,500 from ../../src/aliased_buffer-inl.h:6,501 from ../../src/env-inl.h:27,502 from ../../src/api/exceptions.cc:3:503../../deps/v8/include/v8-profiler.h: In constructor 'v8::HeapProfiler::HeapSnapshotOptions::HeapSnapshotOptions()':504../../deps/v8/include/v8-profiler.h:1128:27: warning: 'v8::HeapProfiler::HeapSnapshotOptions::global_object_name_resolver' is deprecated: Use context_name_resolver callback instead. [-Wdeprecated-declarations]505 1128 | HeapSnapshotOptions() {}506 | ^507../../deps/v8/include/v8-profiler.h:1142:25: note: declared here508 1142 | ObjectNameResolver* global_object_name_resolver = nullptr;509 | ^~~~~~~~~~~~~~~~~~~~~~~~~~~510../../deps/v8/include/v8-profiler.h:1128:27: warning: 'v8::HeapProfiler::HeapSnapshotOptions::global_object_name_resolver' is deprecated: Use context_name_resolver callback instead. [-Wdeprecated-declarations]511 1128 | HeapSnapshotOptions() {}512 | ^513../../deps/v8/include/v8-profiler.h:1142:25: note: declared here514 1142 | ObjectNameResolver* global_object_name_resolver = nullptr;515 | ^~~~~~~~~~~~~~~~~~~~~~~~~~~516[159/1871] CXX obj/src/node_base.connection_wrap.o517In file included from ../../src/memory_tracker.h:6,518 from ../../src/aliased_buffer.h:7,519 from ../../src/env.h:27,520 from ../../src/stream_base.h:6,521 from ../../src/stream_wrap.h:27,522 from ../../src/connection_wrap.h:6,523 from ../../src/connection_wrap.cc:1:524../../deps/v8/include/v8-profiler.h: In constructor 'v8::HeapProfiler::HeapSnapshotOptions::HeapSnapshotOptions()':525../../deps/v8/include/v8-profiler.h:1128:27: warning: 'v8::HeapProfiler::HeapSnapshotOptions::global_object_name_resolver' is deprecated: Use context_name_resolver callback instead. [-Wdeprecated-declarations]526 1128 | HeapSnapshotOptions() {}527 | ^528../../deps/v8/include/v8-profiler.h:1142:25: note: declared here529 1142 | ObjectNameResolver* global_object_name_resolver = nullptr;530 | ^~~~~~~~~~~~~~~~~~~~~~~~~~~531../../deps/v8/include/v8-profiler.h:1128:27: warning: 'v8::HeapProfiler::HeapSnapshotOptions::global_object_name_resolver' is deprecated: Use context_name_resolver callback instead. [-Wdeprecated-declarations]532 1128 | HeapSnapshotOptions() {}533 | ^534../../deps/v8/include/v8-profiler.h:1142:25: note: declared here535 1142 | ObjectNameResolver* global_object_name_resolver = nullptr;536 | ^~~~~~~~~~~~~~~~~~~~~~~~~~~537[160/1871] CXX obj/src/api/node_base.async_resource.o538In file included from ../../src/memory_tracker.h:6,539 from ../../src/base_object.h:29,540 from ../../src/async_context_frame.h:6,541 from ../../src/api/async_resource.cc:1:542../../deps/v8/include/v8-profiler.h: In constructor 'v8::HeapProfiler::HeapSnapshotOptions::HeapSnapshotOptions()':543../../deps/v8/include/v8-profiler.h:1128:27: warning: 'v8::HeapProfiler::HeapSnapshotOptions::global_object_name_resolver' is deprecated: Use context_name_resolver callback instead. [-Wdeprecated-declarations]544 1128 | HeapSnapshotOptions() {}545 | ^546../../deps/v8/include/v8-profiler.h:1142:25: note: declared here547 1142 | ObjectNameResolver* global_object_name_resolver = nullptr;548 | ^~~~~~~~~~~~~~~~~~~~~~~~~~~549../../deps/v8/include/v8-profiler.h:1128:27: warning: 'v8::HeapProfiler::HeapSnapshotOptions::global_object_name_resolver' is deprecated: Use context_name_resolver callback instead. [-Wdeprecated-declarations]550 1128 | HeapSnapshotOptions() {}551 | ^552../../deps/v8/include/v8-profiler.h:1142:25: note: declared here553 1142 | ObjectNameResolver* global_object_name_resolver = nullptr;554 | ^~~~~~~~~~~~~~~~~~~~~~~~~~~555[161/1871] CXX obj/src/node_base.handle_wrap.o556In file included from ../../src/memory_tracker.h:6,557 from ../../src/base_object.h:29,558 from ../../src/async_wrap.h:27,559 from ../../src/handle_wrap.h:27,560 from ../../src/handle_wrap.cc:22:561../../deps/v8/include/v8-profiler.h: In constructor 'v8::HeapProfiler::HeapSnapshotOptions::HeapSnapshotOptions()':562../../deps/v8/include/v8-profiler.h:1128:27: warning: 'v8::HeapProfiler::HeapSnapshotOptions::global_object_name_resolver' is deprecated: Use context_name_resolver callback instead. [-Wdeprecated-declarations]563 1128 | HeapSnapshotOptions() {}564 | ^565../../deps/v8/include/v8-profiler.h:1142:25: note: declared here566 1142 | ObjectNameResolver* global_object_name_resolver = nullptr;567 | ^~~~~~~~~~~~~~~~~~~~~~~~~~~568../../deps/v8/include/v8-profiler.h:1128:27: warning: 'v8::HeapProfiler::HeapSnapshotOptions::global_object_name_resolver' is deprecated: Use context_name_resolver callback instead. [-Wdeprecated-declarations]569 1128 | HeapSnapshotOptions() {}570 | ^571../../deps/v8/include/v8-profiler.h:1142:25: note: declared here572 1142 | ObjectNameResolver* global_object_name_resolver = nullptr;573 | ^~~~~~~~~~~~~~~~~~~~~~~~~~~574[162/1871] CXX obj/src/node_base.fs_event_wrap.o575In file included from ../../src/memory_tracker.h:6,576 from ../../src/base_object.h:29,577 from ../../src/async_wrap.h:27,578 from ../../src/async_wrap-inl.h:27,579 from ../../src/fs_event_wrap.cc:22:580../../deps/v8/include/v8-profiler.h: In constructor 'v8::HeapProfiler::HeapSnapshotOptions::HeapSnapshotOptions()':581../../deps/v8/include/v8-profiler.h:1128:27: warning: 'v8::HeapProfiler::HeapSnapshotOptions::global_object_name_resolver' is deprecated: Use context_name_resolver callback instead. [-Wdeprecated-declarations]582 1128 | HeapSnapshotOptions() {}583 | ^584../../deps/v8/include/v8-profiler.h:1142:25: note: declared here585 1142 | ObjectNameResolver* global_object_name_resolver = nullptr;586 | ^~~~~~~~~~~~~~~~~~~~~~~~~~~587../../deps/v8/include/v8-profiler.h:1128:27: warning: 'v8::HeapProfiler::HeapSnapshotOptions::global_object_name_resolver' is deprecated: Use context_name_resolver callback instead. [-Wdeprecated-declarations]588 1128 | HeapSnapshotOptions() {}589 | ^590../../deps/v8/include/v8-profiler.h:1142:25: note: declared here591 1142 | ObjectNameResolver* global_object_name_resolver = nullptr;592 | ^~~~~~~~~~~~~~~~~~~~~~~~~~~593[163/1871] CXX obj/src/api/node_base.embed_helpers.o594In file included from ../../src/memory_tracker.h:6,595 from ../../src/base_object.h:29,596 from ../../src/async_wrap.h:27,597 from ../../src/debug_utils.h:6,598 from ../../src/debug_utils-inl.h:6,599 from ../../src/api/embed_helpers.cc:1:600../../deps/v8/include/v8-profiler.h: In constructor 'v8::HeapProfiler::HeapSnapshotOptions::HeapSnapshotOptions()':601../../deps/v8/include/v8-profiler.h:1128:27: warning: 'v8::HeapProfiler::HeapSnapshotOptions::global_object_name_resolver' is deprecated: Use context_name_resolver callback instead. [-Wdeprecated-declarations]602 1128 | HeapSnapshotOptions() {}603 | ^604../../deps/v8/include/v8-profiler.h:1142:25: note: declared here605 1142 | ObjectNameResolver* global_object_name_resolver = nullptr;606 | ^~~~~~~~~~~~~~~~~~~~~~~~~~~607../../deps/v8/include/v8-profiler.h:1128:27: warning: 'v8::HeapProfiler::HeapSnapshotOptions::global_object_name_resolver' is deprecated: Use context_name_resolver callback instead. [-Wdeprecated-declarations]608 1128 | HeapSnapshotOptions() {}609 | ^610../../deps/v8/include/v8-profiler.h:1142:25: note: declared here611 1142 | ObjectNameResolver* global_object_name_resolver = nullptr;612 | ^~~~~~~~~~~~~~~~~~~~~~~~~~~613[164/1871] CXX obj/src/node_base.async_context_frame.o614In file included from ../../src/memory_tracker.h:6,615 from ../../src/base_object.h:29,616 from ../../src/async_context_frame.h:6,617 from ../../src/async_context_frame.cc:1:618../../deps/v8/include/v8-profiler.h: In constructor 'v8::HeapProfiler::HeapSnapshotOptions::HeapSnapshotOptions()':619../../deps/v8/include/v8-profiler.h:1128:27: warning: 'v8::HeapProfiler::HeapSnapshotOptions::global_object_name_resolver' is deprecated: Use context_name_resolver callback instead. [-Wdeprecated-declarations]620 1128 | HeapSnapshotOptions() {}621 | ^622../../deps/v8/include/v8-profiler.h:1142:25: note: declared here623 1142 | ObjectNameResolver* global_object_name_resolver = nullptr;624 | ^~~~~~~~~~~~~~~~~~~~~~~~~~~625../../deps/v8/include/v8-profiler.h:1128:27: warning: 'v8::HeapProfiler::HeapSnapshotOptions::global_object_name_resolver' is deprecated: Use context_name_resolver callback instead. [-Wdeprecated-declarations]626 1128 | HeapSnapshotOptions() {}627 | ^628../../deps/v8/include/v8-profiler.h:1142:25: note: declared here629 1142 | ObjectNameResolver* global_object_name_resolver = nullptr;630 | ^~~~~~~~~~~~~~~~~~~~~~~~~~~631[165/1871] CXX obj/src/node_base.js_udp_wrap.o632In file included from ../../src/memory_tracker.h:6,633 from ../../src/base_object.h:29,634 from ../../src/async_wrap.h:27,635 from ../../src/handle_wrap.h:27,636 from ../../src/udp_wrap.h:27,637 from ../../src/js_udp_wrap.cc:1:638../../deps/v8/include/v8-profiler.h: In constructor 'v8::HeapProfiler::HeapSnapshotOptions::HeapSnapshotOptions()':639../../deps/v8/include/v8-profiler.h:1128:27: warning: 'v8::HeapProfiler::HeapSnapshotOptions::global_object_name_resolver' is deprecated: Use context_name_resolver callback instead. [-Wdeprecated-declarations]640 1128 | HeapSnapshotOptions() {}641 | ^642../../deps/v8/include/v8-profiler.h:1142:25: note: declared here643 1142 | ObjectNameResolver* global_object_name_resolver = nullptr;644 | ^~~~~~~~~~~~~~~~~~~~~~~~~~~645../../deps/v8/include/v8-profiler.h:1128:27: warning: 'v8::HeapProfiler::HeapSnapshotOptions::global_object_name_resolver' is deprecated: Use context_name_resolver callback instead. [-Wdeprecated-declarations]646 1128 | HeapSnapshotOptions() {}647 | ^648../../deps/v8/include/v8-profiler.h:1142:25: note: declared here649 1142 | ObjectNameResolver* global_object_name_resolver = nullptr;650 | ^~~~~~~~~~~~~~~~~~~~~~~~~~~651[166/1871] CXX obj/src/node_base.connect_wrap.o652In file included from ../../src/memory_tracker.h:6,653 from ../../src/base_object.h:29,654 from ../../src/async_wrap.h:27,655 from ../../src/req_wrap.h:6,656 from ../../src/req_wrap-inl.h:6,657 from ../../src/connect_wrap.h:6,658 from ../../src/connect_wrap.cc:1:659../../deps/v8/include/v8-profiler.h: In constructor 'v8::HeapProfiler::HeapSnapshotOptions::HeapSnapshotOptions()':660../../deps/v8/include/v8-profiler.h:1128:27: warning: 'v8::HeapProfiler::HeapSnapshotOptions::global_object_name_resolver' is deprecated: Use context_name_resolver callback instead. [-Wdeprecated-declarations]661 1128 | HeapSnapshotOptions() {}662 | ^663../../deps/v8/include/v8-profiler.h:1142:25: note: declared here664 1142 | ObjectNameResolver* global_object_name_resolver = nullptr;665 | ^~~~~~~~~~~~~~~~~~~~~~~~~~~666../../deps/v8/include/v8-profiler.h:1128:27: warning: 'v8::HeapProfiler::HeapSnapshotOptions::global_object_name_resolver' is deprecated: Use context_name_resolver callback instead. [-Wdeprecated-declarations]667 1128 | HeapSnapshotOptions() {}668 | ^669../../deps/v8/include/v8-profiler.h:1142:25: note: declared here670 1142 | ObjectNameResolver* global_object_name_resolver = nullptr;671 | ^~~~~~~~~~~~~~~~~~~~~~~~~~~672[167/1871] CXX obj/src/node_base.heap_utils.o673In file included from ../../src/memory_tracker.h:6,674 from ../../src/aliased_buffer.h:7,675 from ../../src/env.h:27,676 from ../../src/node_internals.h:27,677 from ../../src/diagnosticfilename-inl.h:6,678 from ../../src/heap_utils.cc:1:679../../deps/v8/include/v8-profiler.h: In constructor 'v8::HeapProfiler::HeapSnapshotOptions::HeapSnapshotOptions()':680../../deps/v8/include/v8-profiler.h:1128:27: warning: 'v8::HeapProfiler::HeapSnapshotOptions::global_object_name_resolver' is deprecated: Use context_name_resolver callback instead. [-Wdeprecated-declarations]681 1128 | HeapSnapshotOptions() {}682 | ^683../../deps/v8/include/v8-profiler.h:1142:25: note: declared here684 1142 | ObjectNameResolver* global_object_name_resolver = nullptr;685 | ^~~~~~~~~~~~~~~~~~~~~~~~~~~686../../deps/v8/include/v8-profiler.h:1128:27: warning: 'v8::HeapProfiler::HeapSnapshotOptions::global_object_name_resolver' is deprecated: Use context_name_resolver callback instead. [-Wdeprecated-declarations]687 1128 | HeapSnapshotOptions() {}688 | ^689../../deps/v8/include/v8-profiler.h:1142:25: note: declared here690 1142 | ObjectNameResolver* global_object_name_resolver = nullptr;691 | ^~~~~~~~~~~~~~~~~~~~~~~~~~~692[168/1871] CXX obj/src/node_base.js_stream.o693In file included from ../../src/memory_tracker.h:6,694 from ../../src/base_object.h:29,695 from ../../src/async_wrap.h:27,696 from ../../src/js_stream.h:6,697 from ../../src/js_stream.cc:1:698../../deps/v8/include/v8-profiler.h: In constructor 'v8::HeapProfiler::HeapSnapshotOptions::HeapSnapshotOptions()':699../../deps/v8/include/v8-profiler.h:1128:27: warning: 'v8::HeapProfiler::HeapSnapshotOptions::global_object_name_resolver' is deprecated: Use context_name_resolver callback instead. [-Wdeprecated-declarations]700 1128 | HeapSnapshotOptions() {}701 | ^702../../deps/v8/include/v8-profiler.h:1142:25: note: declared here703 1142 | ObjectNameResolver* global_object_name_resolver = nullptr;704 | ^~~~~~~~~~~~~~~~~~~~~~~~~~~705../../deps/v8/include/v8-profiler.h:1128:27: warning: 'v8::HeapProfiler::HeapSnapshotOptions::global_object_name_resolver' is deprecated: Use context_name_resolver callback instead. [-Wdeprecated-declarations]706 1128 | HeapSnapshotOptions() {}707 | ^708../../deps/v8/include/v8-profiler.h:1142:25: note: declared here709 1142 | ObjectNameResolver* global_object_name_resolver = nullptr;710 | ^~~~~~~~~~~~~~~~~~~~~~~~~~~711[169/1871] CXX obj/src/api/node_base.environment.o712In file included from ../../src/memory_tracker.h:6,713 from ../../src/base_object.h:29,714 from ../../src/async_wrap.h:27,715 from ../../src/crypto/crypto_util.h:6,716 from ../../src/api/environment.cc:3:717../../deps/v8/include/v8-profiler.h: In constructor 'v8::HeapProfiler::HeapSnapshotOptions::HeapSnapshotOptions()':718../../deps/v8/include/v8-profiler.h:1128:27: warning: 'v8::HeapProfiler::HeapSnapshotOptions::global_object_name_resolver' is deprecated: Use context_name_resolver callback instead. [-Wdeprecated-declarations]719 1128 | HeapSnapshotOptions() {}720 | ^721../../deps/v8/include/v8-profiler.h:1142:25: note: declared here722 1142 | ObjectNameResolver* global_object_name_resolver = nullptr;723 | ^~~~~~~~~~~~~~~~~~~~~~~~~~~724../../deps/v8/include/v8-profiler.h:1128:27: warning: 'v8::HeapProfiler::HeapSnapshotOptions::global_object_name_resolver' is deprecated: Use context_name_resolver callback instead. [-Wdeprecated-declarations]725 1128 | HeapSnapshotOptions() {}726 | ^727../../deps/v8/include/v8-profiler.h:1142:25: note: declared here728 1142 | ObjectNameResolver* global_object_name_resolver = nullptr;729 | ^~~~~~~~~~~~~~~~~~~~~~~~~~~730[170/1871] CXX obj/src/node_base.base_object.o731In file included from ../../src/memory_tracker.h:6,732 from ../../src/base_object.h:29,733 from ../../src/base_object.cc:1:734../../deps/v8/include/v8-profiler.h: In constructor 'v8::HeapProfiler::HeapSnapshotOptions::HeapSnapshotOptions()':735../../deps/v8/include/v8-profiler.h:1128:27: warning: 'v8::HeapProfiler::HeapSnapshotOptions::global_object_name_resolver' is deprecated: Use context_name_resolver callback instead. [-Wdeprecated-declarations]736 1128 | HeapSnapshotOptions() {}737 | ^738../../deps/v8/include/v8-profiler.h:1142:25: note: declared here739 1142 | ObjectNameResolver* global_object_name_resolver = nullptr;740 | ^~~~~~~~~~~~~~~~~~~~~~~~~~~741../../deps/v8/include/v8-profiler.h:1128:27: warning: 'v8::HeapProfiler::HeapSnapshotOptions::global_object_name_resolver' is deprecated: Use context_name_resolver callback instead. [-Wdeprecated-declarations]742 1128 | HeapSnapshotOptions() {}743 | ^744../../deps/v8/include/v8-profiler.h:1142:25: note: declared here745 1142 | ObjectNameResolver* global_object_name_resolver = nullptr;746 | ^~~~~~~~~~~~~~~~~~~~~~~~~~~747[171/1871] CXX obj/src/node_base.compile_cache.o748In file included from ../../src/memory_tracker.h:6,749 from ../../src/base_object.h:29,750 from ../../src/async_wrap.h:27,751 from ../../src/debug_utils.h:6,752 from ../../src/debug_utils-inl.h:6,753 from ../../src/compile_cache.cc:3:754../../deps/v8/include/v8-profiler.h: In constructor 'v8::HeapProfiler::HeapSnapshotOptions::HeapSnapshotOptions()':755../../deps/v8/include/v8-profiler.h:1128:27: warning: 'v8::HeapProfiler::HeapSnapshotOptions::global_object_name_resolver' is deprecated: Use context_name_resolver callback instead. [-Wdeprecated-declarations]756 1128 | HeapSnapshotOptions() {}757 | ^758../../deps/v8/include/v8-profiler.h:1142:25: note: declared here759 1142 | ObjectNameResolver* global_object_name_resolver = nullptr;760 | ^~~~~~~~~~~~~~~~~~~~~~~~~~~761../../deps/v8/include/v8-profiler.h:1128:27: warning: 'v8::HeapProfiler::HeapSnapshotOptions::global_object_name_resolver' is deprecated: Use context_name_resolver callback instead. [-Wdeprecated-declarations]762 1128 | HeapSnapshotOptions() {}763 | ^764../../deps/v8/include/v8-profiler.h:1142:25: note: declared here765 1142 | ObjectNameResolver* global_object_name_resolver = nullptr;766 | ^~~~~~~~~~~~~~~~~~~~~~~~~~~767[172/1871] CXX obj/src/node_base.async_wrap.o768In file included from ../../src/memory_tracker.h:6,769 from ../../src/base_object.h:29,770 from ../../src/async_wrap.h:27,771 from ../../src/async_wrap.cc:22:772../../deps/v8/include/v8-profiler.h: In constructor 'v8::HeapProfiler::HeapSnapshotOptions::HeapSnapshotOptions()':773../../deps/v8/include/v8-profiler.h:1128:27: warning: 'v8::HeapProfiler::HeapSnapshotOptions::global_object_name_resolver' is deprecated: Use context_name_resolver callback instead. [-Wdeprecated-declarations]774 1128 | HeapSnapshotOptions() {}775 | ^776../../deps/v8/include/v8-profiler.h:1142:25: note: declared here777 1142 | ObjectNameResolver* global_object_name_resolver = nullptr;778 | ^~~~~~~~~~~~~~~~~~~~~~~~~~~779../../deps/v8/include/v8-profiler.h:1128:27: warning: 'v8::HeapProfiler::HeapSnapshotOptions::global_object_name_resolver' is deprecated: Use context_name_resolver callback instead. [-Wdeprecated-declarations]780 1128 | HeapSnapshotOptions() {}781 | ^782../../deps/v8/include/v8-profiler.h:1142:25: note: declared here783 1142 | ObjectNameResolver* global_object_name_resolver = nullptr;784 | ^~~~~~~~~~~~~~~~~~~~~~~~~~~785[173/1871] CXX obj/src/node_base.node_file_utils.o786In file included from ../../src/util.h:29,787 from ../../src/util-inl.h:33,788 from ../../src/node_file_utils.cc:10:789../../deps/v8/include/v8-profiler.h: In constructor 'v8::HeapProfiler::HeapSnapshotOptions::HeapSnapshotOptions()':790../../deps/v8/include/v8-profiler.h:1128:27: warning: 'v8::HeapProfiler::HeapSnapshotOptions::global_object_name_resolver' is deprecated: Use context_name_resolver callback instead. [-Wdeprecated-declarations]791 1128 | HeapSnapshotOptions() {}792 | ^793../../deps/v8/include/v8-profiler.h:1142:25: note: declared here794 1142 | ObjectNameResolver* global_object_name_resolver = nullptr;795 | ^~~~~~~~~~~~~~~~~~~~~~~~~~~796../../deps/v8/include/v8-profiler.h:1128:27: warning: 'v8::HeapProfiler::HeapSnapshotOptions::global_object_name_resolver' is deprecated: Use context_name_resolver callback instead. [-Wdeprecated-declarations]797 1128 | HeapSnapshotOptions() {}798 | ^799../../deps/v8/include/v8-profiler.h:1142:25: note: declared here800 1142 | ObjectNameResolver* global_object_name_resolver = nullptr;801 | ^~~~~~~~~~~~~~~~~~~~~~~~~~~802../../src/node_file_utils.cc: In function 'int node::WriteFileSync(const char*, uv_buf_t*, size_t)':803../../src/node_file_utils.cc:62:32: warning: enumerated and non-enumerated type in conditional expression [-Wextra]804 62 | int err = req.result < 0 ? req.result : UV_EIO;805 | ~~~~~~~~~~~~~~~^~~~~~~~~~~~~~~~~~~~~806[174/1871] CXX obj/src/node_base.encoding_binding.o807In file included from ../../src/memory_tracker.h:6,808 from ../../src/aliased_buffer.h:7,809 from ../../src/encoding_binding.h:7,810 from ../../src/encoding_binding.cc:1:811../../deps/v8/include/v8-profiler.h: In constructor 'v8::HeapProfiler::HeapSnapshotOptions::HeapSnapshotOptions()':812../../deps/v8/include/v8-profiler.h:1128:27: warning: 'v8::HeapProfiler::HeapSnapshotOptions::global_object_name_resolver' is deprecated: Use context_name_resolver callback instead. [-Wdeprecated-declarations]813 1128 | HeapSnapshotOptions() {}814 | ^815../../deps/v8/include/v8-profiler.h:1142:25: note: declared here816 1142 | ObjectNameResolver* global_object_name_resolver = nullptr;817 | ^~~~~~~~~~~~~~~~~~~~~~~~~~~818../../deps/v8/include/v8-profiler.h:1128:27: warning: 'v8::HeapProfiler::HeapSnapshotOptions::global_object_name_resolver' is deprecated: Use context_name_resolver callback instead. [-Wdeprecated-declarations]819 1128 | HeapSnapshotOptions() {}820 | ^821../../deps/v8/include/v8-profiler.h:1142:25: note: declared here822 1142 | ObjectNameResolver* global_object_name_resolver = nullptr;823 | ^~~~~~~~~~~~~~~~~~~~~~~~~~~824[175/1871] CXX obj/src/node_base.node_config.o825In file included from ../../src/memory_tracker.h:6,826 from ../../src/aliased_buffer.h:7,827 from ../../src/aliased_buffer-inl.h:6,828 from ../../src/env-inl.h:27,829 from ../../src/node_config.cc:1:830../../deps/v8/include/v8-profiler.h: In constructor 'v8::HeapProfiler::HeapSnapshotOptions::HeapSnapshotOptions()':831../../deps/v8/include/v8-profiler.h:1128:27: warning: 'v8::HeapProfiler::HeapSnapshotOptions::global_object_name_resolver' is deprecated: Use context_name_resolver callback instead. [-Wdeprecated-declarations]832 1128 | HeapSnapshotOptions() {}833 | ^834../../deps/v8/include/v8-profiler.h:1142:25: note: declared here835 1142 | ObjectNameResolver* global_object_name_resolver = nullptr;836 | ^~~~~~~~~~~~~~~~~~~~~~~~~~~837../../deps/v8/include/v8-profiler.h:1128:27: warning: 'v8::HeapProfiler::HeapSnapshotOptions::global_object_name_resolver' is deprecated: Use context_name_resolver callback instead. [-Wdeprecated-declarations]838 1128 | HeapSnapshotOptions() {}839 | ^840../../deps/v8/include/v8-profiler.h:1142:25: note: declared here841 1142 | ObjectNameResolver* global_object_name_resolver = nullptr;842 | ^~~~~~~~~~~~~~~~~~~~~~~~~~~843[176/1871] CXX obj/src/node_base.node_constants.o844In file included from ../../src/memory_tracker.h:6,845 from ../../src/aliased_buffer.h:7,846 from ../../src/aliased_buffer-inl.h:6,847 from ../../src/env-inl.h:27,848 from ../../src/node_constants.cc:22:849../../deps/v8/include/v8-profiler.h: In constructor 'v8::HeapProfiler::HeapSnapshotOptions::HeapSnapshotOptions()':850../../deps/v8/include/v8-profiler.h:1128:27: warning: 'v8::HeapProfiler::HeapSnapshotOptions::global_object_name_resolver' is deprecated: Use context_name_resolver callback instead. [-Wdeprecated-declarations]851 1128 | HeapSnapshotOptions() {}852 | ^853../../deps/v8/include/v8-profiler.h:1142:25: note: declared here854 1142 | ObjectNameResolver* global_object_name_resolver = nullptr;855 | ^~~~~~~~~~~~~~~~~~~~~~~~~~~856../../deps/v8/include/v8-profiler.h:1128:27: warning: 'v8::HeapProfiler::HeapSnapshotOptions::global_object_name_resolver' is deprecated: Use context_name_resolver callback instead. [-Wdeprecated-declarations]857 1128 | HeapSnapshotOptions() {}858 | ^859../../deps/v8/include/v8-profiler.h:1142:25: note: declared here860 1142 | ObjectNameResolver* global_object_name_resolver = nullptr;861 | ^~~~~~~~~~~~~~~~~~~~~~~~~~~862[177/1871] CXX obj/src/node_base.node_credentials.o863In file included from ../../src/memory_tracker.h:6,864 from ../../src/aliased_buffer.h:7,865 from ../../src/aliased_buffer-inl.h:6,866 from ../../src/env-inl.h:27,867 from ../../src/node_credentials.cc:1:868../../deps/v8/include/v8-profiler.h: In constructor 'v8::HeapProfiler::HeapSnapshotOptions::HeapSnapshotOptions()':869../../deps/v8/include/v8-profiler.h:1128:27: warning: 'v8::HeapProfiler::HeapSnapshotOptions::global_object_name_resolver' is deprecated: Use context_name_resolver callback instead. [-Wdeprecated-declarations]870 1128 | HeapSnapshotOptions() {}871 | ^872../../deps/v8/include/v8-profiler.h:1142:25: note: declared here873 1142 | ObjectNameResolver* global_object_name_resolver = nullptr;874 | ^~~~~~~~~~~~~~~~~~~~~~~~~~~875../../deps/v8/include/v8-profiler.h:1128:27: warning: 'v8::HeapProfiler::HeapSnapshotOptions::global_object_name_resolver' is deprecated: Use context_name_resolver callback instead. [-Wdeprecated-declarations]876 1128 | HeapSnapshotOptions() {}877 | ^878../../deps/v8/include/v8-profiler.h:1142:25: note: declared here879 1142 | ObjectNameResolver* global_object_name_resolver = nullptr;880 | ^~~~~~~~~~~~~~~~~~~~~~~~~~~881[178/1871] CXX obj/src/node_base.node_dotenv.o882In file included from ../../src/util.h:29,883 from ../../src/util-inl.h:33,884 from ../../src/node_dotenv.h:6,885 from ../../src/node_dotenv.cc:1:886../../deps/v8/include/v8-profiler.h: In constructor 'v8::HeapProfiler::HeapSnapshotOptions::HeapSnapshotOptions()':887../../deps/v8/include/v8-profiler.h:1128:27: warning: 'v8::HeapProfiler::HeapSnapshotOptions::global_object_name_resolver' is deprecated: Use context_name_resolver callback instead. [-Wdeprecated-declarations]888 1128 | HeapSnapshotOptions() {}889 | ^890../../deps/v8/include/v8-profiler.h:1142:25: note: declared here891 1142 | ObjectNameResolver* global_object_name_resolver = nullptr;892 | ^~~~~~~~~~~~~~~~~~~~~~~~~~~893../../deps/v8/include/v8-profiler.h:1128:27: warning: 'v8::HeapProfiler::HeapSnapshotOptions::global_object_name_resolver' is deprecated: Use context_name_resolver callback instead. [-Wdeprecated-declarations]894 1128 | HeapSnapshotOptions() {}895 | ^896../../deps/v8/include/v8-profiler.h:1142:25: note: declared here897 1142 | ObjectNameResolver* global_object_name_resolver = nullptr;898 | ^~~~~~~~~~~~~~~~~~~~~~~~~~~899[179/1871] CXX obj/src/node_base.node_api.o900In file included from ../../src/memory_tracker.h:6,901 from ../../src/base_object.h:29,902 from ../../src/async_context_frame.h:6,903 from ../../src/node_api.cc:1:904../../deps/v8/include/v8-profiler.h: In constructor 'v8::HeapProfiler::HeapSnapshotOptions::HeapSnapshotOptions()':905../../deps/v8/include/v8-profiler.h:1128:27: warning: 'v8::HeapProfiler::HeapSnapshotOptions::global_object_name_resolver' is deprecated: Use context_name_resolver callback instead. [-Wdeprecated-declarations]906 1128 | HeapSnapshotOptions() {}907 | ^908../../deps/v8/include/v8-profiler.h:1142:25: note: declared here909 1142 | ObjectNameResolver* global_object_name_resolver = nullptr;910 | ^~~~~~~~~~~~~~~~~~~~~~~~~~~911../../deps/v8/include/v8-profiler.h:1128:27: warning: 'v8::HeapProfiler::HeapSnapshotOptions::global_object_name_resolver' is deprecated: Use context_name_resolver callback instead. [-Wdeprecated-declarations]912 1128 | HeapSnapshotOptions() {}913 | ^914../../deps/v8/include/v8-profiler.h:1142:25: note: declared here915 1142 | ObjectNameResolver* global_object_name_resolver = nullptr;916 | ^~~~~~~~~~~~~~~~~~~~~~~~~~~917[180/1871] CXX obj/src/node_base.js_native_api_v8.o918In file included from ../../src/memory_tracker.h:6,919 from ../../src/aliased_buffer.h:7,920 from ../../src/aliased_buffer-inl.h:6,921 from ../../src/env-inl.h:27,922 from ../../src/js_native_api_v8.cc:7:923../../deps/v8/include/v8-profiler.h: In constructor 'v8::HeapProfiler::HeapSnapshotOptions::HeapSnapshotOptions()':924../../deps/v8/include/v8-profiler.h:1128:27: warning: 'v8::HeapProfiler::HeapSnapshotOptions::global_object_name_resolver' is deprecated: Use context_name_resolver callback instead. [-Wdeprecated-declarations]925 1128 | HeapSnapshotOptions() {}926 | ^927../../deps/v8/include/v8-profiler.h:1142:25: note: declared here928 1142 | ObjectNameResolver* global_object_name_resolver = nullptr;929 | ^~~~~~~~~~~~~~~~~~~~~~~~~~~930../../deps/v8/include/v8-profiler.h:1128:27: warning: 'v8::HeapProfiler::HeapSnapshotOptions::global_object_name_resolver' is deprecated: Use context_name_resolver callback instead. [-Wdeprecated-declarations]931 1128 | HeapSnapshotOptions() {}932 | ^933../../deps/v8/include/v8-profiler.h:1142:25: note: declared here934 1142 | ObjectNameResolver* global_object_name_resolver = nullptr;935 | ^~~~~~~~~~~~~~~~~~~~~~~~~~~936[181/1871] CXX obj/src/node_base.node_binding.o937In file included from ../../src/memory_tracker.h:6,938 from ../../src/aliased_buffer.h:7,939 from ../../src/aliased_buffer-inl.h:6,940 from ../../src/env-inl.h:27,941 from ../../src/node_binding.cc:3:942../../deps/v8/include/v8-profiler.h: In constructor 'v8::HeapProfiler::HeapSnapshotOptions::HeapSnapshotOptions()':943../../deps/v8/include/v8-profiler.h:1128:27: warning: 'v8::HeapProfiler::HeapSnapshotOptions::global_object_name_resolver' is deprecated: Use context_name_resolver callback instead. [-Wdeprecated-declarations]944 1128 | HeapSnapshotOptions() {}945 | ^946../../deps/v8/include/v8-profiler.h:1142:25: note: declared here947 1142 | ObjectNameResolver* global_object_name_resolver = nullptr;948 | ^~~~~~~~~~~~~~~~~~~~~~~~~~~949../../deps/v8/include/v8-profiler.h:1128:27: warning: 'v8::HeapProfiler::HeapSnapshotOptions::global_object_name_resolver' is deprecated: Use context_name_resolver callback instead. [-Wdeprecated-declarations]950 1128 | HeapSnapshotOptions() {}951 | ^952../../deps/v8/include/v8-profiler.h:1142:25: note: declared here953 1142 | ObjectNameResolver* global_object_name_resolver = nullptr;954 | ^~~~~~~~~~~~~~~~~~~~~~~~~~~955[182/1871] CXX obj/src/node_base.node_dir.o956In file included from ../../src/memory_tracker.h:6,957 from ../../src/aliased_buffer.h:7,958 from ../../src/node_file.h:7,959 from ../../src/node_dir.h:6,960 from ../../src/node_dir.cc:1:961../../deps/v8/include/v8-profiler.h: In constructor 'v8::HeapProfiler::HeapSnapshotOptions::HeapSnapshotOptions()':962../../deps/v8/include/v8-profiler.h:1128:27: warning: 'v8::HeapProfiler::HeapSnapshotOptions::global_object_name_resolver' is deprecated: Use context_name_resolver callback instead. [-Wdeprecated-declarations]963 1128 | HeapSnapshotOptions() {}964 | ^965../../deps/v8/include/v8-profiler.h:1142:25: note: declared here966 1142 | ObjectNameResolver* global_object_name_resolver = nullptr;967 | ^~~~~~~~~~~~~~~~~~~~~~~~~~~968../../deps/v8/include/v8-profiler.h:1128:27: warning: 'v8::HeapProfiler::HeapSnapshotOptions::global_object_name_resolver' is deprecated: Use context_name_resolver callback instead. [-Wdeprecated-declarations]969 1128 | HeapSnapshotOptions() {}970 | ^971../../deps/v8/include/v8-profiler.h:1142:25: note: declared here972 1142 | ObjectNameResolver* global_object_name_resolver = nullptr;973 | ^~~~~~~~~~~~~~~~~~~~~~~~~~~974[183/1871] CXX obj/src/node_base.histogram.o975In file included from ../../src/memory_tracker.h:6,976 from ../../src/base_object.h:29,977 from ../../src/histogram.h:7,978 from ../../src/histogram.cc:1:979../../deps/v8/include/v8-profiler.h: In constructor 'v8::HeapProfiler::HeapSnapshotOptions::HeapSnapshotOptions()':980../../deps/v8/include/v8-profiler.h:1128:27: warning: 'v8::HeapProfiler::HeapSnapshotOptions::global_object_name_resolver' is deprecated: Use context_name_resolver callback instead. [-Wdeprecated-declarations]981 1128 | HeapSnapshotOptions() {}982 | ^983../../deps/v8/include/v8-profiler.h:1142:25: note: declared here984 1142 | ObjectNameResolver* global_object_name_resolver = nullptr;985 | ^~~~~~~~~~~~~~~~~~~~~~~~~~~986../../deps/v8/include/v8-profiler.h:1128:27: warning: 'v8::HeapProfiler::HeapSnapshotOptions::global_object_name_resolver' is deprecated: Use context_name_resolver callback instead. [-Wdeprecated-declarations]987 1128 | HeapSnapshotOptions() {}988 | ^989../../deps/v8/include/v8-profiler.h:1142:25: note: declared here990 1142 | ObjectNameResolver* global_object_name_resolver = nullptr;991 | ^~~~~~~~~~~~~~~~~~~~~~~~~~~992[184/1871] CXX obj/src/dataqueue/node_base.queue.o993In file included from ../../src/memory_tracker.h:6,994 from ../../src/base_object.h:29,995 from ../../src/dataqueue/queue.h:5,996 from ../../src/dataqueue/queue.cc:1:997../../deps/v8/include/v8-profiler.h: In constructor 'v8::HeapProfiler::HeapSnapshotOptions::HeapSnapshotOptions()':998../../deps/v8/include/v8-profiler.h:1128:27: warning: 'v8::HeapProfiler::HeapSnapshotOptions::global_object_name_resolver' is deprecated: Use context_name_resolver callback instead. [-Wdeprecated-declarations]999 1128 | HeapSnapshotOptions() {}1000 | ^1001../../deps/v8/include/v8-profiler.h:1142:25: note: declared here1002 1142 | ObjectNameResolver* global_object_name_resolver = nullptr;1003 | ^~~~~~~~~~~~~~~~~~~~~~~~~~~1004../../deps/v8/include/v8-profiler.h:1128:27: warning: 'v8::HeapProfiler::HeapSnapshotOptions::global_object_name_resolver' is deprecated: Use context_name_resolver callback instead. [-Wdeprecated-declarations]1005 1128 | HeapSnapshotOptions() {}1006 | ^1007../../deps/v8/include/v8-profiler.h:1142:25: note: declared here1008 1142 | ObjectNameResolver* global_object_name_resolver = nullptr;1009 | ^~~~~~~~~~~~~~~~~~~~~~~~~~~1010[185/1871] CXX obj/src/node_base.node_env_var.o1011In file included from ../../src/memory_tracker.h:6,1012 from ../../src/base_object.h:29,1013 from ../../src/async_wrap.h:27,1014 from ../../src/debug_utils.h:6,1015 from ../../src/debug_utils-inl.h:6,1016 from ../../src/node_env_var.cc:1:1017../../deps/v8/include/v8-profiler.h: In constructor 'v8::HeapProfiler::HeapSnapshotOptions::HeapSnapshotOptions()':1018../../deps/v8/include/v8-profiler.h:1128:27: warning: 'v8::HeapProfiler::HeapSnapshotOptions::global_object_name_resolver' is deprecated: Use context_name_resolver callback instead. [-Wdeprecated-declarations]1019 1128 | HeapSnapshotOptions() {}1020 | ^1021../../deps/v8/include/v8-profiler.h:1142:25: note: declared here1022 1142 | ObjectNameResolver* global_object_name_resolver = nullptr;1023 | ^~~~~~~~~~~~~~~~~~~~~~~~~~~1024../../deps/v8/include/v8-profiler.h:1128:27: warning: 'v8::HeapProfiler::HeapSnapshotOptions::global_object_name_resolver' is deprecated: Use context_name_resolver callback instead. [-Wdeprecated-declarations]1025 1128 | HeapSnapshotOptions() {}1026 | ^1027../../deps/v8/include/v8-profiler.h:1142:25: note: declared here1028 1142 | ObjectNameResolver* global_object_name_resolver = nullptr;1029 | ^~~~~~~~~~~~~~~~~~~~~~~~~~~1030[186/1871] CXX obj/src/node_base.node_config_file.o1031In file included from ../../src/memory_tracker.h:6,1032 from ../../src/aliased_buffer.h:7,1033 from ../../src/env.h:27,1034 from ../../src/node_internals.h:27,1035 from ../../src/node_config_file.h:12,1036 from ../../src/node_config_file.cc:1:1037../../deps/v8/include/v8-profiler.h: In constructor 'v8::HeapProfiler::HeapSnapshotOptions::HeapSnapshotOptions()':1038../../deps/v8/include/v8-profiler.h:1128:27: warning: 'v8::HeapProfiler::HeapSnapshotOptions::global_object_name_resolver' is deprecated: Use context_name_resolver callback instead. [-Wdeprecated-declarations]1039 1128 | HeapSnapshotOptions() {}1040 | ^1041../../deps/v8/include/v8-profiler.h:1142:25: note: declared here1042 1142 | ObjectNameResolver* global_object_name_resolver = nullptr;1043 | ^~~~~~~~~~~~~~~~~~~~~~~~~~~1044../../deps/v8/include/v8-profiler.h:1128:27: warning: 'v8::HeapProfiler::HeapSnapshotOptions::global_object_name_resolver' is deprecated: Use context_name_resolver callback instead. [-Wdeprecated-declarations]1045 1128 | HeapSnapshotOptions() {}1046 | ^1047../../deps/v8/include/v8-profiler.h:1142:25: note: declared here1048 1142 | ObjectNameResolver* global_object_name_resolver = nullptr;1049 | ^~~~~~~~~~~~~~~~~~~~~~~~~~~1050[187/1871] CXX obj/src/node_base.node_external_reference.o1051In file included from ../../src/memory_tracker.h:6,1052 from ../../src/base_object.h:29,1053 from ../../src/base_object-inl.h:27,1054 from ../../src/node_external_reference.cc:4:1055../../deps/v8/include/v8-profiler.h: In constructor 'v8::HeapProfiler::HeapSnapshotOptions::HeapSnapshotOptions()':1056../../deps/v8/include/v8-profiler.h:1128:27: warning: 'v8::HeapProfiler::HeapSnapshotOptions::global_object_name_resolver' is deprecated: Use context_name_resolver callback instead. [-Wdeprecated-declarations]1057 1128 | HeapSnapshotOptions() {}1058 | ^1059../../deps/v8/include/v8-profiler.h:1142:25: note: declared here1060 1142 | ObjectNameResolver* global_object_name_resolver = nullptr;1061 | ^~~~~~~~~~~~~~~~~~~~~~~~~~~1062../../deps/v8/include/v8-profiler.h:1128:27: warning: 'v8::HeapProfiler::HeapSnapshotOptions::global_object_name_resolver' is deprecated: Use context_name_resolver callback instead. [-Wdeprecated-declarations]1063 1128 | HeapSnapshotOptions() {}1064 | ^1065../../deps/v8/include/v8-profiler.h:1142:25: note: declared here1066 1142 | ObjectNameResolver* global_object_name_resolver = nullptr;1067 | ^~~~~~~~~~~~~~~~~~~~~~~~~~~1068[188/1871] CXX obj/src/node_base.node_cjs_lexer.o1069In file included from ../../src/memory_tracker.h:6,1070 from ../../src/aliased_buffer.h:7,1071 from ../../src/aliased_buffer-inl.h:6,1072 from ../../src/env-inl.h:27,1073 from ../../src/node_cjs_lexer.cc:1:1074../../deps/v8/include/v8-profiler.h: In constructor 'v8::HeapProfiler::HeapSnapshotOptions::HeapSnapshotOptions()':1075../../deps/v8/include/v8-profiler.h:1128:27: warning: 'v8::HeapProfiler::HeapSnapshotOptions::global_object_name_resolver' is deprecated: Use context_name_resolver callback instead. [-Wdeprecated-declarations]1076 1128 | HeapSnapshotOptions() {}1077 | ^1078../../deps/v8/include/v8-profiler.h:1142:25: note: declared here1079 1142 | ObjectNameResolver* global_object_name_resolver = nullptr;1080 | ^~~~~~~~~~~~~~~~~~~~~~~~~~~1081../../deps/v8/include/v8-profiler.h:1128:27: warning: 'v8::HeapProfiler::HeapSnapshotOptions::global_object_name_resolver' is deprecated: Use context_name_resolver callback instead. [-Wdeprecated-declarations]1082 1128 | HeapSnapshotOptions() {}1083 | ^1084../../deps/v8/include/v8-profiler.h:1142:25: note: declared here1085 1142 | ObjectNameResolver* global_object_name_resolver = nullptr;1086 | ^~~~~~~~~~~~~~~~~~~~~~~~~~~1087[189/1871] CXX obj/src/node_base.node_profiling.o1088In file included from ../../src/node_profiling.h:6,1089 from ../../src/node_profiling.cc:1:1090../../deps/v8/include/v8-profiler.h: In constructor 'v8::HeapProfiler::HeapSnapshotOptions::HeapSnapshotOptions()':1091../../deps/v8/include/v8-profiler.h:1128:27: warning: 'v8::HeapProfiler::HeapSnapshotOptions::global_object_name_resolver' is deprecated: Use context_name_resolver callback instead. [-Wdeprecated-declarations]1092 1128 | HeapSnapshotOptions() {}1093 | ^1094../../deps/v8/include/v8-profiler.h:1142:25: note: declared here1095 1142 | ObjectNameResolver* global_object_name_resolver = nullptr;1096 | ^~~~~~~~~~~~~~~~~~~~~~~~~~~1097../../deps/v8/include/v8-profiler.h:1128:27: warning: 'v8::HeapProfiler::HeapSnapshotOptions::global_object_name_resolver' is deprecated: Use context_name_resolver callback instead. [-Wdeprecated-declarations]1098 1128 | HeapSnapshotOptions() {}1099 | ^1100../../deps/v8/include/v8-profiler.h:1142:25: note: declared here1101 1142 | ObjectNameResolver* global_object_name_resolver = nullptr;1102 | ^~~~~~~~~~~~~~~~~~~~~~~~~~~1103[190/1871] CXX obj/src/node_base.node_blob.o1104In file included from ../../src/memory_tracker.h:6,1105 from ../../src/base_object.h:29,1106 from ../../src/async_wrap.h:27,1107 from ../../src/node_blob.h:8,1108 from ../../src/node_blob.cc:1:1109../../deps/v8/include/v8-profiler.h: In constructor 'v8::HeapProfiler::HeapSnapshotOptions::HeapSnapshotOptions()':1110../../deps/v8/include/v8-profiler.h:1128:27: warning: 'v8::HeapProfiler::HeapSnapshotOptions::global_object_name_resolver' is deprecated: Use context_name_resolver callback instead. [-Wdeprecated-declarations]1111 1128 | HeapSnapshotOptions() {}1112 | ^1113../../deps/v8/include/v8-profiler.h:1142:25: note: declared here1114 1142 | ObjectNameResolver* global_object_name_resolver = nullptr;1115 | ^~~~~~~~~~~~~~~~~~~~~~~~~~~1116../../deps/v8/include/v8-profiler.h:1128:27: warning: 'v8::HeapProfiler::HeapSnapshotOptions::global_object_name_resolver' is deprecated: Use context_name_resolver callback instead. [-Wdeprecated-declarations]1117 1128 | HeapSnapshotOptions() {}1118 | ^1119../../deps/v8/include/v8-profiler.h:1142:25: note: declared here1120 1142 | ObjectNameResolver* global_object_name_resolver = nullptr;1121 | ^~~~~~~~~~~~~~~~~~~~~~~~~~~1122[191/1871] CXX obj/src/node_base.node.o1123In file included from ../../src/memory_tracker.h:6,1124 from ../../src/aliased_buffer.h:7,1125 from ../../src/env.h:27,1126 from ../../src/node_internals.h:27,1127 from ../../src/node_config_file.h:12,1128 from ../../src/node.cc:23:1129../../deps/v8/include/v8-profiler.h: In constructor 'v8::HeapProfiler::HeapSnapshotOptions::HeapSnapshotOptions()':1130../../deps/v8/include/v8-profiler.h:1128:27: warning: 'v8::HeapProfiler::HeapSnapshotOptions::global_object_name_resolver' is deprecated: Use context_name_resolver callback instead. [-Wdeprecated-declarations]1131 1128 | HeapSnapshotOptions() {}1132 | ^1133../../deps/v8/include/v8-profiler.h:1142:25: note: declared here1134 1142 | ObjectNameResolver* global_object_name_resolver = nullptr;1135 | ^~~~~~~~~~~~~~~~~~~~~~~~~~~1136../../deps/v8/include/v8-profiler.h:1128:27: warning: 'v8::HeapProfiler::HeapSnapshotOptions::global_object_name_resolver' is deprecated: Use context_name_resolver callback instead. [-Wdeprecated-declarations]1137 1128 | HeapSnapshotOptions() {}1138 | ^1139../../deps/v8/include/v8-profiler.h:1142:25: note: declared here1140 1142 | ObjectNameResolver* global_object_name_resolver = nullptr;1141 | ^~~~~~~~~~~~~~~~~~~~~~~~~~~1142[192/1871] CXX obj/src/node_base.node_errors.o1143In file included from ../../src/memory_tracker.h:6,1144 from ../../src/base_object.h:29,1145 from ../../src/async_wrap.h:27,1146 from ../../src/debug_utils.h:6,1147 from ../../src/debug_utils-inl.h:6,1148 from ../../src/node_errors.cc:6:1149../../deps/v8/include/v8-profiler.h: In constructor 'v8::HeapProfiler::HeapSnapshotOptions::HeapSnapshotOptions()':1150../../deps/v8/include/v8-profiler.h:1128:27: warning: 'v8::HeapProfiler::HeapSnapshotOptions::global_object_name_resolver' is deprecated: Use context_name_resolver callback instead. [-Wdeprecated-declarations]1151 1128 | HeapSnapshotOptions() {}1152 | ^1153../../deps/v8/include/v8-profiler.h:1142:25: note: declared here1154 1142 | ObjectNameResolver* global_object_name_resolver = nullptr;1155 | ^~~~~~~~~~~~~~~~~~~~~~~~~~~1156../../deps/v8/include/v8-profiler.h:1128:27: warning: 'v8::HeapProfiler::HeapSnapshotOptions::global_object_name_resolver' is deprecated: Use context_name_resolver callback instead. [-Wdeprecated-declarations]1157 1128 | HeapSnapshotOptions() {}1158 | ^1159../../deps/v8/include/v8-profiler.h:1142:25: note: declared here1160 1142 | ObjectNameResolver* global_object_name_resolver = nullptr;1161 | ^~~~~~~~~~~~~~~~~~~~~~~~~~~1162[193/1871] CXX obj/src/node_base.module_wrap.o1163In file included from ../../src/memory_tracker.h:6,1164 from ../../src/base_object.h:29,1165 from ../../src/module_wrap.h:10,1166 from ../../src/module_wrap.cc:1:1167../../deps/v8/include/v8-profiler.h: In constructor 'v8::HeapProfiler::HeapSnapshotOptions::HeapSnapshotOptions()':1168../../deps/v8/include/v8-profiler.h:1128:27: warning: 'v8::HeapProfiler::HeapSnapshotOptions::global_object_name_resolver' is deprecated: Use context_name_resolver callback instead. [-Wdeprecated-declarations]1169 1128 | HeapSnapshotOptions() {}1170 | ^1171../../deps/v8/include/v8-profiler.h:1142:25: note: declared here1172 1142 | ObjectNameResolver* global_object_name_resolver = nullptr;1173 | ^~~~~~~~~~~~~~~~~~~~~~~~~~~1174../../deps/v8/include/v8-profiler.h:1128:27: warning: 'v8::HeapProfiler::HeapSnapshotOptions::global_object_name_resolver' is deprecated: Use context_name_resolver callback instead. [-Wdeprecated-declarations]1175 1128 | HeapSnapshotOptions() {}1176 | ^1177../../deps/v8/include/v8-profiler.h:1142:25: note: declared here1178 1142 | ObjectNameResolver* global_object_name_resolver = nullptr;1179 | ^~~~~~~~~~~~~~~~~~~~~~~~~~~1180[194/1871] CXX obj/src/node_base.node_buffer.o1181In file included from ../../src/memory_tracker.h:6,1182 from ../../src/base_object.h:29,1183 from ../../src/async_wrap.h:27,1184 from ../../src/node_blob.h:8,1185 from ../../src/node_buffer.cc:24:1186../../deps/v8/include/v8-profiler.h: In constructor 'v8::HeapProfiler::HeapSnapshotOptions::HeapSnapshotOptions()':1187../../deps/v8/include/v8-profiler.h:1128:27: warning: 'v8::HeapProfiler::HeapSnapshotOptions::global_object_name_resolver' is deprecated: Use context_name_resolver callback instead. [-Wdeprecated-declarations]1188 1128 | HeapSnapshotOptions() {}1189 | ^1190../../deps/v8/include/v8-profiler.h:1142:25: note: declared here1191 1142 | ObjectNameResolver* global_object_name_resolver = nullptr;1192 | ^~~~~~~~~~~~~~~~~~~~~~~~~~~1193../../deps/v8/include/v8-profiler.h:1128:27: warning: 'v8::HeapProfiler::HeapSnapshotOptions::global_object_name_resolver' is deprecated: Use context_name_resolver callback instead. [-Wdeprecated-declarations]1194 1128 | HeapSnapshotOptions() {}1195 | ^1196../../deps/v8/include/v8-profiler.h:1142:25: note: declared here1197 1142 | ObjectNameResolver* global_object_name_resolver = nullptr;1198 | ^~~~~~~~~~~~~~~~~~~~~~~~~~~1199[195/1871] CXX obj/src/node_base.node_builtins.o1200In file included from ../../src/util.h:29,1201 from ../../src/node_mutex.h:6,1202 from ../../src/node_builtins.h:16,1203 from ../../src/node_builtins.cc:1:1204../../deps/v8/include/v8-profiler.h: In constructor 'v8::HeapProfiler::HeapSnapshotOptions::HeapSnapshotOptions()':1205../../deps/v8/include/v8-profiler.h:1128:27: warning: 'v8::HeapProfiler::HeapSnapshotOptions::global_object_name_resolver' is deprecated: Use context_name_resolver callback instead. [-Wdeprecated-declarations]1206 1128 | HeapSnapshotOptions() {}1207 | ^1208../../deps/v8/include/v8-profiler.h:1142:25: note: declared here1209 1142 | ObjectNameResolver* global_object_name_resolver = nullptr;1210 | ^~~~~~~~~~~~~~~~~~~~~~~~~~~1211../../deps/v8/include/v8-profiler.h:1128:27: warning: 'v8::HeapProfiler::HeapSnapshotOptions::global_object_name_resolver' is deprecated: Use context_name_resolver callback instead. [-Wdeprecated-declarations]1212 1128 | HeapSnapshotOptions() {}1213 | ^1214../../deps/v8/include/v8-profiler.h:1142:25: note: declared here1215 1142 | ObjectNameResolver* global_object_name_resolver = nullptr;1216 | ^~~~~~~~~~~~~~~~~~~~~~~~~~~1217[196/1871] CXX obj/src/node_base.node_contextify.o1218In file included from ../../src/memory_tracker.h:6,1219 from ../../src/base_object.h:29,1220 from ../../src/base_object-inl.h:27,1221 from ../../src/node_contextify.h:6,1222 from ../../src/node_contextify.cc:22:1223../../deps/v8/include/v8-profiler.h: In constructor 'v8::HeapProfiler::HeapSnapshotOptions::HeapSnapshotOptions()':1224../../deps/v8/include/v8-profiler.h:1128:27: warning: 'v8::HeapProfiler::HeapSnapshotOptions::global_object_name_resolver' is deprecated: Use context_name_resolver callback instead. [-Wdeprecated-declarations]1225 1128 | HeapSnapshotOptions() {}1226 | ^1227../../deps/v8/include/v8-profiler.h:1142:25: note: declared here1228 1142 | ObjectNameResolver* global_object_name_resolver = nullptr;1229 | ^~~~~~~~~~~~~~~~~~~~~~~~~~~1230../../deps/v8/include/v8-profiler.h:1128:27: warning: 'v8::HeapProfiler::HeapSnapshotOptions::global_object_name_resolver' is deprecated: Use context_name_resolver callback instead. [-Wdeprecated-declarations]1231 1128 | HeapSnapshotOptions() {}1232 | ^1233../../deps/v8/include/v8-profiler.h:1142:25: note: declared here1234 1142 | ObjectNameResolver* global_object_name_resolver = nullptr;1235 | ^~~~~~~~~~~~~~~~~~~~~~~~~~~1236[197/1871] CXX obj/gen/node_base.node_javascript.o1237In file included from ../../src/memory_tracker.h:6,1238 from ../../src/aliased_buffer.h:7,1239 from ../../src/aliased_buffer-inl.h:6,1240 from ../../src/env-inl.h:27,1241 from gen/node_javascript.cc:2:1242../../deps/v8/include/v8-profiler.h: In constructor 'v8::HeapProfiler::HeapSnapshotOptions::HeapSnapshotOptions()':1243../../deps/v8/include/v8-profiler.h:1128:27: warning: 'v8::HeapProfiler::HeapSnapshotOptions::global_object_name_resolver' is deprecated: Use context_name_resolver callback instead. [-Wdeprecated-declarations]1244 1128 | HeapSnapshotOptions() {}1245 | ^1246../../deps/v8/include/v8-profiler.h:1142:25: note: declared here1247 1142 | ObjectNameResolver* global_object_name_resolver = nullptr;1248 | ^~~~~~~~~~~~~~~~~~~~~~~~~~~1249../../deps/v8/include/v8-profiler.h:1128:27: warning: 'v8::HeapProfiler::HeapSnapshotOptions::global_object_name_resolver' is deprecated: Use context_name_resolver callback instead. [-Wdeprecated-declarations]1250 1128 | HeapSnapshotOptions() {}1251 | ^1252../../deps/v8/include/v8-profiler.h:1142:25: note: declared here1253 1142 | ObjectNameResolver* global_object_name_resolver = nullptr;1254 | ^~~~~~~~~~~~~~~~~~~~~~~~~~~1255[198/1871] CXX obj/src/node_base.node_ipc_serdes.o1256In file included from ../../src/memory_tracker.h:6,1257 from ../../src/aliased_buffer.h:7,1258 from ../../src/aliased_buffer-inl.h:6,1259 from ../../src/env-inl.h:27,1260 from ../../src/node_ipc_serdes.cc:1:1261../../deps/v8/include/v8-profiler.h: In constructor 'v8::HeapProfiler::HeapSnapshotOptions::HeapSnapshotOptions()':1262../../deps/v8/include/v8-profiler.h:1128:27: warning: 'v8::HeapProfiler::HeapSnapshotOptions::global_object_name_resolver' is deprecated: Use context_name_resolver callback instead. [-Wdeprecated-declarations]1263 1128 | HeapSnapshotOptions() {}1264 | ^1265../../deps/v8/include/v8-profiler.h:1142:25: note: declared here1266 1142 | ObjectNameResolver* global_object_name_resolver = nullptr;1267 | ^~~~~~~~~~~~~~~~~~~~~~~~~~~1268../../deps/v8/include/v8-profiler.h:1128:27: warning: 'v8::HeapProfiler::HeapSnapshotOptions::global_object_name_resolver' is deprecated: Use context_name_resolver callback instead. [-Wdeprecated-declarations]1269 1128 | HeapSnapshotOptions() {}1270 | ^1271../../deps/v8/include/v8-profiler.h:1142:25: note: declared here1272 1142 | ObjectNameResolver* global_object_name_resolver = nullptr;1273 | ^~~~~~~~~~~~~~~~~~~~~~~~~~~1274[199/1871] CXX obj/src/node_base.node_http_parser.o1275In file included from ../../src/util.h:29,1276 from ../../src/node_http_parser.cc:24:1277../../deps/v8/include/v8-profiler.h: In constructor 'v8::HeapProfiler::HeapSnapshotOptions::HeapSnapshotOptions()':1278../../deps/v8/include/v8-profiler.h:1128:27: warning: 'v8::HeapProfiler::HeapSnapshotOptions::global_object_name_resolver' is deprecated: Use context_name_resolver callback instead. [-Wdeprecated-declarations]1279 1128 | HeapSnapshotOptions() {}1280 | ^1281../../deps/v8/include/v8-profiler.h:1142:25: note: declared here1282 1142 | ObjectNameResolver* global_object_name_resolver = nullptr;1283 | ^~~~~~~~~~~~~~~~~~~~~~~~~~~1284../../deps/v8/include/v8-profiler.h:1128:27: warning: 'v8::HeapProfiler::HeapSnapshotOptions::global_object_name_resolver' is deprecated: Use context_name_resolver callback instead. [-Wdeprecated-declarations]1285 1128 | HeapSnapshotOptions() {}1286 | ^1287../../deps/v8/include/v8-profiler.h:1142:25: note: declared here1288 1142 | ObjectNameResolver* global_object_name_resolver = nullptr;1289 | ^~~~~~~~~~~~~~~~~~~~~~~~~~~1290[200/1871] CXX obj/src/node_base.node_metadata.o1291In file included from ../../src/util.h:29,1292 from ../../src/node_metadata.cc:22:1293../../deps/v8/include/v8-profiler.h: In constructor 'v8::HeapProfiler::HeapSnapshotOptions::HeapSnapshotOptions()':1294../../deps/v8/include/v8-profiler.h:1128:27: warning: 'v8::HeapProfiler::HeapSnapshotOptions::global_object_name_resolver' is deprecated: Use context_name_resolver callback instead. [-Wdeprecated-declarations]1295 1128 | HeapSnapshotOptions() {}1296 | ^1297../../deps/v8/include/v8-profiler.h:1142:25: note: declared here1298 1142 | ObjectNameResolver* global_object_name_resolver = nullptr;1299 | ^~~~~~~~~~~~~~~~~~~~~~~~~~~1300../../deps/v8/include/v8-profiler.h:1128:27: warning: 'v8::HeapProfiler::HeapSnapshotOptions::global_object_name_resolver' is deprecated: Use context_name_resolver callback instead. [-Wdeprecated-declarations]1301 1128 | HeapSnapshotOptions() {}1302 | ^1303../../deps/v8/include/v8-profiler.h:1142:25: note: declared here1304 1142 | ObjectNameResolver* global_object_name_resolver = nullptr;1305 | ^~~~~~~~~~~~~~~~~~~~~~~~~~~1306[201/1871] CXX obj/src/node_base.node_i18n.o1307In file included from ../../src/memory_tracker.h:6,1308 from ../../src/base_object.h:29,1309 from ../../src/node_i18n.h:29,1310 from ../../src/node_i18n.cc:43:1311../../deps/v8/include/v8-profiler.h: In constructor 'v8::HeapProfiler::HeapSnapshotOptions::HeapSnapshotOptions()':1312../../deps/v8/include/v8-profiler.h:1128:27: warning: 'v8::HeapProfiler::HeapSnapshotOptions::global_object_name_resolver' is deprecated: Use context_name_resolver callback instead. [-Wdeprecated-declarations]1313 1128 | HeapSnapshotOptions() {}1314 | ^1315../../deps/v8/include/v8-profiler.h:1142:25: note: declared here1316 1142 | ObjectNameResolver* global_object_name_resolver = nullptr;1317 | ^~~~~~~~~~~~~~~~~~~~~~~~~~~1318../../deps/v8/include/v8-profiler.h:1128:27: warning: 'v8::HeapProfiler::HeapSnapshotOptions::global_object_name_resolver' is deprecated: Use context_name_resolver callback instead. [-Wdeprecated-declarations]1319 1128 | HeapSnapshotOptions() {}1320 | ^1321../../deps/v8/include/v8-profiler.h:1142:25: note: declared here1322 1142 | ObjectNameResolver* global_object_name_resolver = nullptr;1323 | ^~~~~~~~~~~~~~~~~~~~~~~~~~~1324[202/1871] CXX obj/src/node_base.node_os.o1325In file included from ../../src/memory_tracker.h:6,1326 from ../../src/aliased_buffer.h:7,1327 from ../../src/aliased_buffer-inl.h:6,1328 from ../../src/env-inl.h:27,1329 from ../../src/node_os.cc:22:1330../../deps/v8/include/v8-profiler.h: In constructor 'v8::HeapProfiler::HeapSnapshotOptions::HeapSnapshotOptions()':1331../../deps/v8/include/v8-profiler.h:1128:27: warning: 'v8::HeapProfiler::HeapSnapshotOptions::global_object_name_resolver' is deprecated: Use context_name_resolver callback instead. [-Wdeprecated-declarations]1332 1128 | HeapSnapshotOptions() {}1333 | ^1334../../deps/v8/include/v8-profiler.h:1142:25: note: declared here1335 1142 | ObjectNameResolver* global_object_name_resolver = nullptr;1336 | ^~~~~~~~~~~~~~~~~~~~~~~~~~~1337../../deps/v8/include/v8-profiler.h:1128:27: warning: 'v8::HeapProfiler::HeapSnapshotOptions::global_object_name_resolver' is deprecated: Use context_name_resolver callback instead. [-Wdeprecated-declarations]1338 1128 | HeapSnapshotOptions() {}1339 | ^1340../../deps/v8/include/v8-profiler.h:1142:25: note: declared here1341 1142 | ObjectNameResolver* global_object_name_resolver = nullptr;1342 | ^~~~~~~~~~~~~~~~~~~~~~~~~~~1343[203/1871] CXX obj/src/node_base.node_diagnostics_channel.o1344In file included from ../../src/memory_tracker.h:6,1345 from ../../src/aliased_buffer.h:7,1346 from ../../src/node_diagnostics_channel.h:11,1347 from ../../src/node_diagnostics_channel.cc:1:1348../../deps/v8/include/v8-profiler.h: In constructor 'v8::HeapProfiler::HeapSnapshotOptions::HeapSnapshotOptions()':1349../../deps/v8/include/v8-profiler.h:1128:27: warning: 'v8::HeapProfiler::HeapSnapshotOptions::global_object_name_resolver' is deprecated: Use context_name_resolver callback instead. [-Wdeprecated-declarations]1350 1128 | HeapSnapshotOptions() {}1351 | ^1352../../deps/v8/include/v8-profiler.h:1142:25: note: declared here1353 1142 | ObjectNameResolver* global_object_name_resolver = nullptr;1354 | ^~~~~~~~~~~~~~~~~~~~~~~~~~~1355../../deps/v8/include/v8-profiler.h:1128:27: warning: 'v8::HeapProfiler::HeapSnapshotOptions::global_object_name_resolver' is deprecated: Use context_name_resolver callback instead. [-Wdeprecated-declarations]1356 1128 | HeapSnapshotOptions() {}1357 | ^1358../../deps/v8/include/v8-profiler.h:1142:25: note: declared here1359 1142 | ObjectNameResolver* global_object_name_resolver = nullptr;1360 | ^~~~~~~~~~~~~~~~~~~~~~~~~~~1361[204/1871] CXX obj/src/node_base.node_perf.o1362In file included from ../../src/memory_tracker.h:6,1363 from ../../src/base_object.h:29,1364 from ../../src/base_object-inl.h:27,1365 from ../../src/node_perf.h:6,1366 from ../../src/node_perf.cc:1:1367../../deps/v8/include/v8-profiler.h: In constructor 'v8::HeapProfiler::HeapSnapshotOptions::HeapSnapshotOptions()':1368../../deps/v8/include/v8-profiler.h:1128:27: warning: 'v8::HeapProfiler::HeapSnapshotOptions::global_object_name_resolver' is deprecated: Use context_name_resolver callback instead. [-Wdeprecated-declarations]1369 1128 | HeapSnapshotOptions() {}1370 | ^1371../../deps/v8/include/v8-profiler.h:1142:25: note: declared here1372 1142 | ObjectNameResolver* global_object_name_resolver = nullptr;1373 | ^~~~~~~~~~~~~~~~~~~~~~~~~~~1374../../deps/v8/include/v8-profiler.h:1128:27: warning: 'v8::HeapProfiler::HeapSnapshotOptions::global_object_name_resolver' is deprecated: Use context_name_resolver callback instead. [-Wdeprecated-declarations]1375 1128 | HeapSnapshotOptions() {}1376 | ^1377../../deps/v8/include/v8-profiler.h:1142:25: note: declared here1378 1142 | ObjectNameResolver* global_object_name_resolver = nullptr;1379 | ^~~~~~~~~~~~~~~~~~~~~~~~~~~1380[205/1871] CXX obj/src/node_base.cares_wrap.o1381In file included from ../../src/memory_tracker.h:6,1382 from ../../src/base_object.h:29,1383 from ../../src/async_wrap.h:27,1384 from ../../src/cares_wrap.h:8,1385 from ../../src/cares_wrap.cc:22:1386../../deps/v8/include/v8-profiler.h: In constructor 'v8::HeapProfiler::HeapSnapshotOptions::HeapSnapshotOptions()':1387../../deps/v8/include/v8-profiler.h:1128:27: warning: 'v8::HeapProfiler::HeapSnapshotOptions::global_object_name_resolver' is deprecated: Use context_name_resolver callback instead. [-Wdeprecated-declarations]1388 1128 | HeapSnapshotOptions() {}1389 | ^1390../../deps/v8/include/v8-profiler.h:1142:25: note: declared here1391 1142 | ObjectNameResolver* global_object_name_resolver = nullptr;1392 | ^~~~~~~~~~~~~~~~~~~~~~~~~~~1393../../deps/v8/include/v8-profiler.h:1128:27: warning: 'v8::HeapProfiler::HeapSnapshotOptions::global_object_name_resolver' is deprecated: Use context_name_resolver callback instead. [-Wdeprecated-declarations]1394 1128 | HeapSnapshotOptions() {}1395 | ^1396../../deps/v8/include/v8-profiler.h:1142:25: note: declared here1397 1142 | ObjectNameResolver* global_object_name_resolver = nullptr;1398 | ^~~~~~~~~~~~~~~~~~~~~~~~~~~1399../../src/cares_wrap.cc: In function 'v8::Maybe<int> node::cares_wrap::{anonymous}::ParseGeneralReply(node::Environment*, const unsigned char*, int, int*, v8::Local<v8::Array>, void*, int*)':1400../../src/cares_wrap.cc:244:34: warning: 'int ares_parse_a_reply(const unsigned char*, int, hostent**, ares_addrttl*, int*)' is deprecated: Use ares_dns_parse instead [-Wdeprecated-declarations]1401 244 | status = ares_parse_a_reply(buf,1402 | ~~~~~~~~~~~~~~~~~~^~~~~1403 245 | len,1404 | ~~~~1405 246 | &host,1406 | ~~~~~~1407 247 | static_cast<ares_addrttl*>(addrttls),1408 | ~~~~~~~~~~~~~~~~~~~~~~~~~~~~~~~~~~~~~1409 248 | naddrttls);1410 | ~~~~~~~~~~1411In file included from ../../src/cares_wrap.h:17:1412/nix/store/j239p458yixap89j6wpfib9yjypd3ii5-c-ares-1.34.8-dev/include/ares.h:1106:55: note: declared here1413 1106 | CARES_EXTERN CARES_DEPRECATED_FOR(ares_dns_parse) int ares_parse_a_reply(1414 | ^~~~~~~~~~~~~~~~~~1415../../src/cares_wrap.cc:251:37: warning: 'int ares_parse_aaaa_reply(const unsigned char*, int, hostent**, ares_addr6ttl*, int*)' is deprecated: Use ares_dns_parse instead [-Wdeprecated-declarations]1416 251 | status = ares_parse_aaaa_reply(buf,1417 | ~~~~~~~~~~~~~~~~~~~~~^~~~~1418 252 | len,1419 | ~~~~1420 253 | &host,1421 | ~~~~~~1422 254 | static_cast<ares_addr6ttl*>(addrttls),1423 | ~~~~~~~~~~~~~~~~~~~~~~~~~~~~~~~~~~~~~~1424 255 | naddrttls);1425 | ~~~~~~~~~~1426/nix/store/j239p458yixap89j6wpfib9yjypd3ii5-c-ares-1.34.8-dev/include/ares.h:1110:55: note: declared here1427 1110 | CARES_EXTERN CARES_DEPRECATED_FOR(ares_dns_parse) int ares_parse_aaaa_reply(1428 | ^~~~~~~~~~~~~~~~~~~~~1429../../src/cares_wrap.cc:258:35: warning: 'int ares_parse_ns_reply(const unsigned char*, int, hostent**)' is deprecated: Use ares_dns_parse instead [-Wdeprecated-declarations]1430 258 | status = ares_parse_ns_reply(buf, len, &host);1431 | ~~~~~~~~~~~~~~~~~~~^~~~~~~~~~~~~~~~~1432/nix/store/j239p458yixap89j6wpfib9yjypd3ii5-c-ares-1.34.8-dev/include/ares.h:1121:55: note: declared here1433 1121 | CARES_EXTERN CARES_DEPRECATED_FOR(ares_dns_parse) int ares_parse_ns_reply(1434 | ^~~~~~~~~~~~~~~~~~~1435../../src/cares_wrap.cc:261:36: warning: 'int ares_parse_ptr_reply(const unsigned char*, int, const void*, int, int, hostent**)' is deprecated: Use ares_dns_parse instead [-Wdeprecated-declarations]1436 261 | status = ares_parse_ptr_reply(buf, len, nullptr, 0, AF_INET, &host);1437 | ~~~~~~~~~~~~~~~~~~~~^~~~~~~~~~~~~~~~~~~~~~~~~~~~~~~~~~~~~~1438/nix/store/j239p458yixap89j6wpfib9yjypd3ii5-c-ares-1.34.8-dev/include/ares.h:1117:55: note: declared here1439 1117 | CARES_EXTERN CARES_DEPRECATED_FOR(ares_dns_parse) int ares_parse_ptr_reply(1440 | ^~~~~~~~~~~~~~~~~~~~1441../../src/cares_wrap.cc: In function 'v8::Maybe<int> node::cares_wrap::{anonymous}::ParseMxReply(node::Environment*, const unsigned char*, int, v8::Local<v8::Array>, bool)':1442../../src/cares_wrap.cc:337:35: warning: 'int ares_parse_mx_reply(const unsigned char*, int, ares_mx_reply**)' is deprecated: Use ares_dns_parse instead [-Wdeprecated-declarations]1443 337 | int status = ares_parse_mx_reply(buf, len, &mx_start);1444 | ~~~~~~~~~~~~~~~~~~~^~~~~~~~~~~~~~~~~~~~~1445/nix/store/j239p458yixap89j6wpfib9yjypd3ii5-c-ares-1.34.8-dev/include/ares.h:1127:55: note: declared here1446 1127 | CARES_EXTERN CARES_DEPRECATED_FOR(ares_dns_parse) int ares_parse_mx_reply(1447 | ^~~~~~~~~~~~~~~~~~~1448../../src/cares_wrap.cc: In function 'v8::Maybe<int> node::cares_wrap::{anonymous}::ParseCaaReply(node::Environment*, const unsigned char*, int, v8::Local<v8::Array>, bool)':1449../../src/cares_wrap.cc:383:36: warning: 'int ares_parse_caa_reply(const unsigned char*, int, ares_caa_reply**)' is deprecated: Use ares_dns_parse instead [-Wdeprecated-declarations]1450 383 | int status = ares_parse_caa_reply(buf, len, &caa_start);1451 | ~~~~~~~~~~~~~~~~~~~~^~~~~~~~~~~~~~~~~~~~~~1452/nix/store/j239p458yixap89j6wpfib9yjypd3ii5-c-ares-1.34.8-dev/include/ares.h:1114:55: note: declared here1453 1114 | CARES_EXTERN CARES_DEPRECATED_FOR(ares_dns_parse) int ares_parse_caa_reply(1454 | ^~~~~~~~~~~~~~~~~~~~1455../../src/cares_wrap.cc: In function 'v8::Maybe<int> node::cares_wrap::{anonymous}::ParseTxtReply(node::Environment*, const unsigned char*, int, v8::Local<v8::Array>, bool)':1456../../src/cares_wrap.cc:511:40: warning: 'int ares_parse_txt_reply_ext(const unsigned char*, int, ares_txt_ext**)' is deprecated: Use ares_dns_parse instead [-Wdeprecated-declarations]1457 511 | int status = ares_parse_txt_reply_ext(buf, len, &txt_out);1458 | ~~~~~~~~~~~~~~~~~~~~~~~~^~~~~~~~~~~~~~~~~~~~1459/nix/store/j239p458yixap89j6wpfib9yjypd3ii5-c-ares-1.34.8-dev/include/ares.h:1133:55: note: declared here1460 1133 | CARES_EXTERN CARES_DEPRECATED_FOR(ares_dns_parse) int ares_parse_txt_reply_ext(1461 | ^~~~~~~~~~~~~~~~~~~~~~~~1462../../src/cares_wrap.cc: In function 'v8::Maybe<int> node::cares_wrap::{anonymous}::ParseSrvReply(node::Environment*, const unsigned char*, int, v8::Local<v8::Array>, bool)':1463../../src/cares_wrap.cc:598:36: warning: 'int ares_parse_srv_reply(const unsigned char*, int, ares_srv_reply**)' is deprecated: Use ares_dns_parse instead [-Wdeprecated-declarations]1464 598 | int status = ares_parse_srv_reply(buf, len, &srv_start);1465 | ~~~~~~~~~~~~~~~~~~~~^~~~~~~~~~~~~~~~~~~~~~1466/nix/store/j239p458yixap89j6wpfib9yjypd3ii5-c-ares-1.34.8-dev/include/ares.h:1124:55: note: declared here1467 1124 | CARES_EXTERN CARES_DEPRECATED_FOR(ares_dns_parse) int ares_parse_srv_reply(1468 | ^~~~~~~~~~~~~~~~~~~~1469../../src/cares_wrap.cc: In function 'v8::Maybe<int> node::cares_wrap::{anonymous}::ParseNaptrReply(node::Environment*, const unsigned char*, int, v8::Local<v8::Array>, bool)':1470../../src/cares_wrap.cc:653:38: warning: 'int ares_parse_naptr_reply(const unsigned char*, int, ares_naptr_reply**)' is deprecated: Use ares_dns_parse instead [-Wdeprecated-declarations]1471 653 | int status = ares_parse_naptr_reply(buf, len, &naptr_start);1472 | ~~~~~~~~~~~~~~~~~~~~~~^~~~~~~~~~~~~~~~~~~~~~~~1473/nix/store/j239p458yixap89j6wpfib9yjypd3ii5-c-ares-1.34.8-dev/include/ares.h:1136:55: note: declared here1474 1136 | CARES_EXTERN CARES_DEPRECATED_FOR(ares_dns_parse) int ares_parse_naptr_reply(1475 | ^~~~~~~~~~~~~~~~~~~~~~1476../../src/cares_wrap.cc: In member function 'void node::cares_wrap::ChannelWrap::EnsureServers()':1477../../src/cares_wrap.cc:1000:25: warning: 'int ares_get_servers_ports(const ares_channel_t*, ares_addr_port_node**)' is deprecated: Use ares_get_servers_csv instead [-Wdeprecated-declarations]1478 1000 | ares_get_servers_ports(channel_, &servers);1479 | ~~~~~~~~~~~~~~~~~~~~~~^~~~~~~~~~~~~~~~~~~~1480/nix/store/j239p458yixap89j6wpfib9yjypd3ii5-c-ares-1.34.8-dev/include/ares.h:1196:28: note: declared here1481 1196 | int ares_get_servers_ports(const ares_channel_t *channel,1482 | ^~~~~~~~~~~~~~~~~~~~~~1483../../src/cares_wrap.cc: In static member function 'static v8::Maybe<int> node::cares_wrap::SoaTraits::Parse(node::cares_wrap::QuerySoaWrap*, const std::unique_ptr<node::cares_wrap::ResponseData>&)':1484../../src/cares_wrap.cc:1711:36: warning: 'int ares_parse_soa_reply(const unsigned char*, int, ares_soa_reply**)' is deprecated: Use ares_dns_parse instead [-Wdeprecated-declarations]1485 1711 | int status = ares_parse_soa_reply(buf, len, &soa_out);1486 | ~~~~~~~~~~~~~~~~~~~~^~~~~~~~~~~~~~~~~~~~1487/nix/store/j239p458yixap89j6wpfib9yjypd3ii5-c-ares-1.34.8-dev/include/ares.h:1139:55: note: declared here1488 1139 | CARES_EXTERN CARES_DEPRECATED_FOR(ares_dns_parse) int ares_parse_soa_reply(1489 | ^~~~~~~~~~~~~~~~~~~~1490../../src/cares_wrap.cc: In function 'void node::cares_wrap::{anonymous}::GetServers(const v8::FunctionCallbackInfo<v8::Value>&)':1491../../src/cares_wrap.cc:2092:33: warning: 'int ares_get_servers_ports(const ares_channel_t*, ares_addr_port_node**)' is deprecated: Use ares_get_servers_csv instead [-Wdeprecated-declarations]1492 2092 | int r = ares_get_servers_ports(channel->cares_channel(), &servers);1493 | ~~~~~~~~~~~~~~~~~~~~~~^~~~~~~~~~~~~~~~~~~~~~~~~~~~~~~~~~~~1494/nix/store/j239p458yixap89j6wpfib9yjypd3ii5-c-ares-1.34.8-dev/include/ares.h:1196:28: note: declared here1495 1196 | int ares_get_servers_ports(const ares_channel_t *channel,1496 | ^~~~~~~~~~~~~~~~~~~~~~1497../../src/cares_wrap.cc: In function 'void node::cares_wrap::{anonymous}::SetServers(const v8::FunctionCallbackInfo<v8::Value>&)':1498../../src/cares_wrap.cc:2137:30: warning: 'int ares_set_servers(ares_channel_t*, const ares_addr_node*)' is deprecated: Use ares_set_servers_csv instead [-Wdeprecated-declarations]1499 2137 | int rv = ares_set_servers(channel->cares_channel(), nullptr);1500 | ~~~~~~~~~~~~~~~~^~~~~~~~~~~~~~~~~~~~~~~~~~~~~~~~~~~1501/nix/store/j239p458yixap89j6wpfib9yjypd3ii5-c-ares-1.34.8-dev/include/ares.h:1176:61: note: declared here1502 1176 | CARES_EXTERN CARES_DEPRECATED_FOR(ares_set_servers_csv) int ares_set_servers(1503 | ^~~~~~~~~~~~~~~~1504../../src/cares_wrap.cc:2197:33: warning: 'int ares_set_servers_ports(ares_channel_t*, const ares_addr_port_node*)' is deprecated: Use ares_set_servers_ports_csv instead [-Wdeprecated-declarations]1505 2197 | err = ares_set_servers_ports(channel->cares_channel(), servers.data());1506 | ~~~~~~~~~~~~~~~~~~~~~~^~~~~~~~~~~~~~~~~~~~~~~~~~~~~~~~~~~~~~~~~~1507/nix/store/j239p458yixap89j6wpfib9yjypd3ii5-c-ares-1.34.8-dev/include/ares.h:1181:20: note: declared here1508 1181 | int ares_set_servers_ports(ares_channel_t *channel,1509 | ^~~~~~~~~~~~~~~~~~~~~~1510[206/1871] CXX obj/src/node_base.node_main_instance.o1511In file included from ../../src/util.h:29,1512 from ../../src/node_main_instance.h:11,1513 from ../../src/node_main_instance.cc:1:1514../../deps/v8/include/v8-profiler.h: In constructor 'v8::HeapProfiler::HeapSnapshotOptions::HeapSnapshotOptions()':1515../../deps/v8/include/v8-profiler.h:1128:27: warning: 'v8::HeapProfiler::HeapSnapshotOptions::global_object_name_resolver' is deprecated: Use context_name_resolver callback instead. [-Wdeprecated-declarations]1516 1128 | HeapSnapshotOptions() {}1517 | ^1518../../deps/v8/include/v8-profiler.h:1142:25: note: declared here1519 1142 | ObjectNameResolver* global_object_name_resolver = nullptr;1520 | ^~~~~~~~~~~~~~~~~~~~~~~~~~~1521../../deps/v8/include/v8-profiler.h:1128:27: warning: 'v8::HeapProfiler::HeapSnapshotOptions::global_object_name_resolver' is deprecated: Use context_name_resolver callback instead. [-Wdeprecated-declarations]1522 1128 | HeapSnapshotOptions() {}1523 | ^1524../../deps/v8/include/v8-profiler.h:1142:25: note: declared here1525 1142 | ObjectNameResolver* global_object_name_resolver = nullptr;1526 | ^~~~~~~~~~~~~~~~~~~~~~~~~~~1527[207/1871] CXX obj/src/node_base.node_postmortem_metadata.o1528In file included from ../../src/memory_tracker.h:6,1529 from ../../src/base_object.h:29,1530 from ../../src/base_object-inl.h:27,1531 from ../../src/node_postmortem_metadata.cc:1:1532../../deps/v8/include/v8-profiler.h: In constructor 'v8::HeapProfiler::HeapSnapshotOptions::HeapSnapshotOptions()':1533../../deps/v8/include/v8-profiler.h:1128:27: warning: 'v8::HeapProfiler::HeapSnapshotOptions::global_object_name_resolver' is deprecated: Use context_name_resolver callback instead. [-Wdeprecated-declarations]1534 1128 | HeapSnapshotOptions() {}1535 | ^1536../../deps/v8/include/v8-profiler.h:1142:25: note: declared here1537 1142 | ObjectNameResolver* global_object_name_resolver = nullptr;1538 | ^~~~~~~~~~~~~~~~~~~~~~~~~~~1539../../deps/v8/include/v8-profiler.h:1128:27: warning: 'v8::HeapProfiler::HeapSnapshotOptions::global_object_name_resolver' is deprecated: Use context_name_resolver callback instead. [-Wdeprecated-declarations]1540 1128 | HeapSnapshotOptions() {}1541 | ^1542../../deps/v8/include/v8-profiler.h:1142:25: note: declared here1543 1142 | ObjectNameResolver* global_object_name_resolver = nullptr;1544 | ^~~~~~~~~~~~~~~~~~~~~~~~~~~1545[208/1871] CXX obj/src/node_base.node_process_object.o1546In file included from ../../src/memory_tracker.h:6,1547 from ../../src/aliased_buffer.h:7,1548 from ../../src/aliased_buffer-inl.h:6,1549 from ../../src/env-inl.h:27,1550 from ../../src/node_process_object.cc:1:1551../../deps/v8/include/v8-profiler.h: In constructor 'v8::HeapProfiler::HeapSnapshotOptions::HeapSnapshotOptions()':1552../../deps/v8/include/v8-profiler.h:1128:27: warning: 'v8::HeapProfiler::HeapSnapshotOptions::global_object_name_resolver' is deprecated: Use context_name_resolver callback instead. [-Wdeprecated-declarations]1553 1128 | HeapSnapshotOptions() {}1554 | ^1555../../deps/v8/include/v8-profiler.h:1142:25: note: declared here1556 1142 | ObjectNameResolver* global_object_name_resolver = nullptr;1557 | ^~~~~~~~~~~~~~~~~~~~~~~~~~~1558../../deps/v8/include/v8-profiler.h:1128:27: warning: 'v8::HeapProfiler::HeapSnapshotOptions::global_object_name_resolver' is deprecated: Use context_name_resolver callback instead. [-Wdeprecated-declarations]1559 1128 | HeapSnapshotOptions() {}1560 | ^1561../../deps/v8/include/v8-profiler.h:1142:25: note: declared here1562 1142 | ObjectNameResolver* global_object_name_resolver = nullptr;1563 | ^~~~~~~~~~~~~~~~~~~~~~~~~~~1564[209/1871] CXX obj/src/node_base.node_process_events.o1565In file included from ../../src/memory_tracker.h:6,1566 from ../../src/aliased_buffer.h:7,1567 from ../../src/aliased_buffer-inl.h:6,1568 from ../../src/env-inl.h:27,1569 from ../../src/node_process_events.cc:3:1570../../deps/v8/include/v8-profiler.h: In constructor 'v8::HeapProfiler::HeapSnapshotOptions::HeapSnapshotOptions()':1571../../deps/v8/include/v8-profiler.h:1128:27: warning: 'v8::HeapProfiler::HeapSnapshotOptions::global_object_name_resolver' is deprecated: Use context_name_resolver callback instead. [-Wdeprecated-declarations]1572 1128 | HeapSnapshotOptions() {}1573 | ^1574../../deps/v8/include/v8-profiler.h:1142:25: note: declared here1575 1142 | ObjectNameResolver* global_object_name_resolver = nullptr;1576 | ^~~~~~~~~~~~~~~~~~~~~~~~~~~1577../../deps/v8/include/v8-profiler.h:1128:27: warning: 'v8::HeapProfiler::HeapSnapshotOptions::global_object_name_resolver' is deprecated: Use context_name_resolver callback instead. [-Wdeprecated-declarations]1578 1128 | HeapSnapshotOptions() {}1579 | ^1580../../deps/v8/include/v8-profiler.h:1142:25: note: declared here1581 1142 | ObjectNameResolver* global_object_name_resolver = nullptr;1582 | ^~~~~~~~~~~~~~~~~~~~~~~~~~~1583[210/1871] CXX obj/src/node_base.node_report_utils.o1584In file included from ../../src/memory_tracker.h:6,1585 from ../../src/aliased_buffer.h:7,1586 from ../../src/env.h:27,1587 from ../../src/node_internals.h:27,1588 from ../../src/node_report_utils.cc:2:1589../../deps/v8/include/v8-profiler.h: In constructor 'v8::HeapProfiler::HeapSnapshotOptions::HeapSnapshotOptions()':1590../../deps/v8/include/v8-profiler.h:1128:27: warning: 'v8::HeapProfiler::HeapSnapshotOptions::global_object_name_resolver' is deprecated: Use context_name_resolver callback instead. [-Wdeprecated-declarations]1591 1128 | HeapSnapshotOptions() {}1592 | ^1593../../deps/v8/include/v8-profiler.h:1142:25: note: declared here1594 1142 | ObjectNameResolver* global_object_name_resolver = nullptr;1595 | ^~~~~~~~~~~~~~~~~~~~~~~~~~~1596../../deps/v8/include/v8-profiler.h:1128:27: warning: 'v8::HeapProfiler::HeapSnapshotOptions::global_object_name_resolver' is deprecated: Use context_name_resolver callback instead. [-Wdeprecated-declarations]1597 1128 | HeapSnapshotOptions() {}1598 | ^1599../../deps/v8/include/v8-profiler.h:1142:25: note: declared here1600 1142 | ObjectNameResolver* global_object_name_resolver = nullptr;1601 | ^~~~~~~~~~~~~~~~~~~~~~~~~~~1602[211/1871] CXX obj/src/node_base.node_platform.o1603In file included from ../../src/util.h:29,1604 from ../../src/node_mutex.h:6,1605 from ../../src/node_platform.h:15,1606 from ../../src/node_platform.cc:1:1607../../deps/v8/include/v8-profiler.h: In constructor 'v8::HeapProfiler::HeapSnapshotOptions::HeapSnapshotOptions()':1608../../deps/v8/include/v8-profiler.h:1128:27: warning: 'v8::HeapProfiler::HeapSnapshotOptions::global_object_name_resolver' is deprecated: Use context_name_resolver callback instead. [-Wdeprecated-declarations]1609 1128 | HeapSnapshotOptions() {}1610 | ^1611../../deps/v8/include/v8-profiler.h:1142:25: note: declared here1612 1142 | ObjectNameResolver* global_object_name_resolver = nullptr;1613 | ^~~~~~~~~~~~~~~~~~~~~~~~~~~1614../../deps/v8/include/v8-profiler.h:1128:27: warning: 'v8::HeapProfiler::HeapSnapshotOptions::global_object_name_resolver' is deprecated: Use context_name_resolver callback instead. [-Wdeprecated-declarations]1615 1128 | HeapSnapshotOptions() {}1616 | ^1617../../deps/v8/include/v8-profiler.h:1142:25: note: declared here1618 1142 | ObjectNameResolver* global_object_name_resolver = nullptr;1619 | ^~~~~~~~~~~~~~~~~~~~~~~~~~~1620[212/1871] CXX obj/src/node_base.node_locks.o1621In file included from ../../src/memory_tracker.h:6,1622 from ../../src/base_object.h:29,1623 from ../../src/node_locks.h:11,1624 from ../../src/node_locks.cc:1:1625../../deps/v8/include/v8-profiler.h: In constructor 'v8::HeapProfiler::HeapSnapshotOptions::HeapSnapshotOptions()':1626../../deps/v8/include/v8-profiler.h:1128:27: warning: 'v8::HeapProfiler::HeapSnapshotOptions::global_object_name_resolver' is deprecated: Use context_name_resolver callback instead. [-Wdeprecated-declarations]1627 1128 | HeapSnapshotOptions() {}1628 | ^1629../../deps/v8/include/v8-profiler.h:1142:25: note: declared here1630 1142 | ObjectNameResolver* global_object_name_resolver = nullptr;1631 | ^~~~~~~~~~~~~~~~~~~~~~~~~~~1632../../deps/v8/include/v8-profiler.h:1128:27: warning: 'v8::HeapProfiler::HeapSnapshotOptions::global_object_name_resolver' is deprecated: Use context_name_resolver callback instead. [-Wdeprecated-declarations]1633 1128 | HeapSnapshotOptions() {}1634 | ^1635../../deps/v8/include/v8-profiler.h:1142:25: note: declared here1636 1142 | ObjectNameResolver* global_object_name_resolver = nullptr;1637 | ^~~~~~~~~~~~~~~~~~~~~~~~~~~1638[213/1871] CXX obj/src/node_base.node_process_methods.o1639In file included from ../../src/memory_tracker.h:6,1640 from ../../src/base_object.h:29,1641 from ../../src/async_wrap.h:27,1642 from ../../src/async_wrap-inl.h:27,1643 from ../../src/node_process_methods.cc:1:1644../../deps/v8/include/v8-profiler.h: In constructor 'v8::HeapProfiler::HeapSnapshotOptions::HeapSnapshotOptions()':1645../../deps/v8/include/v8-profiler.h:1128:27: warning: 'v8::HeapProfiler::HeapSnapshotOptions::global_object_name_resolver' is deprecated: Use context_name_resolver callback instead. [-Wdeprecated-declarations]1646 1128 | HeapSnapshotOptions() {}1647 | ^1648../../deps/v8/include/v8-profiler.h:1142:25: note: declared here1649 1142 | ObjectNameResolver* global_object_name_resolver = nullptr;1650 | ^~~~~~~~~~~~~~~~~~~~~~~~~~~1651../../deps/v8/include/v8-profiler.h:1128:27: warning: 'v8::HeapProfiler::HeapSnapshotOptions::global_object_name_resolver' is deprecated: Use context_name_resolver callback instead. [-Wdeprecated-declarations]1652 1128 | HeapSnapshotOptions() {}1653 | ^1654../../deps/v8/include/v8-profiler.h:1142:25: note: declared here1655 1142 | ObjectNameResolver* global_object_name_resolver = nullptr;1656 | ^~~~~~~~~~~~~~~~~~~~~~~~~~~1657[214/1871] CXX obj/src/node_base.node_report_module.o1658In file included from ../../src/memory_tracker.h:6,1659 from ../../src/aliased_buffer.h:7,1660 from ../../src/env.h:27,1661 from ../../src/node_report_module.cc:1:1662../../deps/v8/include/v8-profiler.h: In constructor 'v8::HeapProfiler::HeapSnapshotOptions::HeapSnapshotOptions()':1663../../deps/v8/include/v8-profiler.h:1128:27: warning: 'v8::HeapProfiler::HeapSnapshotOptions::global_object_name_resolver' is deprecated: Use context_name_resolver callback instead. [-Wdeprecated-declarations]1664 1128 | HeapSnapshotOptions() {}1665 | ^1666../../deps/v8/include/v8-profiler.h:1142:25: note: declared here1667 1142 | ObjectNameResolver* global_object_name_resolver = nullptr;1668 | ^~~~~~~~~~~~~~~~~~~~~~~~~~~1669../../deps/v8/include/v8-profiler.h:1128:27: warning: 'v8::HeapProfiler::HeapSnapshotOptions::global_object_name_resolver' is deprecated: Use context_name_resolver callback instead. [-Wdeprecated-declarations]1670 1128 | HeapSnapshotOptions() {}1671 | ^1672../../deps/v8/include/v8-profiler.h:1142:25: note: declared here1673 1142 | ObjectNameResolver* global_object_name_resolver = nullptr;1674 | ^~~~~~~~~~~~~~~~~~~~~~~~~~~1675[215/1871] CXX obj/src/node_base.node_serdes.o1676In file included from ../../src/memory_tracker.h:6,1677 from ../../src/base_object.h:29,1678 from ../../src/base_object-inl.h:27,1679 from ../../src/node_serdes.cc:1:1680../../deps/v8/include/v8-profiler.h: In constructor 'v8::HeapProfiler::HeapSnapshotOptions::HeapSnapshotOptions()':1681../../deps/v8/include/v8-profiler.h:1128:27: warning: 'v8::HeapProfiler::HeapSnapshotOptions::global_object_name_resolver' is deprecated: Use context_name_resolver callback instead. [-Wdeprecated-declarations]1682 1128 | HeapSnapshotOptions() {}1683 | ^1684../../deps/v8/include/v8-profiler.h:1142:25: note: declared here1685 1142 | ObjectNameResolver* global_object_name_resolver = nullptr;1686 | ^~~~~~~~~~~~~~~~~~~~~~~~~~~1687../../deps/v8/include/v8-profiler.h:1128:27: warning: 'v8::HeapProfiler::HeapSnapshotOptions::global_object_name_resolver' is deprecated: Use context_name_resolver callback instead. [-Wdeprecated-declarations]1688 1128 | HeapSnapshotOptions() {}1689 | ^1690../../deps/v8/include/v8-profiler.h:1142:25: note: declared here1691 1142 | ObjectNameResolver* global_object_name_resolver = nullptr;1692 | ^~~~~~~~~~~~~~~~~~~~~~~~~~~1693[216/1871] CXX obj/src/node_base.node_symbols.o1694In file included from ../../src/memory_tracker.h:6,1695 from ../../src/aliased_buffer.h:7,1696 from ../../src/aliased_buffer-inl.h:6,1697 from ../../src/env-inl.h:27,1698 from ../../src/node_symbols.cc:1:1699../../deps/v8/include/v8-profiler.h: In constructor 'v8::HeapProfiler::HeapSnapshotOptions::HeapSnapshotOptions()':1700../../deps/v8/include/v8-profiler.h:1128:27: warning: 'v8::HeapProfiler::HeapSnapshotOptions::global_object_name_resolver' is deprecated: Use context_name_resolver callback instead. [-Wdeprecated-declarations]1701 1128 | HeapSnapshotOptions() {}1702 | ^1703../../deps/v8/include/v8-profiler.h:1142:25: note: declared here1704 1142 | ObjectNameResolver* global_object_name_resolver = nullptr;1705 | ^~~~~~~~~~~~~~~~~~~~~~~~~~~1706../../deps/v8/include/v8-profiler.h:1128:27: warning: 'v8::HeapProfiler::HeapSnapshotOptions::global_object_name_resolver' is deprecated: Use context_name_resolver callback instead. [-Wdeprecated-declarations]1707 1128 | HeapSnapshotOptions() {}1708 | ^1709../../deps/v8/include/v8-profiler.h:1142:25: note: declared here1710 1142 | ObjectNameResolver* global_object_name_resolver = nullptr;1711 | ^~~~~~~~~~~~~~~~~~~~~~~~~~~1712[217/1871] CXX obj/src/node_base.node_report.o1713In file included from ../../src/util.h:29,1714 from ../../src/node_report.h:9,1715 from ../../src/node_report.cc:1:1716../../deps/v8/include/v8-profiler.h: In constructor 'v8::HeapProfiler::HeapSnapshotOptions::HeapSnapshotOptions()':1717../../deps/v8/include/v8-profiler.h:1128:27: warning: 'v8::HeapProfiler::HeapSnapshotOptions::global_object_name_resolver' is deprecated: Use context_name_resolver callback instead. [-Wdeprecated-declarations]1718 1128 | HeapSnapshotOptions() {}1719 | ^1720../../deps/v8/include/v8-profiler.h:1142:25: note: declared here1721 1142 | ObjectNameResolver* global_object_name_resolver = nullptr;1722 | ^~~~~~~~~~~~~~~~~~~~~~~~~~~1723../../deps/v8/include/v8-profiler.h:1128:27: warning: 'v8::HeapProfiler::HeapSnapshotOptions::global_object_name_resolver' is deprecated: Use context_name_resolver callback instead. [-Wdeprecated-declarations]1724 1128 | HeapSnapshotOptions() {}1725 | ^1726../../deps/v8/include/v8-profiler.h:1142:25: note: declared here1727 1142 | ObjectNameResolver* global_object_name_resolver = nullptr;1728 | ^~~~~~~~~~~~~~~~~~~~~~~~~~~1729[218/1871] CXX obj/src/node_base.node_task_queue.o1730In file included from ../../src/memory_tracker.h:6,1731 from ../../src/base_object.h:29,1732 from ../../src/async_wrap.h:27,1733 from ../../src/node_task_queue.cc:1:1734../../deps/v8/include/v8-profiler.h: In constructor 'v8::HeapProfiler::HeapSnapshotOptions::HeapSnapshotOptions()':1735../../deps/v8/include/v8-profiler.h:1128:27: warning: 'v8::HeapProfiler::HeapSnapshotOptions::global_object_name_resolver' is deprecated: Use context_name_resolver callback instead. [-Wdeprecated-declarations]1736 1128 | HeapSnapshotOptions() {}1737 | ^1738../../deps/v8/include/v8-profiler.h:1142:25: note: declared here1739 1142 | ObjectNameResolver* global_object_name_resolver = nullptr;1740 | ^~~~~~~~~~~~~~~~~~~~~~~~~~~1741../../deps/v8/include/v8-profiler.h:1128:27: warning: 'v8::HeapProfiler::HeapSnapshotOptions::global_object_name_resolver' is deprecated: Use context_name_resolver callback instead. [-Wdeprecated-declarations]1742 1128 | HeapSnapshotOptions() {}1743 | ^1744../../deps/v8/include/v8-profiler.h:1142:25: note: declared here1745 1142 | ObjectNameResolver* global_object_name_resolver = nullptr;1746 | ^~~~~~~~~~~~~~~~~~~~~~~~~~~1747[219/1871] CXX obj/src/node_base.node_types.o1748In file included from ../../src/memory_tracker.h:6,1749 from ../../src/aliased_buffer.h:7,1750 from ../../src/aliased_buffer-inl.h:6,1751 from ../../src/env-inl.h:27,1752 from ../../src/node_types.cc:1:1753../../deps/v8/include/v8-profiler.h: In constructor 'v8::HeapProfiler::HeapSnapshotOptions::HeapSnapshotOptions()':1754../../deps/v8/include/v8-profiler.h:1128:27: warning: 'v8::HeapProfiler::HeapSnapshotOptions::global_object_name_resolver' is deprecated: Use context_name_resolver callback instead. [-Wdeprecated-declarations]1755 1128 | HeapSnapshotOptions() {}1756 | ^1757../../deps/v8/include/v8-profiler.h:1142:25: note: declared here1758 1142 | ObjectNameResolver* global_object_name_resolver = nullptr;1759 | ^~~~~~~~~~~~~~~~~~~~~~~~~~~1760../../deps/v8/include/v8-profiler.h:1128:27: warning: 'v8::HeapProfiler::HeapSnapshotOptions::global_object_name_resolver' is deprecated: Use context_name_resolver callback instead. [-Wdeprecated-declarations]1761 1128 | HeapSnapshotOptions() {}1762 | ^1763../../deps/v8/include/v8-profiler.h:1142:25: note: declared here1764 1142 | ObjectNameResolver* global_object_name_resolver = nullptr;1765 | ^~~~~~~~~~~~~~~~~~~~~~~~~~~1766[220/1871] CXX obj/src/node_base.node_stat_watcher.o1767In file included from ../../src/memory_tracker.h:6,1768 from ../../src/base_object.h:29,1769 from ../../src/async_wrap.h:27,1770 from ../../src/handle_wrap.h:27,1771 from ../../src/node_stat_watcher.h:28,1772 from ../../src/node_stat_watcher.cc:22:1773../../deps/v8/include/v8-profiler.h: In constructor 'v8::HeapProfiler::HeapSnapshotOptions::HeapSnapshotOptions()':1774../../deps/v8/include/v8-profiler.h:1128:27: warning: 'v8::HeapProfiler::HeapSnapshotOptions::global_object_name_resolver' is deprecated: Use context_name_resolver callback instead. [-Wdeprecated-declarations]1775 1128 | HeapSnapshotOptions() {}1776 | ^1777../../deps/v8/include/v8-profiler.h:1142:25: note: declared here1778 1142 | ObjectNameResolver* global_object_name_resolver = nullptr;1779 | ^~~~~~~~~~~~~~~~~~~~~~~~~~~1780../../deps/v8/include/v8-profiler.h:1128:27: warning: 'v8::HeapProfiler::HeapSnapshotOptions::global_object_name_resolver' is deprecated: Use context_name_resolver callback instead. [-Wdeprecated-declarations]1781 1128 | HeapSnapshotOptions() {}1782 | ^1783../../deps/v8/include/v8-profiler.h:1142:25: note: declared here1784 1142 | ObjectNameResolver* global_object_name_resolver = nullptr;1785 | ^~~~~~~~~~~~~~~~~~~~~~~~~~~1786[221/1871] CXX obj/src/node_base.node_shadow_realm.o1787In file included from ../../src/memory_tracker.h:6,1788 from ../../src/cleanup_queue.h:11,1789 from ../../src/node_realm.h:8,1790 from ../../src/node_shadow_realm.h:6,1791 from ../../src/node_shadow_realm.cc:1:1792../../deps/v8/include/v8-profiler.h: In constructor 'v8::HeapProfiler::HeapSnapshotOptions::HeapSnapshotOptions()':1793../../deps/v8/include/v8-profiler.h:1128:27: warning: 'v8::HeapProfiler::HeapSnapshotOptions::global_object_name_resolver' is deprecated: Use context_name_resolver callback instead. [-Wdeprecated-declarations]1794 1128 | HeapSnapshotOptions() {}1795 | ^1796../../deps/v8/include/v8-profiler.h:1142:25: note: declared here1797 1142 | ObjectNameResolver* global_object_name_resolver = nullptr;1798 | ^~~~~~~~~~~~~~~~~~~~~~~~~~~1799../../deps/v8/include/v8-profiler.h:1128:27: warning: 'v8::HeapProfiler::HeapSnapshotOptions::global_object_name_resolver' is deprecated: Use context_name_resolver callback instead. [-Wdeprecated-declarations]1800 1128 | HeapSnapshotOptions() {}1801 | ^1802../../deps/v8/include/v8-profiler.h:1142:25: note: declared here1803 1142 | ObjectNameResolver* global_object_name_resolver = nullptr;1804 | ^~~~~~~~~~~~~~~~~~~~~~~~~~~1805[222/1871] CXX obj/src/node_base.node_trace_events.o1806In file included from ../../src/memory_tracker.h:6,1807 from ../../src/base_object.h:29,1808 from ../../src/base_object-inl.h:27,1809 from ../../src/node_trace_events.cc:1:1810../../deps/v8/include/v8-profiler.h: In constructor 'v8::HeapProfiler::HeapSnapshotOptions::HeapSnapshotOptions()':1811../../deps/v8/include/v8-profiler.h:1128:27: warning: 'v8::HeapProfiler::HeapSnapshotOptions::global_object_name_resolver' is deprecated: Use context_name_resolver callback instead. [-Wdeprecated-declarations]1812 1128 | HeapSnapshotOptions() {}1813 | ^1814../../deps/v8/include/v8-profiler.h:1142:25: note: declared here1815 1142 | ObjectNameResolver* global_object_name_resolver = nullptr;1816 | ^~~~~~~~~~~~~~~~~~~~~~~~~~~1817../../deps/v8/include/v8-profiler.h:1128:27: warning: 'v8::HeapProfiler::HeapSnapshotOptions::global_object_name_resolver' is deprecated: Use context_name_resolver callback instead. [-Wdeprecated-declarations]1818 1128 | HeapSnapshotOptions() {}1819 | ^1820../../deps/v8/include/v8-profiler.h:1142:25: note: declared here1821 1142 | ObjectNameResolver* global_object_name_resolver = nullptr;1822 | ^~~~~~~~~~~~~~~~~~~~~~~~~~~1823[223/1871] CXX obj/src/node_base.node_modules.o1824In file included from ../../src/memory_tracker.h:6,1825 from ../../src/aliased_buffer.h:7,1826 from ../../src/node_snapshotable.h:7,1827 from ../../src/node_modules.h:7,1828 from ../../src/node_modules.cc:1:1829../../deps/v8/include/v8-profiler.h: In constructor 'v8::HeapProfiler::HeapSnapshotOptions::HeapSnapshotOptions()':1830../../deps/v8/include/v8-profiler.h:1128:27: warning: 'v8::HeapProfiler::HeapSnapshotOptions::global_object_name_resolver' is deprecated: Use context_name_resolver callback instead. [-Wdeprecated-declarations]1831 1128 | HeapSnapshotOptions() {}1832 | ^1833../../deps/v8/include/v8-profiler.h:1142:25: note: declared here1834 1142 | ObjectNameResolver* global_object_name_resolver = nullptr;1835 | ^~~~~~~~~~~~~~~~~~~~~~~~~~~1836../../deps/v8/include/v8-profiler.h:1128:27: warning: 'v8::HeapProfiler::HeapSnapshotOptions::global_object_name_resolver' is deprecated: Use context_name_resolver callback instead. [-Wdeprecated-declarations]1837 1128 | HeapSnapshotOptions() {}1838 | ^1839../../deps/v8/include/v8-profiler.h:1142:25: note: declared here1840 1142 | ObjectNameResolver* global_object_name_resolver = nullptr;1841 | ^~~~~~~~~~~~~~~~~~~~~~~~~~~1842[224/1871] CXX obj/src/node_base.node_realm.o1843In file included from ../../src/memory_tracker.h:6,1844 from ../../src/cleanup_queue.h:11,1845 from ../../src/node_realm.h:8,1846 from ../../src/node_realm.cc:1:1847../../deps/v8/include/v8-profiler.h: In constructor 'v8::HeapProfiler::HeapSnapshotOptions::HeapSnapshotOptions()':1848../../deps/v8/include/v8-profiler.h:1128:27: warning: 'v8::HeapProfiler::HeapSnapshotOptions::global_object_name_resolver' is deprecated: Use context_name_resolver callback instead. [-Wdeprecated-declarations]1849 1128 | HeapSnapshotOptions() {}1850 | ^1851../../deps/v8/include/v8-profiler.h:1142:25: note: declared here1852 1142 | ObjectNameResolver* global_object_name_resolver = nullptr;1853 | ^~~~~~~~~~~~~~~~~~~~~~~~~~~1854../../deps/v8/include/v8-profiler.h:1128:27: warning: 'v8::HeapProfiler::HeapSnapshotOptions::global_object_name_resolver' is deprecated: Use context_name_resolver callback instead. [-Wdeprecated-declarations]1855 1128 | HeapSnapshotOptions() {}1856 | ^1857../../deps/v8/include/v8-profiler.h:1142:25: note: declared here1858 1142 | ObjectNameResolver* global_object_name_resolver = nullptr;1859 | ^~~~~~~~~~~~~~~~~~~~~~~~~~~1860[225/1871] CXX obj/src/node_base.node_util.o1861In file included from ../../src/memory_tracker.h:6,1862 from ../../src/base_object.h:29,1863 from ../../src/base_object-inl.h:27,1864 from ../../src/node_util.cc:1:1865../../deps/v8/include/v8-profiler.h: In constructor 'v8::HeapProfiler::HeapSnapshotOptions::HeapSnapshotOptions()':1866../../deps/v8/include/v8-profiler.h:1128:27: warning: 'v8::HeapProfiler::HeapSnapshotOptions::global_object_name_resolver' is deprecated: Use context_name_resolver callback instead. [-Wdeprecated-declarations]1867 1128 | HeapSnapshotOptions() {}1868 | ^1869../../deps/v8/include/v8-profiler.h:1142:25: note: declared here1870 1142 | ObjectNameResolver* global_object_name_resolver = nullptr;1871 | ^~~~~~~~~~~~~~~~~~~~~~~~~~~1872../../deps/v8/include/v8-profiler.h:1128:27: warning: 'v8::HeapProfiler::HeapSnapshotOptions::global_object_name_resolver' is deprecated: Use context_name_resolver callback instead. [-Wdeprecated-declarations]1873 1128 | HeapSnapshotOptions() {}1874 | ^1875../../deps/v8/include/v8-profiler.h:1142:25: note: declared here1876 1142 | ObjectNameResolver* global_object_name_resolver = nullptr;1877 | ^~~~~~~~~~~~~~~~~~~~~~~~~~~1878[226/1871] CXX obj/src/node_base.node_messaging.o1879In file included from ../../src/memory_tracker.h:6,1880 from ../../src/aliased_buffer.h:7,1881 from ../../src/env.h:27,1882 from ../../src/node_messaging.h:6,1883 from ../../src/node_messaging.cc:1:1884../../deps/v8/include/v8-profiler.h: In constructor 'v8::HeapProfiler::HeapSnapshotOptions::HeapSnapshotOptions()':1885../../deps/v8/include/v8-profiler.h:1128:27: warning: 'v8::HeapProfiler::HeapSnapshotOptions::global_object_name_resolver' is deprecated: Use context_name_resolver callback instead. [-Wdeprecated-declarations]1886 1128 | HeapSnapshotOptions() {}1887 | ^1888../../deps/v8/include/v8-profiler.h:1142:25: note: declared here1889 1142 | ObjectNameResolver* global_object_name_resolver = nullptr;1890 | ^~~~~~~~~~~~~~~~~~~~~~~~~~~1891../../deps/v8/include/v8-profiler.h:1128:27: warning: 'v8::HeapProfiler::HeapSnapshotOptions::global_object_name_resolver' is deprecated: Use context_name_resolver callback instead. [-Wdeprecated-declarations]1892 1128 | HeapSnapshotOptions() {}1893 | ^1894../../deps/v8/include/v8-profiler.h:1142:25: note: declared here1895 1142 | ObjectNameResolver* global_object_name_resolver = nullptr;1896 | ^~~~~~~~~~~~~~~~~~~~~~~~~~~1897[227/1871] CXX obj/deps/v8/src/torque/torque_base.torque-parser.o1898[228/1871] CXX obj/src/tracing/node_base.agent.o1899In file included from ../../src/util.h:29,1900 from ../../src/node_mutex.h:6,1901 from ../../src/tracing/agent_legacy.h:14,1902 from ../../src/tracing/agent.cc:6:1903../../deps/v8/include/v8-profiler.h: In constructor 'v8::HeapProfiler::HeapSnapshotOptions::HeapSnapshotOptions()':1904../../deps/v8/include/v8-profiler.h:1128:27: warning: 'v8::HeapProfiler::HeapSnapshotOptions::global_object_name_resolver' is deprecated: Use context_name_resolver callback instead. [-Wdeprecated-declarations]1905 1128 | HeapSnapshotOptions() {}1906 | ^1907../../deps/v8/include/v8-profiler.h:1142:25: note: declared here1908 1142 | ObjectNameResolver* global_object_name_resolver = nullptr;1909 | ^~~~~~~~~~~~~~~~~~~~~~~~~~~1910../../deps/v8/include/v8-profiler.h:1128:27: warning: 'v8::HeapProfiler::HeapSnapshotOptions::global_object_name_resolver' is deprecated: Use context_name_resolver callback instead. [-Wdeprecated-declarations]1911 1128 | HeapSnapshotOptions() {}1912 | ^1913../../deps/v8/include/v8-profiler.h:1142:25: note: declared here1914 1142 | ObjectNameResolver* global_object_name_resolver = nullptr;1915 | ^~~~~~~~~~~~~~~~~~~~~~~~~~~1916[229/1871] CXX obj/src/tracing/node_base.trace_event_helper.o1917[230/1871] CXX obj/src/node_base.node_sockaddr.o1918In file included from ../../src/memory_tracker.h:6,1919 from ../../src/base_object.h:29,1920 from ../../src/node_sockaddr.h:6,1921 from ../../src/node_sockaddr.cc:1:1922../../deps/v8/include/v8-profiler.h: In constructor 'v8::HeapProfiler::HeapSnapshotOptions::HeapSnapshotOptions()':1923../../deps/v8/include/v8-profiler.h:1128:27: warning: 'v8::HeapProfiler::HeapSnapshotOptions::global_object_name_resolver' is deprecated: Use context_name_resolver callback instead. [-Wdeprecated-declarations]1924 1128 | HeapSnapshotOptions() {}1925 | ^1926../../deps/v8/include/v8-profiler.h:1142:25: note: declared here1927 1142 | ObjectNameResolver* global_object_name_resolver = nullptr;1928 | ^~~~~~~~~~~~~~~~~~~~~~~~~~~1929../../deps/v8/include/v8-profiler.h:1128:27: warning: 'v8::HeapProfiler::HeapSnapshotOptions::global_object_name_resolver' is deprecated: Use context_name_resolver callback instead. [-Wdeprecated-declarations]1930 1128 | HeapSnapshotOptions() {}1931 | ^1932../../deps/v8/include/v8-profiler.h:1142:25: note: declared here1933 1142 | ObjectNameResolver* global_object_name_resolver = nullptr;1934 | ^~~~~~~~~~~~~~~~~~~~~~~~~~~1935[231/1871] CXX obj/src/ffi/platforms/node_base.arm64.o1936[232/1871] CXX obj/src/node_base.node_v8.o1937In file included from ../../src/memory_tracker.h:6,1938 from ../../src/aliased_buffer.h:7,1939 from ../../src/node_v8.h:7,1940 from ../../src/node_v8.cc:22:1941../../deps/v8/include/v8-profiler.h: In constructor 'v8::HeapProfiler::HeapSnapshotOptions::HeapSnapshotOptions()':1942../../deps/v8/include/v8-profiler.h:1128:27: warning: 'v8::HeapProfiler::HeapSnapshotOptions::global_object_name_resolver' is deprecated: Use context_name_resolver callback instead. [-Wdeprecated-declarations]1943 1128 | HeapSnapshotOptions() {}1944 | ^1945../../deps/v8/include/v8-profiler.h:1142:25: note: declared here1946 1142 | ObjectNameResolver* global_object_name_resolver = nullptr;1947 | ^~~~~~~~~~~~~~~~~~~~~~~~~~~1948../../deps/v8/include/v8-profiler.h:1128:27: warning: 'v8::HeapProfiler::HeapSnapshotOptions::global_object_name_resolver' is deprecated: Use context_name_resolver callback instead. [-Wdeprecated-declarations]1949 1128 | HeapSnapshotOptions() {}1950 | ^1951../../deps/v8/include/v8-profiler.h:1142:25: note: declared here1952 1142 | ObjectNameResolver* global_object_name_resolver = nullptr;1953 | ^~~~~~~~~~~~~~~~~~~~~~~~~~~1954[233/1871] CXX obj/src/ffi/platforms/node_base.loong64.o1955[234/1871] CXX obj/deps/v8/src/torque/torque_base.implementation-visitor.o1956[235/1871] AR obj/tools/v8_gypfiles/libtorque_base.a1957[236/1871] STAMP obj/tools/v8_gypfiles/torque.actions_depends.stamp1958[237/1871] CXX obj/src/node_base.node_wasm_web_api.o1959In file included from ../../src/memory_tracker.h:6,1960 from ../../src/base_object.h:29,1961 from ../../src/base_object-inl.h:27,1962 from ../../src/node_wasm_web_api.h:6,1963 from ../../src/node_wasm_web_api.cc:1:1964../../deps/v8/include/v8-profiler.h: In constructor 'v8::HeapProfiler::HeapSnapshotOptions::HeapSnapshotOptions()':1965../../deps/v8/include/v8-profiler.h:1128:27: warning: 'v8::HeapProfiler::HeapSnapshotOptions::global_object_name_resolver' is deprecated: Use context_name_resolver callback instead. [-Wdeprecated-declarations]1966 1128 | HeapSnapshotOptions() {}1967 | ^1968../../deps/v8/include/v8-profiler.h:1142:25: note: declared here1969 1142 | ObjectNameResolver* global_object_name_resolver = nullptr;1970 | ^~~~~~~~~~~~~~~~~~~~~~~~~~~1971../../deps/v8/include/v8-profiler.h:1128:27: warning: 'v8::HeapProfiler::HeapSnapshotOptions::global_object_name_resolver' is deprecated: Use context_name_resolver callback instead. [-Wdeprecated-declarations]1972 1128 | HeapSnapshotOptions() {}1973 | ^1974../../deps/v8/include/v8-profiler.h:1142:25: note: declared here1975 1142 | ObjectNameResolver* global_object_name_resolver = nullptr;1976 | ^~~~~~~~~~~~~~~~~~~~~~~~~~~1977[238/1871] CXX obj/src/ffi/node_base.jit_memory.o1978[239/1871] CXX obj/src/ffi/platforms/node_base.riscv64.o1979[240/1871] CXX obj/src/ffi/platforms/node_base.s390x.o1980[241/1871] CXX obj/src/ffi/platforms/node_base.ppc64.o1981[242/1871] CXX obj/deps/v8/third_party/simdutf/simdutf.simdutf.o1982[243/1871] AR obj/tools/v8_gypfiles/libsimdutf.a1983[244/1871] CXX obj/src/tracing/node_base.traced_value.o1984In file included from ../../src/util.h:29,1985 from ../../src/tracing/traced_value.cc:16:1986../../deps/v8/include/v8-profiler.h: In constructor 'v8::HeapProfiler::HeapSnapshotOptions::HeapSnapshotOptions()':1987../../deps/v8/include/v8-profiler.h:1128:27: warning: 'v8::HeapProfiler::HeapSnapshotOptions::global_object_name_resolver' is deprecated: Use context_name_resolver callback instead. [-Wdeprecated-declarations]1988 1128 | HeapSnapshotOptions() {}1989 | ^1990../../deps/v8/include/v8-profiler.h:1142:25: note: declared here1991 1142 | ObjectNameResolver* global_object_name_resolver = nullptr;1992 | ^~~~~~~~~~~~~~~~~~~~~~~~~~~1993../../deps/v8/include/v8-profiler.h:1128:27: warning: 'v8::HeapProfiler::HeapSnapshotOptions::global_object_name_resolver' is deprecated: Use context_name_resolver callback instead. [-Wdeprecated-declarations]1994 1128 | HeapSnapshotOptions() {}1995 | ^1996../../deps/v8/include/v8-profiler.h:1142:25: note: declared here1997 1142 | ObjectNameResolver* global_object_name_resolver = nullptr;1998 | ^~~~~~~~~~~~~~~~~~~~~~~~~~~1999[245/1871] CXX obj/src/ffi/platforms/node_base.x64.o2000[246/1871] LINK torque26278ok 5022 parallel/test-vm-module-after-evaluate26279 ---26280 duration_ms: 170.6770026281 ...26282ok 5023 parallel/test-vm-module-cached-data26283 ---26284 duration_ms: 170.9310026285 ...26286ok 5024 parallel/test-vm-module-dynamic-import26287 ---26288 duration_ms: 171.9450026289 ...26290ok 5025 parallel/test-vm-module-dynamic-import-promise26291 ---26292 duration_ms: 171.6770026293 ...26294ok 5026 parallel/test-vm-module-dynamic-namespace26295 ---26296 duration_ms: 170.3540026297 ...26298ok 5027 parallel/test-vm-module-errors26299 ---26300 duration_ms: 174.3680026301 ...26302ok 5028 parallel/test-vm-module-evaluate-synthethic-module26303 ---26304 duration_ms: 171.4580026305 ...26306ok 5029 parallel/test-v8-coverage26307 ---26308 duration_ms: 1321.1460026309 ...26310ok 5030 parallel/test-vm-module-evaluate-while-evaluating26311 ---26312 duration_ms: 174.3250026313 ...26314ok 5031 parallel/test-vm-module-evaluate-synthethic-module-rejection26315 ---26316 duration_ms: 179.0120026317 ...26318ok 5032 parallel/test-vm-not-strict26319 ---26320 duration_ms: 92.2020026321 ...26322ok 5033 parallel/test-vm-measure-memory-lazy26323 ---26324 duration_ms: 263.8210026325 ...26326ok 5034 parallel/test-vm-module-hasasyncgraph26327 ---26328 duration_ms: 179.1980026329 ...26330ok 5035 parallel/test-vm-module-import-meta26331 ---26332 duration_ms: 174.0500026333 ...26334ok 5036 parallel/test-vm-module-hastoplevelawait26335 ---26336 duration_ms: 212.6350026337 ...26338ok 5037 parallel/test-vm-module-reevaluate26339 ---26340 duration_ms: 178.5990026341 ...26342ok 5038 parallel/test-url-parse-invalid-input26343 ---26344 duration_ms: 1736.6640026345 ...26346ok 5039 parallel/test-vm-module-link26347 ---26348 duration_ms: 216.1520026349 ...26350ok 5040 parallel/test-vm-module-link-shared-deps26351 ---26352 duration_ms: 217.9320026353 ...26354ok 5041 parallel/test-vm-module-instantiate26355 ---26356 duration_ms: 221.3830026357 ...26358ok 5042 parallel/test-vm-module-linkmodulerequests26359 ---26360 duration_ms: 216.3720026361 ...26362ok 5043 parallel/test-vm-module-synthetic26363 ---26364 duration_ms: 185.2800026365 ...26366ok 5044 parallel/test-vm-new-script-new-context26367 ---26368 duration_ms: 183.2670026369 ...26370ok 5045 parallel/test-vm-new-script-this-context26371 ---26372 duration_ms: 181.2800026373 ...26374ok 5046 parallel/test-vm-no-dynamic-import-callback26375 ---26376 duration_ms: 178.3390026377 ...26378ok 5047 parallel/test-vm-module-linkmodulerequests-deep26379 ---26380 duration_ms: 215.6740026381 ...26382ok 5048 parallel/test-vm-module-modulerequests26383 ---26384 duration_ms: 221.4890026385 ...26386ok 5049 parallel/test-vm-ownkeys26387 ---26388 duration_ms: 181.3770026389 ...26390ok 5050 parallel/test-vm-ownpropertynames26391 ---26392 duration_ms: 176.1380026393 ...26394ok 5051 parallel/test-vm-module-linkmodulerequests-circular26395 ---26396 duration_ms: 233.6020026397 ...26398ok 5052 parallel/test-vm-ownpropertysymbols26399 ---26400 duration_ms: 191.7240026401 ...26402ok 5053 parallel/test-vm-preserves-property26403 ---26404 duration_ms: 184.1720026405 ...26406ok 5054 parallel/test-vm-module-referrer-realm26407 ---26408 duration_ms: 228.8310026409 ...26410ok 5055 parallel/test-vm-options-validation26411 ---26412 duration_ms: 216.2970026413 ...26414ok 5056 parallel/test-vm-property-not-on-sandbox26415 ---26416 duration_ms: 167.1990026417 ...26418ok 5057 parallel/test-vm-property-definer-partial-update26419 ---26420 duration_ms: 184.9750026421 ...26422ok 5058 parallel/test-vm-property-definer-interception26423 ---26424 duration_ms: 192.7310026425 ...26426ok 5059 parallel/test-vm-proxies26427 ---26428 duration_ms: 178.6820026429 ...26430ok 5060 parallel/test-vm-cached-data26431 ---26432 duration_ms: 611.5750026433 ...26434ok 5061 parallel/test-vm-script-after-evaluate26435 ---26436 duration_ms: 160.9030026437 ...26438ok 5062 parallel/test-vm-parse-abort-on-uncaught-exception26439 ---26440 duration_ms: 226.3380026441 ...26442ok 5063 parallel/test-vm-proxy-sandbox-property-query26443 ---26444 duration_ms: 180.4240026445 ...26446ok 5064 parallel/test-vm-set-proto-null-on-globalthis26447 ---26448 duration_ms: 149.6050026449 ...26450ok 5065 parallel/test-vm-set-property-proxy26451 ---26452 duration_ms: 173.5450026453 ...26454ok 5066 parallel/test-vm-script-throw-in-tostring26455 ---26456 duration_ms: 180.9050026457 ...26458ok 5067 parallel/test-vm-proxy-failure-CP26459 ---26460 duration_ms: 226.9660026461 ...26462ok 5068 parallel/test-vm-run-in-new-context26463 ---26464 duration_ms: 223.2630026465 ...26466ok 5069 parallel/test-vm-source-map-url26467 ---26468 duration_ms: 151.2790026469 ...26470ok 5070 parallel/test-vm-strict-mode26471 ---26472 duration_ms: 151.8860026473 ...26474ok 5071 parallel/test-vm-static-this26475 ---26476 duration_ms: 169.8170026477 ...26478ok 5072 parallel/test-vm-timeout-escape-promise26479 ---26480 duration_ms: 151.6790026481 ...26482ok 5073 parallel/test-vm-strict-assign26483 ---26484 duration_ms: 184.9140026485 ...26486ok 5074 parallel/test-vm-symbols26487 ---26488 duration_ms: 188.1470026489 ...26490ok 5075 parallel/test-vm-timeout-escape-promise-module26491 ---26492 duration_ms: 174.7990026493 ...26494ok 5076 parallel/test-vm-util-lazy-properties26495 ---26496 duration_ms: 179.0920026497 ...26498ok 5077 parallel/test-vm-timeout-escape-promise-226499 ---26500 duration_ms: 194.1120026501 ...26502ok 5078 parallel/test-warn-sigprof26503 ---26504 duration_ms: 178.8230026505 ...26506ok 5079 parallel/test-warn-tls-common-deprecation26507 ---26508 duration_ms: 183.8870026509 ...26510ok 5080 parallel/test-web-locks-no-livelock # skip Only works in debug mode26511 ---26512 duration_ms: 139.1570026513 ...26514ok 5081 parallel/test-vfs-watchfile26515 ---26516 duration_ms: 817.9270026517 ...26518ok 5082 parallel/test-warn-tls-wrap-deprecation26519 ---26520 duration_ms: 200.2080026521 ...26522ok 5083 parallel/test-webcrypto-aead-decrypt-detached-buffer26523 ---26524 duration_ms: 173.5110026525 ...26526ok 5084 parallel/test-wasm26527 ---26528 duration_ms: 223.4890026529 ...26530ok 5085 parallel/test-webcrypto-cryptokey-brand-check26531 ---26532 duration_ms: 173.0960026533 ...26534ok 5086 parallel/test-vm-syntax-error-stderr26535 ---26536 duration_ms: 285.2010026537 ...26538ok 5087 parallel/test-vm-syntax-error-message26539 ---26540 duration_ms: 293.0220026541 ...26542ok 5088 parallel/test-webcrypto-crypto-job-mode26543 ---26544 duration_ms: 183.5260026545 ...26546ok 5089 parallel/test-webcrypto-derivebits26547 ---26548 duration_ms: 179.1010026549 ...26550ok 5090 parallel/test-webcrypto-cryptokey-hidden-slots26551 ---26552 duration_ms: 219.3090026553 ...26554ok 5091 parallel/test-webcrypto-derivebits-cfrg26555 ---26556 duration_ms: 177.7000026557 ...26558ok 5092 parallel/test-webapi-sharedarraybuffer-rejection26559 ---26560 duration_ms: 284.0490026561 ...26562ok 5093 parallel/test-webcrypto-constructors26563 ---26564 duration_ms: 277.5240026565 ...26566ok 5094 parallel/test-web-locks-query26567 ---26568 duration_ms: 289.9750026569 ...26570ok 5095 parallel/test-v8-query-objects26571 ---26572 duration_ms: 1727.3680026573 ...26574ok 5096 parallel/test-webcrypto-derivekey-cfrg26575 ---26576 duration_ms: 173.9820026577 ...26578ok 5097 parallel/test-webcrypto-derivekey26579 ---26580 duration_ms: 179.3980026581 ...26582ok 5098 parallel/test-webcrypto-derivebits-ecdh26583 ---26584 duration_ms: 186.8900026585 ...26586ok 5099 parallel/test-watch-mode-kill-signal-invalid26587 ---26588 duration_ms: 336.6490026589 ...26590ok 5100 parallel/test-webcrypto-derivekey-ecdh26591 ---26592 duration_ms: 176.7800026593 ...26594ok 5101 parallel/test-webcrypto-derivebits-argon226595 ---26596 duration_ms: 225.2310026597 ...26598ok 5102 parallel/test-webcrypto-digest-turboshake26599 ---26600 duration_ms: 172.4890026601 ...26602ok 5103 parallel/test-vm-sigint-existing-handler26603 ---26604 duration_ms: 424.6880026605 ...26606ok 5104 parallel/test-vm-module-basic26607 ---26608 duration_ms: 730.0080026609 ...26610ok 5105 parallel/test-webcrypto-cryptokey-workers26611 ---26612 duration_ms: 272.4590026613 ...26614ok 5106 parallel/test-webcrypto-cryptokey-no-own-symbols26615 ---26616 duration_ms: 279.9090026617 ...26618ok 5107 parallel/test-webcrypto-digest26619 ---26620 duration_ms: 215.0600026621 ...26622ok 5108 parallel/test-vm-timeout26623 ---26624 duration_ms: 429.4710026625 ...26626ok 5109 parallel/test-webcrypto-encap-decap-ml-kem26627 ---26628 duration_ms: 173.9330026629 ...26630ok 5110 parallel/test-webcrypto-encrypt-decrypt-chacha20-poly130526631 ---26632 duration_ms: 180.0170026633 ...26634ok 5111 parallel/test-webcrypto-enforce-range26635 ---26636 duration_ms: 177.7530026637 ...26638ok 5112 parallel/test-vm-sigint26639 ---26640 duration_ms: 523.7270026641 ...26642ok 5113 parallel/test-webcrypto-encrypt-decrypt-aes26643 ---26644 duration_ms: 213.8370026645 ...26646ok 5114 parallel/test-webcrypto-encrypt-decrypt-rsa26647 ---26648 duration_ms: 221.8590026649 ...26650ok 5115 parallel/test-webcrypto-deduplicate-usages26651 ---26652 duration_ms: 372.5940026653 ...26654ok 5116 parallel/test-webcrypto-encrypt-decrypt26655 ---26656 duration_ms: 264.9040026657 ...26658ok 5117 parallel/test-webcrypto-fips-exceptions # skip requires OpenSSL >= 3 in FIPS mode26659 ---26660 duration_ms: 171.4120026661 ...26662ok 5118 parallel/test-webcrypto-cryptokey-clone-transfer26663 ---26664 duration_ms: 423.6790026665 ...26666ok 5119 parallel/test-webcrypto-export-import26667 ---26668 duration_ms: 214.2430026669 ...26670ok 5120 parallel/test-webcrypto-getRandomValues26671 ---26672 duration_ms: 170.6910026673 ...26674ok 5121 parallel/test-webcrypto-internal-slots26675 ---26676 duration_ms: 169.8170026677 ...26678ok 5122 parallel/test-webcrypto-keygen-kmac26679 ---26680 duration_ms: 169.9400026681 ...26682ok 5123 parallel/test-webcrypto-raw-format-aliases26683 ---26684 duration_ms: 147.8330026685 ...26686ok 5124 parallel/test-webcrypto-export-import-cfrg26687 ---26688 duration_ms: 211.8820026689 ...26690ok 5125 parallel/test-webcrypto-methods-not-async26691 ---26692 duration_ms: 173.6350026693 ...26694ok 5126 parallel/test-weakref26695 ---26696 duration_ms: 517.3990026697 ...26698ok 5127 parallel/test-watch-file-shared-dependency26699 ---26700 duration_ms: 534.3440026701 ...26702ok 5128 parallel/test-webcrypto-export-import-ml-kem26703 ---26704 duration_ms: 211.7390026705 ...26706ok 5129 parallel/test-webcrypto-export-import-ml-dsa26707 ---26708 duration_ms: 215.5480026709 ...26710ok 5130 parallel/test-webcrypto-random26711 ---26712 duration_ms: 182.7970026713 ...26714ok 5131 parallel/test-webcrypto-keygen26715 ---26716 duration_ms: 215.4930026717 ...26718ok 5132 parallel/test-web-locks26719 ---26720 duration_ms: 538.6420026721 ...26722ok 5133 parallel/test-trace-events-fs-sync26723 ---26724 duration_ms: 2737.5360026725 ...26726ok 5134 parallel/test-webcrypto-export-import-ec26727 ---26728 duration_ms: 266.4290026729 ...26730ok 5135 parallel/test-webcrypto-sign-verify-eddsa26731 ---26732 duration_ms: 213.7630026733 ...26734ok 5136 parallel/test-webcrypto-sign-verify-kmac26735 ---26736 duration_ms: 214.8820026737 ...26738ok 5137 parallel/test-webcrypto-sign-verify-hmac26739 ---26740 duration_ms: 274.7000026741 ...26742ok 5138 parallel/test-webcrypto-derivebits-hkdf26743 ---26744 duration_ms: 515.7120026745 ...26746ok 5139 parallel/test-webcrypto-util26747 ---26748 duration_ms: 216.3600026749 ...26750ok 5140 parallel/test-webstream-readable-from26751 ---26752 duration_ms: 182.0330026753 ...26754ok 5141 parallel/test-webstorage-without-sqlite26755 ---26756 duration_ms: 187.2340026757 ...26758ok 5142 parallel/test-webstream-encoding-inspect26759 ---26760 duration_ms: 189.9010026761 ...26762ok 5143 parallel/test-webstream-readablestream-pipeto26763 ---26764 duration_ms: 195.7470026765 ...26766ok 5144 parallel/test-websocket-disabled26767 ---26768 duration_ms: 222.4160026769 ...26770ok 5145 parallel/test-websocket26771 ---26772 duration_ms: 233.4410026773 ...26774ok 5146 parallel/test-webstream-string-tag26775 ---26776 duration_ms: 221.6310026777 ...26778ok 5147 parallel/test-webcrypto-get-public-key26779 ---26780 duration_ms: 410.2970026781 ...26782ok 5148 parallel/test-webstreams-clone-unref26783 ---26784 duration_ms: 207.2090026785 ...26786ok 5149 parallel/test-webstreams-compose26787 ---26788 duration_ms: 201.1220026789 ...26790ok 5150 parallel/test-webstreams-duplex-fromweb-writev-unhandled-rejection26791 ---26792 duration_ms: 181.5360026793 ...26794ok 5151 parallel/test-trace-events-fs-async26795 ---26796 duration_ms: 2926.5060026797 ...26798ok 5152 parallel/test-webcrypto-webidl26799 ---26800 duration_ms: 281.5420026801 ...26802ok 5153 parallel/test-webcrypto-sign-verify-ml-dsa26803 ---26804 duration_ms: 335.8360026805 ...26806ok 5154 parallel/test-webstreams-abort-controller26807 ---26808 duration_ms: 248.0100026809 ...26810ok 5155 parallel/test-webcrypto-supports26811 ---26812 duration_ms: 333.9730026813 ...26814ok 5156 parallel/test-webstreams-adapters-sync-write-error26815 ---26816 duration_ms: 254.2070026817 ...26818ok 5157 parallel/test-webcrypto-sign-verify-ecdsa26819 ---26820 duration_ms: 411.6920026821 ...26822ok 5158 parallel/test-webstream-structured-clone-no-leftovers26823 ---26824 duration_ms: 284.4830026825 ...26826ok 5159 parallel/test-webstreams-compression-buffer-source26827 ---26828 duration_ms: 250.0640026829 ...26830ok 5160 parallel/test-webstreams-finished26831 ---26832 duration_ms: 218.9990026833 ...26834ok 5161 parallel/test-webcrypto-export-import-rsa26835 ---26836 duration_ms: 508.6580026837 ...26838ok 5162 parallel/test-webstreams-adapters-writable-buffer-sources26839 ---26840 duration_ms: 299.8460026841 ...26842ok 5163 parallel/test-webstreams-pipeto-write-request26843 ---26844 duration_ms: 173.3310026845 ...26846ok 5164 parallel/test-whatwg-encoding-custom-interop26847 ---26848 duration_ms: 138.8420026849 ...26850ok 5165 parallel/test-webstreams-decompression-reject-trailing26851 ---26852 duration_ms: 277.9900026853 ...26854ok 5166 parallel/test-webstreams-compression-bad-chunks26855 ---26856 duration_ms: 298.0620026857 ...26858ok 5167 parallel/test-whatwg-encoding-custom-api-basics26859 ---26860 duration_ms: 169.8960026861 ...26862ok 5168 parallel/test-webstreams-pipeline26863 ---26864 duration_ms: 227.5260026865 ...26866ok 5169 parallel/test-whatwg-encoding-custom-fatal-streaming26867 ---26868 duration_ms: 171.2800026869 ...26870ok 5170 parallel/test-webcrypto-promise-prototype-pollution26871 ---26872 duration_ms: 513.1150026873 ...26874ok 5171 parallel/test-whatwg-encoding-custom-internals26875 ---26876 duration_ms: 171.1160026877 ...26878ok 5172 parallel/test-webcrypto-prototype-pollution26879 ---26880 duration_ms: 516.5150026881 ...26882ok 5173 parallel/test-whatwg-encoding-custom-textdecoder-streaming26883 ---26884 duration_ms: 137.8030026885 ...26886ok 5174 parallel/test-whatwg-encoding-custom-textdecoder26887 ---26888 duration_ms: 170.7240026889 ...26890ok 5175 parallel/test-whatwg-encoding-custom-textdecoder-api-invalid-label26891 ---26892 duration_ms: 174.3130026893 ...26894ok 5176 parallel/test-whatwg-encoding-custom-textdecoder-ignorebom26895 ---26896 duration_ms: 171.2940026897 ...26898ok 5177 parallel/test-whatwg-events-customevent26899 ---26900 duration_ms: 138.0540026901 ...26902ok 5178 parallel/test-whatwg-encoding-custom-textdecoder-invalid-arg26903 ---26904 duration_ms: 170.4310026905 ...26906ok 5179 parallel/test-whatwg-events-add-event-listener-options-passive26907 ---26908 duration_ms: 172.7220026909 ...26910ok 5180 parallel/test-whatwg-events-add-event-listener-options-signal26911 ---26912 duration_ms: 173.0520026913 ...26914ok 5181 parallel/test-webstreams-queue-wraparound26915 ---26916 duration_ms: 267.3840026917 ...26918ok 5182 parallel/test-whatwg-encoding-custom-textdecoder-fatal26919 ---26920 duration_ms: 212.3630026921 ...26922ok 5183 parallel/test-v8-serialize-leak26923 ---26924 duration_ms: 2353.8870026925 ...26926ok 5184 parallel/test-v8-stop-coverage26927 ---26928 duration_ms: 2351.1200026929 ...26930ok 5185 parallel/test-whatwg-events-event-constructors26931 ---26932 duration_ms: 176.2180026933 ...26934ok 5186 parallel/test-webcrypto-sign-verify-rsa26935 ---26936 duration_ms: 521.7200026937 ...26938ok 5187 parallel/test-whatwg-events-eventtarget-this-of-listener26939 ---26940 duration_ms: 176.4310026941 ...26942ok 5188 parallel/test-whatwg-encoding-custom-textdecoder-utf16-surrogates26943 ---26944 duration_ms: 212.2580026945 ...26946ok 5189 parallel/test-whatwg-readablebytestream-bad-buffers-and-views26947 ---26948 duration_ms: 173.9590026949 ...26950ok 5190 parallel/test-whatwg-readablebytestreambyob26951 ---26952 duration_ms: 170.2940026953 ...26954ok 5191 parallel/test-whatwg-readablestream26955 ---26956 duration_ms: 171.4100026957 ...26958ok 5192 parallel/test-whatwg-url-custom-properties26959 ---26960 duration_ms: 136.8320026961 ...26962ok 5193 parallel/test-whatwg-readablestream-byob-read-min26963 ---26964 duration_ms: 173.3600026965 ...26966ok 5194 parallel/test-webworker-ref-unref26967 ---26968 duration_ms: 328.4620026969 ...26970ok 5195 parallel/test-whatwg-headers26971 ---26972 duration_ms: 222.9630026973 ...26974ok 5196 parallel/test-whatwg-transformstream26975 ---26976 duration_ms: 173.4950026977 ...26978ok 5197 parallel/test-whatwg-readablebytestream26979 ---26980 duration_ms: 217.2490026981 ...26982ok 5198 parallel/test-whatwg-url-custom-deepequal26983 ---26984 duration_ms: 173.8540026985 ...26986ok 5199 parallel/test-whatwg-url-custom-global26987 ---26988 duration_ms: 174.4260026989 ...26990ok 5200 parallel/test-whatwg-url-custom-inspect26991 ---26992 duration_ms: 174.5430026993 ...26994ok 5201 parallel/test-whatwg-url-custom-href-side-effect26995 ---26996 duration_ms: 174.6400026997 ...26998ok 5202 parallel/test-whatwg-url-custom-parsing26999 ---27000 duration_ms: 174.3070027001 ...27002ok 5203 parallel/test-whatwg-readablestream27003 ---27004 duration_ms: 217.8270027005 ...27006ok 5204 parallel/test-whatwg-url-custom-searchparams27007 ---27008 duration_ms: 168.7700027009 ...27010ok 5205 parallel/test-whatwg-url-custom-searchparams-foreach27011 ---27012 duration_ms: 137.8920027013 ...27014ok 5206 parallel/test-whatwg-url-custom-searchparams-append27015 ---27016 duration_ms: 169.8370027017 ...27018ok 5207 parallel/test-whatwg-transformstream-cancel-write-race27019 ---27020 duration_ms: 213.4330027021 ...27022ok 5208 parallel/test-whatwg-url-canparse27023 ---27024 duration_ms: 213.8560027025 ...27026ok 5209 parallel/test-whatwg-url-custom-searchparams-get27027 ---27028 duration_ms: 137.4120027029 ...27030ok 5210 parallel/test-whatwg-url-custom-searchparams-has27031 ---27032 duration_ms: 135.7600027033 ...27034ok 5211 parallel/test-whatwg-url-custom-searchparams-constructor27035 ---27036 duration_ms: 169.5420027037 ...27038ok 5212 parallel/test-webcrypto-sign-verify27039 ---27040 duration_ms: 712.0800027041 ...27042ok 5213 parallel/test-whatwg-url-custom-searchparams-delete27043 ---27044 duration_ms: 169.8980027045 ...27046ok 5214 parallel/test-whatwg-url-custom-searchparams-entries27047 ---27048 duration_ms: 170.8190027049 ...27050ok 5215 parallel/test-whatwg-encoding-singlebyte27051 ---27052 duration_ms: 332.3260027053 ...27054ok 5216 parallel/test-whatwg-url-custom-searchparams-values27055 ---27056 duration_ms: 136.4040027057 ...27058ok 5217 parallel/test-whatwg-url-custom-searchparams-stringifier27059 ---27060 duration_ms: 137.1250027061 ...27062ok 5218 parallel/test-whatwg-url-custom-setters27063 ---27064 duration_ms: 137.1410027065 ...27066ok 5219 parallel/test-whatwg-url-custom-searchparams-getall27067 ---27068 duration_ms: 170.1850027069 ...27070ok 5220 parallel/test-webcrypto-digest-turboshake-rfc27071 ---27072 duration_ms: 916.9970027073 ...27074ok 5221 parallel/test-whatwg-url-custom-searchparams-inspect27075 ---27076 duration_ms: 169.2320027077 ...27078ok 5222 parallel/test-whatwg-url-override-hostname27079 ---27080 duration_ms: 109.9810027081 ...27082ok 5223 parallel/test-whatwg-url-custom-tostringtag27083 ---27084 duration_ms: 136.7220027085 ...27086ok 5224 parallel/test-whatwg-url-invalidthis27087 ---27088 duration_ms: 135.3480027089 ...27090ok 5225 parallel/test-whatwg-url-custom-searchparams-keys27091 ---27092 duration_ms: 169.0670027093 ...27094ok 5226 parallel/test-whatwg-url-custom-searchparams-set27095 ---27096 duration_ms: 170.6550027097 ...27098ok 5227 parallel/test-whatwg-url-custom-searchparams-sort27099 ---27100 duration_ms: 169.1110027101 ...27102ok 5228 parallel/test-tick-processor-arguments27103 ---27104 duration_ms: 5171.1160027105 ...27106ok 5229 parallel/test-whatwg-url-parse-fast-path27107 ---27108 duration_ms: 136.5590027109 ...27110ok 5230 parallel/test-whatwg-url-properties27111 ---27112 duration_ms: 170.6730027113 ...27114ok 5231 parallel/test-whatwg-url-searchparams-fast-path27115 ---27116 duration_ms: 170.9310027117 ...27118ok 5232 parallel/test-whatwg-webstreams-adapters-streambase27119 ---27120 duration_ms: 170.7600027121 ...27122ok 5233 parallel/test-whatwg-webstreams-adapters-to-readablewritablepair27123 ---27124 duration_ms: 168.4530027125 ...27126ok 5234 parallel/test-windows-abort-exitcode # skip test is windows specific27127 ---27128 duration_ms: 138.5230027129 ...27130ok 5235 parallel/test-whatwg-webstreams-adapters-to-streamreadable27131 ---27132 duration_ms: 172.3140027133 ...27134ok 5236 parallel/test-windows-failed-heap-allocation # skip Windows-only27135 ---27136 duration_ms: 138.2500027137 ...27138ok 5237 parallel/test-whatwg-webstreams-adapters-to-streamwritable27139 ---27140 duration_ms: 171.2970027141 ...27142ok 5238 parallel/test-whatwg-webstreams-coverage27143 ---27144 duration_ms: 171.6650027145 ...27146ok 5239 parallel/test-whatwg-webstreams-encoding27147 ---27148 duration_ms: 175.8470027149 ...27150ok 5240 parallel/test-whatwg-writablestream27151 ---27152 duration_ms: 170.8340027153 ...27154ok 5241 parallel/test-whatwg-webstreams-transform-stream-members27155 ---27156 duration_ms: 174.4340027157 ...27158ok 5242 parallel/test-whatwg-webstreams-adapters-to-readablestream27159 ---27160 duration_ms: 213.9370027161 ...27162ok 5243 parallel/test-whatwg-webstreams-adapters-to-streamduplex27163 ---27164 duration_ms: 212.5110027165 ...27166ok 5244 parallel/test-whatwg-webstreams-compression27167 ---27168 duration_ms: 213.5090027169 ...27170ok 5245 parallel/test-whatwg-webstreams-adapters-to-writablestream27171 ---27172 duration_ms: 216.8700027173 ...27174ok 5246 parallel/test-whatwg-writablestream-close27175 ---27176 duration_ms: 212.1380027177 ...27178ok 5247 parallel/test-worker27179 ---27180 duration_ms: 218.7200027181 ...27182ok 5248 parallel/test-worker-cjs-workerdata27183 ---27184 duration_ms: 219.4800027185 ...27186ok 5249 parallel/test-worker-beforeexit-throw-exit27187 ---27188 duration_ms: 227.6260027189 ...27190ok 5250 parallel/test-worker-cleanup-handles27191 ---27192 duration_ms: 229.5860027193 ...27194ok 5251 parallel/test-worker27195 ---27196 duration_ms: 275.2910027197 ...27198ok 5252 parallel/test-worker-cwd-race-condition27199 ---27200 duration_ms: 217.2710027201 ...27202ok 5253 parallel/test-worker-broadcastchannel-wpt27203 ---27204 duration_ms: 272.7020027205 ...27206ok 5254 parallel/test-worker-abort-on-uncaught-exception27207 ---27208 duration_ms: 331.1020027209 ...27210ok 5255 parallel/test-worker-dispose27211 ---27212 duration_ms: 232.3640027213 ...27214ok 5256 parallel/test-worker-crypto-sign-transfer-result27215 ---27216 duration_ms: 283.5780027217 ...27218ok 5257 parallel/test-worker-cpu-usage27219 ---27220 duration_ms: 285.0450027221 ...27222ok 5258 parallel/test-worker-execargv-invalid27223 ---27224 duration_ms: 181.1130027225 ...27226ok 5259 parallel/test-worker-broadcastchannel27227 ---27228 duration_ms: 345.2690027229 ...27230ok 5260 parallel/test-worker-esm-exit27231 ---27232 duration_ms: 236.7600027233 ...27234ok 5261 parallel/test-worker-error-stack-getter-throws27235 ---27236 duration_ms: 245.1760027237 ...27238ok 5262 parallel/test-worker-cpu-profile27239 ---27240 duration_ms: 334.7760027241 ...27242ok 5263 parallel/test-worker-event27243 ---27244 duration_ms: 223.9560027245 ...27246ok 5264 parallel/test-whatwg-webstreams-transfer27247 ---27248 duration_ms: 414.1180027249 ...27250ok 5265 parallel/test-worker-dns-terminate-during-query27251 ---27252 duration_ms: 273.4730027253 ...27254ok 5266 parallel/test-worker-dns-terminate27255 ---27256 duration_ms: 282.9000027257 ...27258ok 5267 parallel/test-worker-esmodule27259 ---27260 duration_ms: 246.2740027261 ...27262ok 5268 parallel/test-worker-exit-event-error27263 ---27264 duration_ms: 224.1740027265 ...27266ok 5269 parallel/test-worker-data-url27267 ---27268 duration_ms: 346.7580027269 ...27270ok 5270 parallel/test-worker-abort-on-uncaught-exception-terminate27271 ---27272 duration_ms: 411.9120027273 ...27274ok 5271 parallel/test-worker-exit-from-uncaught-exception27275 ---27276 duration_ms: 241.8670027277 ...27278ok 5272 parallel/test-worker-error-primitive27279 ---27280 duration_ms: 311.8240027281 ...27282ok 5273 parallel/test-worker-cleanexit-with-js27283 ---27284 duration_ms: 423.9300027285 ...27286ok 5274 parallel/test-worker-execargv27287 ---27288 duration_ms: 305.0650027289 ...27290ok 5275 parallel/test-worker-console-listeners27291 ---27292 duration_ms: 427.2690027293 ...27294ok 5276 parallel/test-worker-heapdump-failure27295 ---27296 duration_ms: 186.9820027297 ...27298ok 5277 parallel/test-worker-hasref27299 ---27300 duration_ms: 242.2510027301 ...27302ok 5278 parallel/test-worker-esm-missing-main27303 ---27304 duration_ms: 360.7350027305 ...27306ok 5279 parallel/test-worker-heap-profile27307 ---27308 duration_ms: 234.2890027309 ...27310ok 5280 parallel/test-worker-heap-statistics27311 ---27312 duration_ms: 228.0830027313 ...27314ok 5281 parallel/test-worker-arraybuffer-zerofill27315 ---27316 duration_ms: 518.0320027317 ...27318ok 5282 parallel/test-worker-fs-stat-watcher27319 ---27320 duration_ms: 292.4680027321 ...27322ok 5283 parallel/test-worker-exit-code27323 ---27324 duration_ms: 367.7690027325 ...27326ok 5284 parallel/test-worker-message-port-arraybuffer27327 ---27328 duration_ms: 151.1530027329 ...27330ok 5285 parallel/test-worker-invalid-workerdata27331 ---27332 duration_ms: 195.5910027333 ...27334ok 5286 parallel/test-worker-message-port-constructor27335 ---27336 duration_ms: 142.5580027337 ...27338ok 5287 parallel/test-worker-message-port-close-while-receiving27339 ---27340 duration_ms: 147.1290027341 ...27342ok 5288 parallel/test-worker-cleanexit-with-moduleload27343 ---27344 duration_ms: 523.6600027345 ...27346ok 5289 parallel/test-worker-cli-options27347 ---27348 duration_ms: 529.0450027349 ...27350ok 5290 parallel/test-watch-mode-kill-signal-default27351 ---27352 duration_ms: 1653.8090027353 ...27354ok 5291 parallel/test-worker-environmentdata27355 ---27356 duration_ms: 441.9040027357 ...27358ok 5292 parallel/test-worker-message-port-close27359 ---27360 duration_ms: 174.6530027361 ...27362ok 5293 parallel/test-worker-message-port-infinite-message-loop27363 ---27364 duration_ms: 151.8110027365 ...27366ok 5294 parallel/test-worker-message-event27367 ---27368 duration_ms: 218.9970027369 ...27370ok 5295 parallel/test-worker-message-port-inspect-during-init-hook27371 ---27372 duration_ms: 150.5790027373 ...27374ok 5296 parallel/test-worker-http2-generic-streams-terminate27375 ---27376 duration_ms: 274.9940027377 ...27378ok 5297 parallel/test-worker-message-port27379 ---27380 duration_ms: 219.8590027381 ...27382ok 5298 parallel/test-worker-message-not-serializable27383 ---27384 duration_ms: 224.3980027385 ...27386ok 5299 parallel/test-worker-message-mark-as-uncloneable27387 ---27388 duration_ms: 228.5450027389 ...27390ok 5300 parallel/test-worker-message-channel27391 ---27392 duration_ms: 238.5630027393 ...27394ok 5301 parallel/test-worker-message-port-jstransferable-nested-untransferable27395 ---27396 duration_ms: 153.9800027397 ...27398ok 5302 parallel/test-worker-load-file-with-extension-other-than-js27399 ---27400 duration_ms: 268.6140027401 ...27402ok 5303 parallel/test-watch-mode-kill-signal-override27403 ---27404 duration_ms: 1721.7310027405 ...27406ok 5304 parallel/test-worker-message-port-message-port-transferring27407 ---27408 duration_ms: 163.5450027409 ...27410ok 5305 parallel/test-worker-message-channel-sharedarraybuffer27411 ---27412 duration_ms: 270.1180027413 ...27414ok 5306 parallel/test-worker-message-port-move27415 ---27416 duration_ms: 159.6150027417 ...27418ok 5307 parallel/test-worker-message-port-drain27419 ---27420 duration_ms: 232.7470027421 ...27422ok 5308 parallel/test-worker-internal-modules27423 ---27424 duration_ms: 339.0930027425 ...27426ok 5309 parallel/test-worker-message-port-multiple-sharedarraybuffers27427 ---27428 duration_ms: 181.4640027429 ...27430ok 5310 parallel/test-worker-message-port-receive-message27431 ---27432 duration_ms: 180.6560027433 ...27434ok 5311 parallel/test-worker-message-port-transfer-duplicate27435 ---27436 duration_ms: 171.8240027437 ...27438ok 5312 parallel/test-worker-message-port-transfer-fake-js-transferable-internal27439 ---27440 duration_ms: 165.2590027441 ...27442ok 5313 parallel/test-worker-message-port-transfer-native27443 ---27444 duration_ms: 166.2320027445 ...27446ok 5314 parallel/test-worker-message-port-transfer-closed27447 ---27448 duration_ms: 202.4700027449 ...27450ok 5315 parallel/test-worker-debug27451 ---27452 duration_ms: 633.9590027453 ...27454ok 5316 parallel/test-worker-message-port-transfer-target27455 ---27456 duration_ms: 179.4680027457 ...27458ok 5317 parallel/test-worker-message-port-transfer-filehandle27459 ---27460 duration_ms: 217.7330027461 ...27462ok 5318 parallel/test-worker-message-port-transfer-fake-js-transferable27463 ---27464 duration_ms: 236.3390027465 ...27466ok 5319 parallel/test-worker-message-port-transfer-self27467 ---27468 duration_ms: 252.4530027469 ...27470ok 5320 parallel/test-worker-messageport-hasref27471 ---27472 duration_ms: 214.8060027473 ...27474ok 5321 parallel/test-worker-heap-snapshot27475 ---27476 duration_ms: 549.1210027477 ...27478ok 5322 parallel/test-worker-message-port-wasm-module27479 ---27480 duration_ms: 254.9620027481 ...27482ok 5323 parallel/test-worker-message-port-transfer-terminate27483 ---27484 duration_ms: 260.8480027485 ...27486ok 5324 parallel/test-webcrypto-wrap-unwrap27487 ---27488 duration_ms: 1432.4730027489 ...27490ok 5325 parallel/test-worker-exit-heapsnapshot27491 ---27492 duration_ms: 651.5670027493 ...27494ok 5326 parallel/test-worker-sharedarraybuffer-from-worker-thread27495 ---27496 duration_ms: 572.1580027497 ...27498ok 5327 parallel/test-worker-nexttick-terminate27499 ---27500 duration_ms: 757.3030027501 ...27502ok 5328 parallel/test-worker-message-transfer-port-mark-as-untransferable27503 ---27504 duration_ms: 830.1260027505 ...27506ok 5329 parallel/test-worker-name27507 ---27508 duration_ms: 791.7090027509 ...27510ok 5330 parallel/test-worker-messaging-errors-handler27511 ---27512 duration_ms: 800.2810027513 ...27514ok 5331 parallel/test-worker-message-port-wasm-threads27515 ---27516 duration_ms: 833.3800027517 ...27518ok 5332 parallel/test-worker-safe-getters27519 ---27520 duration_ms: 574.7480027521 ...27522ok 5333 parallel/test-worker-resource-limits27523 ---27524 duration_ms: 584.5620027525 ...27526ok 5334 parallel/test-worker-relative-path27527 ---27528 duration_ms: 592.2340027529 ...27530ok 5335 parallel/test-worker-relative-path-double-dot27531 ---27532 duration_ms: 591.4260027533 ...27534ok 5336 parallel/test-worker-ref-onexit27535 ---27536 duration_ms: 601.2540027537 ...27538ok 5337 parallel/test-worker-process-env-shared27539 ---27540 duration_ms: 675.0950027541 ...27542ok 5338 parallel/test-worker-process-exit-async-module27543 ---27544 duration_ms: 658.7330027545 ...27546ok 5339 parallel/test-worker-ref27547 ---27548 duration_ms: 644.4740027549 ...27550ok 5340 parallel/test-worker-process-cwd27551 ---27552 duration_ms: 697.8580027553 ...27554ok 5341 parallel/test-worker-process-env27555 ---27556 duration_ms: 697.3410027557 ...27558ok 5342 parallel/test-worker-process-argv27559 ---27560 duration_ms: 707.4480027561 ...27562ok 5343 parallel/test-worker-onmessage-not-a-function27563 ---27564 duration_ms: 728.8180027565 ...27566ok 5344 parallel/test-worker-on-process-exit27567 ---27568 duration_ms: 756.7290027569 ...27570ok 5345 parallel/test-worker-node-options27571 ---27572 duration_ms: 767.2290027573 ...27574ok 5346 parallel/test-worker-onmessage27575 ---27576 duration_ms: 756.4660027577 ...27578ok 5347 parallel/test-worker-non-fatal-uncaught-exception27579 ---27580 duration_ms: 763.5280027581 ...27582ok 5348 parallel/test-worker-parent-port-ref27583 ---27584 duration_ms: 729.5090027585 ...27586ok 5349 parallel/test-worker-nested-on-process-exit27587 ---27588 duration_ms: 812.7880027589 ...27590ok 5350 parallel/test-worker-nested-uncaught27591 ---27592 duration_ms: 804.5420027593 ...27594ok 5351 parallel/test-worker-no-sab27595 ---27596 duration_ms: 799.4470027597 ...27598ok 5352 parallel/test-worker-no-stdin-stdout-interaction27599 ---27600 duration_ms: 796.7040027601 ...27602ok 5353 parallel/test-worker-mjs-workerdata27603 ---27604 duration_ms: 841.8010027605 ...27606ok 5354 parallel/test-worker-nearheaplimit-deadlock27607 ---27608 duration_ms: 835.7910027609 ...27610ok 5355 parallel/test-worker-messaging-errors-invalid27611 ---27612 duration_ms: 848.9920027613 ...27614ok 5356 parallel/test-worker-messaging27615 ---27616 duration_ms: 868.4030027617 ...27618ok 5357 parallel/test-worker-messaging-errors-timeout27619 ---27620 duration_ms: 859.7980027621 ...27622ok 5358 parallel/test-worker-message-type-unknown27623 ---27624 duration_ms: 877.4410027625 ...27626ok 5359 parallel/test-worker-message-port-terminate-transfer-list27627 ---27628 duration_ms: 978.4150027629 ...27630ok 5360 parallel/test-worker-eval-typescript27631 ---27632 duration_ms: 1350.6820027633 ...27634ok 5361 parallel/test-worker-message-port-message-before-close27635 ---27636 duration_ms: 1036.4510027637 ...27638ok 5362 parallel/test-worker-init-failure27639 ---27640 duration_ms: 1171.4570027641 ...27642ok 5363 parallel/test-worker-http2-stream-terminate27643 ---27644 duration_ms: 1172.9430027645 ...27646ok 5364 parallel/test-worker-memory27647 ---27648 duration_ms: 1132.7660027649 ...27650ok 5365 parallel/test-trace-events-http27651 ---27652 duration_ms: 4737.1800027653 ...27654ok 5366 parallel/test-webstorage27655 ---27656 duration_ms: 2093.0720027657 ...27658ok 5367 parallel/test-worker-terminate-microtask-loop27659 ---27660 duration_ms: 182.0700027661 ...27662ok 5368 parallel/test-worker-syntax-error-file27663 ---27664 duration_ms: 189.1620027665 ...27666ok 5369 parallel/test-worker-stdio-flush27667 ---27668 duration_ms: 190.4050027669 ...27670ok 5370 parallel/test-worker-type-check27671 ---27672 duration_ms: 166.4150027673 ...27674ok 5371 parallel/test-worker-terminate-unrefed27675 ---27676 duration_ms: 187.6900027677 ...27678ok 5372 parallel/test-worker-stack-overflow27679 ---27680 duration_ms: 222.9670027681 ...27682ok 5373 parallel/test-worker-unsupported-path27683 ---27684 duration_ms: 187.7190027685 ...27686ok 5374 parallel/test-worker-uncaught-exception-async27687 ---27688 duration_ms: 195.8210027689 ...27690ok 5375 parallel/test-worker-uncaught-exception27691 ---27692 duration_ms: 197.6570027693 ...27694ok 5376 parallel/test-worker-stdio-flush-inflight27695 ---27696 duration_ms: 228.3880027697 ...27698ok 5377 parallel/test-worker-workerdata-messageport27699 ---27700 duration_ms: 185.1580027701 ...27702ok 5378 parallel/test-worker-terminate-ref-public-port27703 ---27704 duration_ms: 228.5950027705 ...27706ok 5379 parallel/test-wrap-js-stream-destroy27707 ---27708 duration_ms: 181.0890027709 ...27710ok 5380 parallel/test-wrap-js-stream-duplex27711 ---27712 duration_ms: 182.4290027713 ...27714ok 5381 parallel/test-wrap-js-stream-exceptions27715 ---27716 duration_ms: 182.2150027717 ...27718ok 5382 parallel/test-worker-terminate-null-handler27719 ---27720 duration_ms: 234.3000027721 ...27722ok 5383 parallel/test-worker-terminate-timers27723 ---27724 duration_ms: 231.4200027725 ...27726ok 5384 parallel/test-worker-terminate-http2-respond-with-file27727 ---27728 duration_ms: 252.0350027729 ...27730ok 5385 parallel/test-worker-unsupported-eval-on-url27731 ---27732 duration_ms: 224.8350027733 ...27734ok 5386 parallel/test-zlib-brotli-flush27735 ---27736 duration_ms: 154.8490027737 ...27738ok 5387 parallel/test-worker-thread-name27739 ---27740 duration_ms: 237.3790027741 ...27742ok 5388 parallel/test-wrap-js-stream-read-stop27743 ---27744 duration_ms: 187.8470027745 ...27746ok 5389 parallel/test-worker-voluntarily-exit-followed-by-addition27747 ---27748 duration_ms: 225.5580027749 ...27750ok 5390 parallel/test-worker-unsupported-things27751 ---27752 duration_ms: 228.6020027753 ...27754ok 5391 parallel/test-worker-spec-differences27755 ---27756 duration_ms: 275.7230027757 ...27758ok 5392 parallel/test-worker-stdio27759 ---27760 duration_ms: 271.7640027761 ...27762ok 5393 parallel/test-worker-terminate-nested27763 ---27764 duration_ms: 266.1720027765 ...27766ok 5394 parallel/test-worker-syntax-error27767 ---27768 duration_ms: 270.0400027769 ...27770ok 5395 parallel/test-zlib-brotli-flush-invalid-kind27771 ---27772 duration_ms: 170.8400027773 ...27774ok 5396 parallel/test-worker-voluntarily-exit-followed-by-throw27775 ---27776 duration_ms: 231.4370027777 ...27778ok 5397 parallel/test-worker-vm-context-terminate27779 ---27780 duration_ms: 235.8510027781 ...27782ok 5398 parallel/test-worker-workerdata-sharedarraybuffer27783 ---27784 duration_ms: 230.9040027785 ...27786ok 5399 parallel/test-worker-stdio-from-preload-module27787 ---27788 duration_ms: 279.9620027789 ...27790ok 5400 parallel/test-worker-terminate-source-map27791 ---27792 duration_ms: 269.7330027793 ...27794ok 5401 parallel/test-zlib-brotli-dictionary27795 ---27796 duration_ms: 186.1980027797 ...27798ok 5402 parallel/test-worker-track-unmanaged-fds27799 ---27800 duration_ms: 275.4800027801 ...27802ok 5403 parallel/test-worker-unref-from-message-during-exit27803 ---27804 duration_ms: 278.6520027805 ...27806ok 5404 parallel/test-zlib-brotli27807 ---27808 duration_ms: 220.8270027809 ...27810ok 5405 parallel/test-zlib-close-after-error27811 ---27812 duration_ms: 135.2730027813 ...27814ok 5406 parallel/test-zlib-brotli-from-string27815 ---27816 duration_ms: 139.4250027817 ...27818ok 5407 parallel/test-zlib-brotli-from-brotli27819 ---27820 duration_ms: 175.7190027821 ...27822ok 5408 parallel/test-zlib-brotli-kmaxlength-rangeerror27823 ---27824 duration_ms: 171.9370027825 ...27826ok 5409 parallel/test-zlib-crc3227827 ---27828 duration_ms: 139.8960027829 ...27830ok 5410 parallel/test-zlib-create-raw27831 ---27832 duration_ms: 140.1060027833 ...27834ok 5411 parallel/test-zlib-const27835 ---27836 duration_ms: 148.7470027837 ...27838ok 5412 parallel/test-zlib-no-stream27839 ---27840 duration_ms: 91.2600027841 ...27842ok 5413 parallel/test-zlib-destroy27843 ---27844 duration_ms: 142.8260027845 ...27846ok 5414 parallel/test-zlib-close-after-write27847 ---27848 duration_ms: 175.1200027849 ...27850ok 5415 parallel/test-zlib-flush-drain27851 ---27852 duration_ms: 131.3060027853 ...27854ok 5416 parallel/test-zlib-deflate-raw-inherits27855 ---27856 duration_ms: 177.4110027857 ...27858ok 5417 parallel/test-zlib-deflate-constructors27859 ---27860 duration_ms: 184.7600027861 ...27862ok 5418 parallel/test-zlib-dictionary-fail27863 ---27864 duration_ms: 176.1620027865 ...27866ok 5419 parallel/test-zlib-dictionary27867 ---27868 duration_ms: 178.6040027869 ...27870ok 5420 parallel/test-zlib-empty-buffer27871 ---27872 duration_ms: 176.1820027873 ...27874ok 5421 parallel/test-zlib-failed-init27875 ---27876 duration_ms: 172.0540027877 ...27878ok 5422 parallel/test-zlib-kmaxlength-rangeerror27879 ---27880 duration_ms: 152.7980027881 ...27882ok 5423 parallel/test-zlib-not-string-or-buffer27883 ---27884 duration_ms: 145.4450027885 ...27886ok 5424 parallel/test-zlib-invalid-arg-value-brotli-compress27887 ---27888 duration_ms: 162.3360027889 ...27890ok 5425 parallel/test-zlib-negative-zero27891 ---27892 duration_ms: 154.2920027893 ...27894ok 5426 parallel/test-zlib-flush-drain-longblock27895 ---27896 duration_ms: 180.9410027897 ...27898ok 5427 parallel/test-zlib-flush-flags27899 ---27900 duration_ms: 182.2910027901 ...27902ok 5428 parallel/test-zlib-flush27903 ---27904 duration_ms: 187.0010027905 ...27906ok 5429 parallel/test-zlib-flush-write-sync-interleaved27907 ---27908 duration_ms: 185.0450027909 ...27910ok 5430 parallel/test-zlib-from-gzip27911 ---27912 duration_ms: 181.3790027913 ...27914ok 5431 parallel/test-worker-stack-overflow-stack-size27915 ---27916 duration_ms: 460.6620027917 ...27918ok 5432 parallel/test-zlib-invalid-input27919 ---27920 duration_ms: 180.2570027921 ...27922ok 5433 parallel/test-zlib-from-gzip-with-trailing-garbage27923 ---27924 duration_ms: 186.6990027925 ...27926ok 5434 parallel/test-zlib-from-concatenated-gzip27927 ---27928 duration_ms: 191.5180027929 ...27930ok 5435 parallel/test-zlib-params27931 ---27932 duration_ms: 149.7330027933 ...27934ok 5436 parallel/test-zlib-from-string27935 ---27936 duration_ms: 188.6470027937 ...27938ok 5437 parallel/test-zlib-maxOutputLength27939 ---27940 duration_ms: 183.7310027941 ...27942ok 5438 parallel/test-zlib-object-write27943 ---27944 duration_ms: 179.9230027945 ...27946ok 5439 parallel/test-zlib-close-in-ondata27947 ---27948 duration_ms: 268.5760027949 ...27950ok 5440 parallel/test-v8-take-coverage-noop27951 ---27952 duration_ms: 4362.5040027953 ...27954ok 5441 parallel/test-zlib-random-byte-pipes27955 ---27956 duration_ms: 171.3690027957 ...27958ok 5442 parallel/test-zlib-invalid-input-memory27959 ---27960 duration_ms: 226.0100027961 ...27962ok 5443 parallel/test-zlib-sync-no-event27963 ---27964 duration_ms: 156.5990027965 ...27966ok 5444 parallel/test-zlib-reset-during-write27967 ---27968 duration_ms: 163.1440027969 ...27970ok 5445 parallel/test-zlib-write-after-close27971 ---27972 duration_ms: 141.2630027973 ...27974ok 5446 parallel/test-zlib-reset-before-write27975 ---27976 duration_ms: 169.8310027977 ...27978ok 5447 parallel/test-zlib-premature-end27979 ---27980 duration_ms: 222.4370027981 ...27982ok 5448 parallel/test-zlib-reject-garbage-after-end27983 ---27984 duration_ms: 213.0090027985 ...27986ok 5449 parallel/test-zlib-truncated27987 ---27988 duration_ms: 194.1090027989 ...27990ok 5450 parallel/test-zlib-convenience-methods27991 ---27992 duration_ms: 337.7310027993 ...27994ok 5451 parallel/test-zlib-unzip-one-byte-chunks27995 ---27996 duration_ms: 181.9470027997 ...27998ok 5452 parallel/test-zlib-destroy-pipe27999 ---28000 duration_ms: 339.3120028001 ...28002ok 5453 parallel/test-zlib-write-after-flush28003 ---28004 duration_ms: 173.1350028005 ...28006ok 5454 parallel/test-zlib-zero-byte28007 ---28008 duration_ms: 178.2580028009 ...28010ok 5455 parallel/test-v8-take-coverage28011 ---28012 duration_ms: 4478.9650028013 ...28014ok 5456 parallel/test-zlib-type-error28015 ---28016 duration_ms: 228.9620028017 ...28018ok 5457 parallel/test-zlib-write-after-end28019 ---28020 duration_ms: 214.5960028021 ...28022ok 5458 parallel/test-zlib-zero-windowBits28023 ---28024 duration_ms: 185.0800028025 ...28026ok 5459 parallel/test-zlib-unused-weak28027 ---28028 duration_ms: 233.5000028029 ...28030ok 5460 parallel/test-zlib-zip-edgecases28031 ---28032 duration_ms: 218.8690028033 ...28034ok 5461 parallel/test-zlib-zstd-flush28035 ---28036 duration_ms: 155.4390028037 ...28038ok 5462 parallel/test-zlib-zip-internals28039 ---28040 duration_ms: 225.4220028041 ...28042ok 5463 parallel/test-zlib-zip-metadata28043 ---28044 duration_ms: 222.3000028045 ...28046ok 5464 parallel/test-zlib-zstd-dictionary28047 ---28048 duration_ms: 196.5600028049 ...28050ok 5465 parallel/test-zlib-zstd-from-string28051 ---28052 duration_ms: 188.8640028053 ...28054ok 5466 parallel/test-zlib-zip28055 ---28056 duration_ms: 270.8970028057 ...28058ok 5467 sea/test-build-sea-custom-argv0 # skip Running the resultant binary fails with `/home/iojs/node-tmp/.tmp.2379/sea: error while loading shared libraries: libicui18n.so.71: cannot open shared object file: No such file or directory`.28059 ---28060 duration_ms: 150.8100028061 ...28062ok 5468 parallel/test-zlib-zip-encoding28063 ---28064 duration_ms: 271.5140028065 ...28066ok 5469 parallel/test-zlib-zstd28067 ---28068 duration_ms: 223.5080028069 ...28070ok 5470 sea/test-build-sea # skip Running the resultant binary fails with `/home/iojs/node-tmp/.tmp.2379/sea: error while loading shared libraries: libicui18n.so.71: cannot open shared object file: No such file or directory`.28071 ---28072 duration_ms: 180.6780028073 ...28074ok 5471 parallel/test-zlib-zstd-from-zstd28075 ---28076 duration_ms: 201.8980028077 ...28078ok 5472 sea/test-build-sea-executable-field # skip Running the resultant binary fails with `/home/iojs/node-tmp/.tmp.2379/sea: error while loading shared libraries: libicui18n.so.71: cannot open shared object file: No such file or directory`.28079 ---28080 duration_ms: 149.3410028081 ...28082ok 5473 sea/test-build-sea-config-not-found # skip Running the resultant binary fails with `/home/iojs/node-tmp/.tmp.2379/sea: error while loading shared libraries: libicui18n.so.71: cannot open shared object file: No such file or directory`.28083 ---28084 duration_ms: 177.9850028085 ...28086ok 5474 sea/test-build-sea-elf-segments # skip Running the resultant binary fails with `/home/iojs/node-tmp/.tmp.2379/sea: error while loading shared libraries: libicui18n.so.71: cannot open shared object file: No such file or directory`.28087 ---28088 duration_ms: 152.9120028089 ...28090ok 5475 sea/test-build-sea-already-exists # skip Running the resultant binary fails with `/home/iojs/node-tmp/.tmp.2379/sea: error while loading shared libraries: libicui18n.so.71: cannot open shared object file: No such file or directory`.28091 ---28092 duration_ms: 190.7550028093 ...28094ok 5476 parallel/test-zlib-zstd-kmaxlength-rangeerror28095 ---28096 duration_ms: 200.6700028097 ...28098ok 5477 parallel/test-zlib-zip-vfs28099 ---28100 duration_ms: 268.6050028101 ...28102ok 5478 sea/test-build-sea-invalid-boolean-fields # skip Running the resultant binary fails with `/home/iojs/node-tmp/.tmp.2379/sea: error while loading shared libraries: libicui18n.so.71: cannot open shared object file: No such file or directory`.28103 ---28104 duration_ms: 166.7170028105 ...28106ok 5479 sea/test-build-sea-invalid-exec-argv # skip Running the resultant binary fails with `/home/iojs/node-tmp/.tmp.2379/sea: error while loading shared libraries: libicui18n.so.71: cannot open shared object file: No such file or directory`.28107 ---28108 duration_ms: 166.6290028109 ...28110ok 5480 sea/test-build-sea-invalid-json # skip Running the resultant binary fails with `/home/iojs/node-tmp/.tmp.2379/sea: error while loading shared libraries: libicui18n.so.71: cannot open shared object file: No such file or directory`.28111 ---28112 duration_ms: 159.9660028113 ...28114ok 5481 sea/test-build-sea-missing-main # skip Running the resultant binary fails with `/home/iojs/node-tmp/.tmp.2379/sea: error while loading shared libraries: libicui18n.so.71: cannot open shared object file: No such file or directory`.28115 ---28116 duration_ms: 155.4500028117 ...28118ok 5482 sea/test-build-sea-invalid-assets # skip Running the resultant binary fails with `/home/iojs/node-tmp/.tmp.2379/sea: error while loading shared libraries: libicui18n.so.71: cannot open shared object file: No such file or directory`.28119 ---28120 duration_ms: 197.1740028121 ...28122ok 5483 parallel/test-zlib28123 ---28124 duration_ms: 684.3540028125 ...28126ok 5484 parallel/test-zlib-zip-file-lifecycle28127 ---28128 duration_ms: 347.8240028129 ...28130ok 5485 parallel/test-zlib-zip-hardening28131 ---28132 duration_ms: 341.8210028133 ...28134ok 5486 parallel/test-zlib-zip-interop28135 ---28136 duration_ms: 345.2650028137 ...28138ok 5487 sea/test-build-sea-missing-output # skip Running the resultant binary fails with `/home/iojs/node-tmp/.tmp.2379/sea: error while loading shared libraries: libicui18n.so.71: cannot open shared object file: No such file or directory`.28139 ---28140 duration_ms: 187.7960028141 ...28142ok 5488 parallel/test-zlib-zip-sync28143 ---28144 duration_ms: 338.9410028145 ...28146ok 5489 sea/test-build-sea-vfs-incompatible-options # skip Running the resultant binary fails with `/home/iojs/node-tmp/.tmp.2379/sea: error while loading shared libraries: libicui18n.so.71: cannot open shared object file: No such file or directory`.28147 ---28148 duration_ms: 189.2640028149 ...28150ok 5490 parallel/test-zlib-zstd-pledged-src-size28151 ---28152 duration_ms: 272.8860028153 ...28154ok 5491 parallel/test-zlib-zip-security-hardening28155 ---28156 duration_ms: 341.8410028157 ...28158ok 5492 sea/test-build-sea-invalid-executable # skip Running the resultant binary fails with `/home/iojs/node-tmp/.tmp.2379/sea: error while loading shared libraries: libicui18n.so.71: cannot open shared object file: No such file or directory`.28159 ---28160 duration_ms: 208.6820028161 ...28162ok 5493 sea/test-single-executable-application # skip Running the resultant binary fails with `/home/iojs/node-tmp/.tmp.2379/sea: error while loading shared libraries: libicui18n.so.71: cannot open shared object file: No such file or directory`.28163 ---28164 duration_ms: 201.3800028165 ...28166ok 5494 parallel/test-zlib-zip-writable28167 ---28168 duration_ms: 349.3500028169 ...28170ok 5495 sea/test-single-executable-application-asset-keys # skip Running the resultant binary fails with `/home/iojs/node-tmp/.tmp.2379/sea: error while loading shared libraries: libicui18n.so.71: cannot open shared object file: No such file or directory`.28171 ---28172 duration_ms: 184.3140028173 ...28174ok 5496 sea/test-single-executable-application-asset-keys-empty # skip Running the resultant binary fails with `/home/iojs/node-tmp/.tmp.2379/sea: error while loading shared libraries: libicui18n.so.71: cannot open shared object file: No such file or directory`.28175 ---28176 duration_ms: 185.6110028177 ...28178ok 5497 sea/test-single-executable-application-assets # skip Running the resultant binary fails with `/home/iojs/node-tmp/.tmp.2379/sea: error while loading shared libraries: libicui18n.so.71: cannot open shared object file: No such file or directory`.28179 ---28180 duration_ms: 177.4820028181 ...28182ok 5498 sea/test-single-executable-application-exec-argv-empty # skip Running the resultant binary fails with `/home/iojs/node-tmp/.tmp.2379/sea: error while loading shared libraries: libicui18n.so.71: cannot open shared object file: No such file or directory`.28183 ---28184 duration_ms: 146.4760028185 ...28186ok 5499 sea/test-single-executable-application-assets-raw # skip Running the resultant binary fails with `/home/iojs/node-tmp/.tmp.2379/sea: error while loading shared libraries: libicui18n.so.71: cannot open shared object file: No such file or directory`.28187 ---28188 duration_ms: 171.4210028189 ...28190ok 5500 parallel/test-zlib-zip-files28191 ---28192 duration_ms: 426.9750028193 ...28194ok 5501 sea/test-single-executable-application-disable-experimental-sea-warning # skip Running the resultant binary fails with `/home/iojs/node-tmp/.tmp.2379/sea: error while loading shared libraries: libicui18n.so.71: cannot open shared object file: No such file or directory`.28195 ---28196 duration_ms: 174.1730028197 ...28198ok 5502 sea/test-single-executable-application-empty # skip Running the resultant binary fails with `/home/iojs/node-tmp/.tmp.2379/sea: error while loading shared libraries: libicui18n.so.71: cannot open shared object file: No such file or directory`.28199 ---28200 duration_ms: 172.7930028201 ...28202ok 5503 sea/test-single-executable-application-inspect-in-sea-flags # skip Running the resultant binary fails with `/home/iojs/node-tmp/.tmp.2379/sea: error while loading shared libraries: libicui18n.so.71: cannot open shared object file: No such file or directory`.28203 ---28204 duration_ms: 140.3360028205 ...28206ok 5504 sea/test-single-executable-application-inspect # skip Running the resultant binary fails with `/home/iojs/node-tmp/.tmp.2379/sea: error while loading shared libraries: libicui18n.so.71: cannot open shared object file: No such file or directory`.28207 ---28208 duration_ms: 147.5440028209 ...28210ok 5505 sea/test-single-executable-application-esm # skip Running the resultant binary fails with `/home/iojs/node-tmp/.tmp.2379/sea: error while loading shared libraries: libicui18n.so.71: cannot open shared object file: No such file or directory`.28211 ---28212 duration_ms: 174.0500028213 ...28214ok 5506 sea/test-single-executable-application-esm-code-cache # skip Running the resultant binary fails with `/home/iojs/node-tmp/.tmp.2379/sea: error while loading shared libraries: libicui18n.so.71: cannot open shared object file: No such file or directory`.28215 ---28216 duration_ms: 171.7630028217 ...28218ok 5507 parallel/test-zlib-zip-property28219 ---28220 duration_ms: 424.4620028221 ...28222ok 5508 sea/test-single-executable-application-exec-argv-extension-cli # skip Running the resultant binary fails with `/home/iojs/node-tmp/.tmp.2379/sea: error while loading shared libraries: libicui18n.so.71: cannot open shared object file: No such file or directory`.28223 ---28224 duration_ms: 171.1360028225 ...28226ok 5509 sea/test-single-executable-application-snapshot-and-code-cache # skip Running the resultant binary fails with `/home/iojs/node-tmp/.tmp.2379/sea: error while loading shared libraries: libicui18n.so.71: cannot open shared object file: No such file or directory`.28227 ---28228 duration_ms: 139.6180028229 ...28230ok 5510 sea/test-single-executable-application-exec-argv # skip Running the resultant binary fails with `/home/iojs/node-tmp/.tmp.2379/sea: error while loading shared libraries: libicui18n.so.71: cannot open shared object file: No such file or directory`.28231 ---28232 duration_ms: 178.6520028233 ...28234ok 5511 sea/test-single-executable-application-assets-invalid-type28235 ---28236 duration_ms: 215.5490028237 ...28238ok 5512 sea/test-single-executable-application-exec-argv-extension-none # skip Running the resultant binary fails with `/home/iojs/node-tmp/.tmp.2379/sea: error while loading shared libraries: libicui18n.so.71: cannot open shared object file: No such file or directory`.28239 ---28240 duration_ms: 173.1300028241 ...28242ok 5513 sea/test-single-executable-application-exec-argv-extension-env # skip Running the resultant binary fails with `/home/iojs/node-tmp/.tmp.2379/sea: error while loading shared libraries: libicui18n.so.71: cannot open shared object file: No such file or directory`.28243 ---28244 duration_ms: 175.1580028245 ...28246ok 5514 sea/test-single-executable-application-snapshot # skip Running the resultant binary fails with `/home/iojs/node-tmp/.tmp.2379/sea: error while loading shared libraries: libicui18n.so.71: cannot open shared object file: No such file or directory`.28247 ---28248 duration_ms: 171.3770028249 ...28250ok 5515 sea/test-single-executable-application-vfs-esm # skip Running the resultant binary fails with `/home/iojs/node-tmp/.tmp.2379/sea: error while loading shared libraries: libicui18n.so.71: cannot open shared object file: No such file or directory`.28251 ---28252 duration_ms: 140.0050028253 ...28254ok 5516 sea/test-single-executable-application-vfs # skip Running the resultant binary fails with `/home/iojs/node-tmp/.tmp.2379/sea: error while loading shared libraries: libicui18n.so.71: cannot open shared object file: No such file or directory`.28255 ---28256 duration_ms: 137.9890028257 ...28258ok 5517 sea/test-single-executable-application-snapshot-worker # skip Running the resultant binary fails with `/home/iojs/node-tmp/.tmp.2379/sea: error while loading shared libraries: libicui18n.so.71: cannot open shared object file: No such file or directory`.28259 ---28260 duration_ms: 170.4690028261 ...28262ok 5518 sea/test-single-executable-application-use-code-cache # skip Running the resultant binary fails with `/home/iojs/node-tmp/.tmp.2379/sea: error while loading shared libraries: libicui18n.so.71: cannot open shared object file: No such file or directory`.28263 ---28264 duration_ms: 169.6790028265 ...28266ok 5519 sea/test-single-executable-application-assets-nonexistent-file28267 ---28268 duration_ms: 267.0800028269 ...28270ok 5520 parallel/test-zlib-brotli-16GB28271 ---28272 duration_ms: 867.6940028273 ...28274ok 5521 parallel/test-x509-escaping28275 ---28276 duration_ms: 885.3000028277 ...28278ok 5522 parallel/test-zlib-zip-fuzz28279 ---28280 duration_ms: 624.7600028281 ...28282ok 5523 parallel/test-zlib-zip-experimental-warning28283 ---28284 duration_ms: 718.6960028285 ...28286ok 5524 parallel/test-zlib-zip-security28287 ---28288 duration_ms: 720.3940028289 ...28290ok 5525 sea/test-single-executable-blob-config28291 ---28292 duration_ms: 412.1810028293 ...28294ok 5526 parallel/test-v8-collect-gc-profile28295 ---28296 duration_ms: 5303.7410028297 ...28298ok 5527 parallel/test-v8-collect-gc-profile-in-worker28299 ---28300 duration_ms: 5314.6960028301 ...28302ok 5528 parallel/test-zlib-zip-coverage28303 ---28304 duration_ms: 953.2180028305 ...28306ok 5529 sea/test-single-executable-blob-config-errors28307 ---28308 duration_ms: 610.1580028309 ...28310ok 5530 parallel/test-stream-iter-broadcast-from28311 ---28312 duration_ms: 10250.4400028313 ...28314ok 5531 pummel/test-array-hash-collision28315 ---28316 duration_ms: 506.9440028317 ...28318ok 5532 parallel/test-zlib-zip-zip6428319 ---28320 duration_ms: 2916.2560028321 ...28322ok 5533 pummel/test-blob-slice-with-large-size28323 ---28324 duration_ms: 1908.5090028325 ...28326ok 5534 pummel/test-buffer-large-size-buffer-alloc28327 ---28328 duration_ms: 1808.5830028329 ...28330ok 5535 pummel/test-buffer-large-size-buffer-alloc-unsafe28331 ---28332 duration_ms: 1908.5670028333 ...28334ok 5536 pummel/test-buffer-large-size-buffer-alloc-unsafe-slow28335 ---28336 duration_ms: 1909.1970028337 ...28338ok 5537 pummel/test-buffer-large-size-buffer-write28339 ---28340 duration_ms: 169.4510028341 ...28342ok 5538 pummel/test-buffer-large-size-copy28343 ---28344 duration_ms: 3011.4710028345 ...28346ok 5539 parallel/test-runner-execution-ordered-bypass28347 ---28348 duration_ms: 30419.4850028349 ...28350ok 5540 pummel/test-buffer-large-size-slowbuffer28351 ---28352 duration_ms: 1708.7580028353 ...28354ok 5541 pummel/test-child-process-spawn-loop28355 ---28356 duration_ms: 1108.3440028357 ...28358ok 5542 pummel/test-crypto-argon2-nonblocking-constructor28359 ---28360 duration_ms: 1908.5430028361 ...28362ok 5543 pummel/test-crypto-dh-hash28363 ---28364 duration_ms: 209.8460028365 ...28366ok 5544 pummel/test-crypto-dh-keys28367 ---28368 duration_ms: 326.4390028369 ...28370ok 5545 pummel/test-crypto-pqc-sign-verify-slh-dsa28371 ---28372 duration_ms: 12318.3400028373 ...28374ok 5546 pummel/test-dh-regr28375 ---28376 duration_ms: 26134.4150028377 ...28378ok 5547 pummel/test-fs-largefile28379 ---28380 duration_ms: 108.9690028381 ...28382ok 5548 pummel/test-fs-read-file-sync-utf8-memory28383 ---28384 duration_ms: 508.3250028385 ...28386ok 5549 pummel/test-fs-readfile-tostring-fail28387 ---28388 duration_ms: 1108.4320028389 ...28390ok 5550 pummel/test-heap-profile-and-snapshot-near-heap-limit28391 ---28392 duration_ms: 1210.1320028393 ...28394ok 5551 pummel/test-heap-profile-near-heap-limit28395 ---28396 duration_ms: 1009.3200028397 ...28398ok 5552 pummel/test-heapdump-dns28399 ---28400 duration_ms: 2709.8230028401 ...28402ok 5553 pummel/test-heapdump-env28403 ---28404 duration_ms: 1108.3140028405 ...28406ok 5554 pummel/test-heapdump-fs-promise28407 ---28408 duration_ms: 2009.5240028409 ...28410ok 5555 pummel/test-heapdump-http228411 ---28412 duration_ms: 3310.7190028413 ...28414ok 5556 pummel/test-heapdump-inspector28415 ---28416 duration_ms: 1708.4380028417 ...28418ok 5557 pummel/test-heapdump-shadow-realm28419 ---28420 duration_ms: 4213.5160028421 ...28422ok 5558 pummel/test-heapdump-tls28423 ---28424 duration_ms: 2111.4240028425 ...28426ok 5559 pummel/test-heapdump-urlpattern28427 ---28428 duration_ms: 1709.6040028429 ...28430ok 5560 pummel/test-heapdump-vm-script28431 ---28432 duration_ms: 908.5010028433 ...28434ok 5561 pummel/test-heapdump-worker28435 ---28436 duration_ms: 1809.8610028437 ...28438ok 5562 pummel/test-heapdump-zlib28439 ---28440 duration_ms: 14326.3040028441 ...28442ok 5563 pummel/test-heapdump-zstd28443 ---28444 duration_ms: 3113.2410028445 ...28446ok 5564 pummel/test-heapsnapshot-near-heap-limit28447 ---28448 duration_ms: 3813.4430028449 ...28450ok 5565 pummel/test-heapsnapshot-near-heap-limit-big28451 ---28452 duration_ms: 3511.9220028453 ...28454ok 5566 pummel/test-heapsnapshot-near-heap-limit-bounded28455 ---28456 duration_ms: 3012.6100028457 ...28458ok 5567 pummel/test-heapsnapshot-near-heap-limit-by-api28459 ---28460 duration_ms: 5215.2510028461 ...28462ok 5568 pummel/test-http-many-keep-alive-connections28463 ---28464 duration_ms: 808.0160028465 ...28466ok 5569 pummel/test-http-upload-timeout28467 ---28468 duration_ms: 3410.9170028469 ...28470ok 5570 pummel/test-https-large-response28471 ---28472 duration_ms: 327.0630028473 ...28474ok 5571 pummel/test-https-no-reader28475 ---28476 duration_ms: 2409.4880028477 ...28478ok 5572 pummel/test-keep-alive # skip test requires `wrk` to be installed first28479 ---28480 duration_ms: 136.4690028481 ...28482ok 5573 pummel/test-net-many-clients28483 ---28484 duration_ms: 261.8730028485 ...28486ok 5574 pummel/test-net-pause28487 ---28488 duration_ms: 2310.4280028489 ...28490ok 5575 pummel/test-net-pingpong28491 ---28492 duration_ms: 331.4560028493 ...28494ok 5576 pummel/test-net-pingpong-delay28495 ---28496 duration_ms: 509.2150028497 ...28498ok 5577 pummel/test-net-timeout28499 ---28500 duration_ms: 3814.6890028501 ...28502ok 5578 pummel/test-net-timeout228503 ---28504 duration_ms: 5316.8740028505 ...28506ok 5579 pummel/test-net-write-callbacks28507 ---28508 duration_ms: 910.9420028509 ...28510ok 5580 pummel/test-next-tick-infinite-calls28511 ---28512 duration_ms: 5913.9920028513 ...28514ok 5581 pummel/test-process-cpuUsage28515 ---28516 duration_ms: 708.3110028517 ...28518ok 5582 pummel/test-process-hrtime28519 ---28520 duration_ms: 2209.4550028521 ...28522ok 5583 pummel/test-regress-GH-89228523 ---28524 duration_ms: 509.9250028525 ...28526ok 5584 pummel/test-repl-paste-big-data28527 ---28528 duration_ms: 709.8160028529 ...28530ok 5585 pummel/test-stream-pipe-multi28531 ---28532 duration_ms: 1026.0210028533 ...28534ok 5586 pummel/test-string-decoder-large-buffer28535 ---28536 duration_ms: 170.1530028537 ...28538ok 5587 pummel/test-structuredclone-jstransferable28539 ---28540 duration_ms: 1310.3640028541 ...28542ok 5588 pummel/test-timers28543 ---28544 duration_ms: 3213.2090028545 ...28546ok 5589 pummel/test-tls-server-large-request28547 ---28548 duration_ms: 328.6830028549 ...28550ok 5590 pummel/test-tls-throttle28551 ---28552 duration_ms: 328.9410028553 ...28554ok 5591 pummel/test-vm-memleak28555 ---28556 duration_ms: 5612.8070028557 ...28558ok 5592 pummel/test-vm-race28559 ---28560 duration_ms: 5210.2490028561 ...28562ok 5593 pummel/test-watch-file28563 ---28564 duration_ms: 5213.5600028565 ...28566ok 5594 pummel/test-webcrypto-derivebits-pbkdf228567 ---28568 duration_ms: 5313.2250028569 ...28570ok 5595 pummel/test-webcrypto-kangarootwelve-32bit-overflow # skip only relevant when kMaxLength < 2^3228571 ---28572 duration_ms: 168.2400028573 ...28574ok 5596 pummel/test-worker-take-heapsnapshot28575 ---28576 duration_ms: 707.7030028577 ...28578ok 5597 pummel/test-zlib-zip-slow28579 ---28580 duration_ms: 15226.9220028581 ...28582ok 5598 known_issues/test-cli-print-var-crypto28583 ---28584 duration_ms: 328.6160028585 ...28586ok 5599 known_issues/test-cwd-enoent-file28587 ---28588 duration_ms: 328.3900028589 ...28590ok 5600 known_issues/test-dgram-bind-shared-ports-after-port-028591 ---28592 duration_ms: 509.5500028593 ...28594ok 5601 known_issues/test-fs-cp-async-buffer28595 ---28596 duration_ms: 136.9340028597 ...28598ok 5602 known_issues/test-fs-cp-filter28599 ---28600 duration_ms: 170.1830028601 ...28602ok 5603 known_issues/test-fs-cp-non-utf828603 ---28604 duration_ms: 169.7930028605 ...28606ok 5604 known_issues/test-fs-writeFileSync-invalid-windows28607 ---28608 duration_ms: 137.0180028609 ...28610ok 5605 known_issues/test-http-clientrequest-end-contentlength28611 ---28612 duration_ms: 211.2720028613 ...28614ok 5606 known_issues/test-http-clientrequest-end-empty-response-body28615 ---28616 duration_ms: 212.1560028617 ...28618ok 5607 known_issues/test-http-clientrequest-write-chunked28619 ---28620 duration_ms: 170.5430028621 ...28622ok 5608 known_issues/test-http-path-contains-unicode28623 ---28624 duration_ms: 170.3130028625 ...28626ok 5609 known_issues/test-inspector-cluster-port-clash28627 ---28628 duration_ms: 328.5200028629 ...28630ok 5610 known_issues/test-inspector-instrumentation-breakpoint28631 ---28632 duration_ms: 15431.1630028633 ...28634ok 5611 known_issues/test-repl-require-context28635 ---28636 duration_ms: 211.6160028637 ...28638ok 5612 known_issues/test-stdin-is-always-net.socket28639 ---28640 duration_ms: 329.0840028641 ...28642ok 5613 known_issues/test-stream-writable-sync-error28643 ---28644 duration_ms: 170.4510028645 ...28646ok 5614 known_issues/test-url-parse-conformance28647 ---28648 duration_ms: 211.9470028649 ...28650ok 5615 known_issues/test-vm-function-declaration-uses-define28651 ---28652 duration_ms: 136.9340028653 ...28654ok 5616 known_issues/test-vm-timeout-escape-nexttick28655 ---28656 duration_ms: 910.0570028657 ...28658ok 5617 wpt/test-abort28659 ---28660 duration_ms: 2412.6050028661 ...28662ok 5618 wpt/test-atob28663 ---28664 duration_ms: 328.9310028665 ...28666ok 5619 wpt/test-blob28667 ---28668 duration_ms: 409.5390028669 ...28670ok 5620 wpt/test-broadcastchannel28671 ---28672 duration_ms: 329.0390028673 ...28674ok 5621 wpt/test-compression28675 ---28676 duration_ms: 1210.3400028677 ...28678ok 5622 wpt/test-console28679 ---28680 duration_ms: 408.6690028681 ...28682ok 5623 wpt/test-encoding28683 ---28684 duration_ms: 713.6200028685 ...28686ok 5624 wpt/test-events28687 ---28688 duration_ms: 408.5480028689 ...28690ok 5625 wpt/test-file28691 ---28692 duration_ms: 329.1340028693 ...28694ok 5626 wpt/test-hr-time28695 ---28696 duration_ms: 2412.0080028697 ...28698ok 5627 wpt/test-microtask-queuing28699 ---28700 duration_ms: 327.9480028701 ...28702ok 5628 wpt/test-performance-timeline28703 ---28704 duration_ms: 2511.6020028705 ...28706ok 5629 wpt/test-resource-timing28707 ---28708 duration_ms: 509.4670028709 ...28710ok 5630 wpt/test-streams28711 ---28712 duration_ms: 2813.5560028713 ...28714ok 5631 wpt/test-structured-clone28715 ---28716 duration_ms: 263.6360028717 ...28718ok 5632 wpt/test-timers28719 ---28720 duration_ms: 1210.2750028721 ...28722ok 5633 wpt/test-url # skip Different versions of Ada affect the WPT tests28723 ---28724 duration_ms: 170.5420028725 ...28726ok 5634 wpt/test-urlpattern28727 ---28728 duration_ms: 410.0750028729 ...28730ok 5635 wpt/test-wasm-jsapi28731 ---28732 duration_ms: 1110.2440028733 ...28734ok 5636 wpt/test-wasm-webapi28735 ---28736 duration_ms: 262.2040028737 ...28738ok 5637 wpt/test-web-locks28739 ---28740 duration_ms: 2210.4340028741 ...28742ok 5638 wpt/test-webcrypto28743 ---28744 duration_ms: 5755.3010028745 ...28746ok 5639 wpt/test-webidl28747 ---28748 duration_ms: 408.7210028749 ...28750ok 5640 wpt/test-webstorage28751 ---28752 duration_ms: 1809.3000028753 ...28754ok 5641 wpt/test-workers28755 ---28756 duration_ms: 807.5580028757 ...28758ok 5642 wasm-allocation/test-wasm-allocation28759 ---28760 duration_ms: 114.3640028761 ...28762ok 5643 wasm-allocation/test-wasm-allocation-auto-adapt28763 ---28764 duration_ms: 94.7490028765 ...28766ok 5644 wasm-allocation/test-wasm-allocation-disable-trap-handler28767 ---28768 duration_ms: 94.2850028769 ...28770ok 5645 wasm-allocation/test-wasm-allocation-memory6428771 ---28772 duration_ms: 142.1680028773 ...28774ok 5646 abort/test-abort-backtrace28775 ---28776 duration_ms: 331.7800028777 ...28778ok 5647 abort/test-abort-fatal-error28779 ---28780 duration_ms: 413.7020028781 ...28782ok 5648 abort/test-abort-uncaught-exception28783 ---28784 duration_ms: 333.9210028785 ...28786ok 5649 abort/test-addon-register-signal-handler # skip binding not built yet28787 ---28788 duration_ms: 94.4940028789 ...28790ok 5650 abort/test-addon-uv-handle-leak # skip binding not built yet28791 ---28792 duration_ms: 94.2550028793 ...28794ok 5651 abort/test-http-parser-consume28795 ---28796 duration_ms: 332.9490028797 ...28798ok 5652 abort/test-process-abort-exitcode28799 ---28800 duration_ms: 333.2150028801 ...28802ok 5653 abort/test-signal-handler28803 ---28804 duration_ms: 332.5660028805 ...28806ok 5654 abort/test-worker-abort-uncaught-exception28807 ---28808 duration_ms: 332.3640028809 ...28810ok 5655 abort/test-zlib-invalid-internals-usage28811 ---28812 duration_ms: 333.1270028813 ...28814ok 5656 sequential/test-async-wrap-getasyncid28815 ---28816 duration_ms: 327.3720028817 ...28818ok 5657 sequential/test-buffer-creation-regression28819 ---28820 duration_ms: 109.4070028821 ...28822ok 5658 sequential/test-child-process-emfile28823 ---28824 duration_ms: 210.7360028825 ...28826ok 5659 sequential/test-child-process-execsync28827 ---28828 duration_ms: 808.5410028829 ...28830ok 5660 sequential/test-child-process-exit28831 ---28832 duration_ms: 608.3050028833 ...28834ok 5661 sequential/test-child-process-pass-fd28835 ---28836 duration_ms: 608.5150028837 ...28838ok 5662 sequential/test-cli-syntax-bad28839 ---28840 duration_ms: 708.1310028841 ...28842ok 5663 sequential/test-cli-syntax-file-not-found28843 ---28844 duration_ms: 210.1690028845 ...28846ok 5664 sequential/test-cli-syntax-good28847 ---28848 duration_ms: 210.9100028849 ...28850ok 5665 sequential/test-cli-syntax-require28851 ---28852 duration_ms: 327.3130028853 ...28854ok 5666 sequential/test-cluster-inspect-brk28855 ---28856 duration_ms: 210.4100028857 ...28858ok 5667 sequential/test-cluster-net-listen-ipv6only-none28859 ---28860 duration_ms: 262.4140028861 ...28862ok 5668 sequential/test-cluster-net-listen-ipv6only-rr28863 ---28864 duration_ms: 262.7730028865 ...28866ok 5669 sequential/test-cluster-port-reuse-between-workers28867 ---28868 duration_ms: 407.7310028869 ...28870ok 5670 sequential/test-cluster-send-handle-large-payload28871 ---28872 duration_ms: 261.5150028873 ...28874ok 5671 sequential/test-cpu-prof-default28875 ---28876 duration_ms: 1008.8170028877 ...28878ok 5672 sequential/test-cpu-prof-dir-absolute28879 ---28880 duration_ms: 1109.2480028881 ...28882ok 5673 sequential/test-cpu-prof-dir-and-name28883 ---28884 duration_ms: 1109.1240028885 ...28886ok 5674 sequential/test-cpu-prof-dir-relative28887 ---28888 duration_ms: 1208.7250028889 ...28890ok 5675 sequential/test-cpu-prof-drained28891 ---28892 duration_ms: 1409.1250028893 ...28894ok 5676 sequential/test-cpu-prof-exit28895 ---28896 duration_ms: 326.8980028897 ...28898ok 5677 sequential/test-cpu-prof-invalid-options28899 ---28900 duration_ms: 261.4990028901 ...28902ok 5678 sequential/test-cpu-prof-kill28903 ---28904 duration_ms: 407.0700028905 ...28906ok 5679 sequential/test-cpu-prof-name28907 ---28908 duration_ms: 2308.9260028909 ...28910ok 5680 sequential/test-cpu-prof-worker-argv28911 ---28912 duration_ms: 1508.3360028913 ...28914ok 5681 sequential/test-crypto-timing-safe-equal28915 ---28916 duration_ms: 136.0910028917 ...28918ok 5682 sequential/test-crypto-timing-safe-equal-fast28919 ---28920 duration_ms: 168.7010028921 ...28922ok 5683 sequential/test-debug-prompt28923 ---28924 duration_ms: 708.1330028925 ...28926ok 5684 sequential/test-debugger-custom-port28927 ---28928 duration_ms: 708.7470028929 ...28930ok 5685 sequential/test-debugger-debug-brk28931 ---28932 duration_ms: 210.7050028933 ...28934ok 5686 sequential/test-debugger-invalid-args28935 ---28936 duration_ms: 5313.1720028937 ...28938ok 5687 sequential/test-debugger-launch28939 ---28940 duration_ms: 808.4290028941 ...28942ok 5688 sequential/test-debugger-pid28943 ---28944 duration_ms: 508.5170028945 ...28946ok 5689 sequential/test-deprecation-flags28947 ---28948 duration_ms: 262.4080028949 ...28950ok 5690 sequential/test-dgram-bind-shared-ports28951 ---28952 duration_ms: 408.2600028953 ...28954ok 5691 sequential/test-dgram-implicit-bind-failure28955 ---28956 duration_ms: 136.0170028957 ...28958ok 5692 sequential/test-dgram-pingpong28959 ---28960 duration_ms: 168.6010028961 ...28962ok 5693 sequential/test-diagnostic-dir-cpu-prof28963 ---28964 duration_ms: 2910.2000028965 ...28966ok 5694 sequential/test-diagnostic-dir-heap-prof28967 ---28968 duration_ms: 1608.9900028969 ...28970ok 5695 sequential/test-dtls-interop-openssl-client # skip DTLS is not enabled28971 ---28972 duration_ms: 168.8400028973 ...28974ok 5696 sequential/test-dtls-interop-openssl-server # skip DTLS is not enabled28975 ---28976 duration_ms: 135.6660028977 ...28978ok 5697 sequential/test-error-serdes28979 ---28980 duration_ms: 168.4740028981 ...28982ok 5698 sequential/test-fs-opendir-recursive28983 ---28984 duration_ms: 261.7610028985 ...28986ok 5699 sequential/test-fs-readdir-recursive28987 ---28988 duration_ms: 210.1940028989 ...28990ok 5700 sequential/test-fs-stat-sync-overflow28991 ---28992 duration_ms: 262.2480028993 ...28994ok 5701 sequential/test-gc-http-client28995 ---28996 duration_ms: 1208.8630028997 ...28998ok 5702 sequential/test-gc-http-client-onerror28999 ---29000 duration_ms: 1209.0660029001 ...29002ok 5703 sequential/test-gc-http-client-timeout29003 ---29004 duration_ms: 708.7160029005 ...29006ok 5704 sequential/test-get-heapsnapshot-options29007 ---29008 duration_ms: 1809.7190029009 ...29010ok 5705 sequential/test-heapdump29011 ---29012 duration_ms: 708.6410029013 ...29014ok 5706 sequential/test-heapdump-flag29015 ---29016 duration_ms: 608.4050029017 ...29018ok 5707 sequential/test-heapdump-flag-custom-dir29019 ---29020 duration_ms: 708.9120029021 ...29022ok 5708 sequential/test-http-econnrefused29023 ---29024 duration_ms: 135.5330029025 ...29026ok 5709 sequential/test-http-keep-alive-large-write29027 ---29028 duration_ms: 210.7210029029 ...29030ok 5710 sequential/test-http-keepalive-maxsockets29031 ---29032 duration_ms: 408.4440029033 ...29034ok 5711 sequential/test-http-regr-gh-292829035 ---29036 duration_ms: 109.6260029037 ...29038ok 5712 sequential/test-http-server-keep-alive-timeout-slow-client-headers29039 ---29040 duration_ms: 1910.0220029041 ...29042ok 5713 sequential/test-http-server-keep-alive-timeout-slow-server29043 ---29044 duration_ms: 808.6980029045 ...29046ok 5714 sequential/test-http2-max-session-memory29047 ---29048 duration_ms: 411.8330029049 ...29050ok 5715 sequential/test-http2-ping-flood29051 ---29052 duration_ms: 233.8840029053 ...29054ok 5716 sequential/test-http2-settings-flood29055 ---29056 duration_ms: 266.2250029057 ...29058ok 5717 sequential/test-http2-timeout-large-write29059 ---29060 duration_ms: 2919.8100029061 ...29062ok 5718 sequential/test-http2-timeout-large-write-file29063 ---29064 duration_ms: 2810.0290029065 ...29066ok 5719 sequential/test-https-connect-localport29067 ---29068 duration_ms: 6219.1430029069 ...29070ok 5720 sequential/test-https-server-keep-alive-timeout29071 ---29072 duration_ms: 1998.2860029073 ...29074ok 5721 sequential/test-init29075 ---29076 duration_ms: 262.7810029077 ...29078ok 5722 sequential/test-inspector-network-resource29079 ---29080 duration_ms: 1810.0750029081 ...29082ok 5723 sequential/test-inspector-open-dispose29083 ---29084 duration_ms: 210.5880029085 ...29086ok 5724 sequential/test-inspector-port-cluster29087 ---29088 duration_ms: 608.5240029089 ...29090ok 5725 sequential/test-module-loading29091 ---29092 duration_ms: 169.3780029093 ...29094ok 5726 sequential/test-net-GH-550429095 ---29096 duration_ms: 408.1420029097 ...29098ok 5727 sequential/test-net-better-error-messages-port29099 ---29100 duration_ms: 168.7840029101 ...29102ok 5728 sequential/test-net-connect-econnrefused29103 ---29104 duration_ms: 210.0080029105 ...29106ok 5729 sequential/test-net-connect-handle-econnrefused29107 ---29108 duration_ms: 168.9680029109 ...29110ok 5730 sequential/test-net-connect-local-error29111 ---29112 duration_ms: 108.8190029113 ...29114ok 5731 sequential/test-net-listen-ipv6only29115 ---29116 duration_ms: 108.5460029117 ...29118ok 5732 sequential/test-net-listen-shared-ports29119 ---29120 duration_ms: 407.2330029121 ...29122ok 5733 sequential/test-net-localport29123 ---29124 duration_ms: 135.8410029125 ...29126ok 5734 sequential/test-net-reconnect-error29127 ---29128 duration_ms: 168.9490029129 ...29130ok 5735 sequential/test-net-response-size29131 ---29132 duration_ms: 1408.7960029133 ...29134ok 5736 sequential/test-net-server-address29135 ---29136 duration_ms: 135.3000029137 ...29138ok 5737 sequential/test-net-server-bind29139 ---29140 duration_ms: 326.9290029141 ...29142ok 5738 sequential/test-net-server-listen-ipv6-link-local29143 ---29144 duration_ms: 109.2130029145 ...29146ok 5739 sequential/test-next-tick-error-spin29147 ---29148 duration_ms: 262.4720029149 ...29150ok 5740 sequential/test-perf-hooks29151 ---29152 duration_ms: 1209.1180029153 ...29154ok 5741 sequential/test-performance-eventloopdelay29155 ---29156 duration_ms: 7217.8050029157 ...29158ok 5742 sequential/test-pipe29159 ---29160 duration_ms: 4413.0310029161 ...29162ok 5743 sequential/test-process-title29163 ---29164 duration_ms: 261.7190029165 ...29166ok 5744 sequential/test-process-warnings29167 ---29168 duration_ms: 262.7390029169 ...29170ok 5745 sequential/test-repl-timeout-throw29171 ---29172 duration_ms: 407.9720029173 ...29174ok 5746 sequential/test-require-cache-without-stat29175 ---29176 duration_ms: 168.7610029177 ...29178ok 5747 sequential/test-resolution-inspect-brk29179 ---29180 duration_ms: 210.8000029181 ...29182ok 5748 sequential/test-stream2-fs29183 ---29184 duration_ms: 135.7980029185 ...29186ok 5749 sequential/test-stream2-stderr-sync29187 ---29188 duration_ms: 326.2230029189 ...29190ok 5750 sequential/test-timers-block-eventloop29191 ---29192 duration_ms: 168.5210029193 ...29194ok 5751 sequential/test-timers-set-interval-excludes-callback-duration29195 ---29196 duration_ms: 608.1980029197 ...29198ok 5752 sequential/test-tls-connect29199 ---29200 duration_ms: 169.6320029201 ...29202ok 5753 sequential/test-tls-lookup29203 ---29204 duration_ms: 135.7730029205 ...29206ok 5754 sequential/test-tls-psk-client # skip missing openssl cli29207 ---29208 duration_ms: 168.3190029209 ...29210ok 5755 sequential/test-tls-session-timeout # skip node compiled without OpenSSL CLI.29211 ---29212 duration_ms: 134.9930029213 ...29214ok 5756 sequential/test-util-debug29215 ---29216 duration_ms: 608.8900029217 ...29218ok 5757 sequential/test-vm-break-on-sigint29219 ---29220 duration_ms: 262.1900029221 ...29222ok 5758 sequential/test-vm-timeout-escape-promise-module-229223 ---29224 duration_ms: 169.2220029225 ...29226ok 5759 sequential/test-vm-timeout-rethrow29227 ---29228 duration_ms: 326.8380029229 ...29230ok 5760 sequential/test-watch-mode-restart-esm-loading-error29231 ---29232 duration_ms: 2410.5900029233 ...29234ok 5761 sequential/test-watch-mode-watch-flags29235 ---29236 duration_ms: 508.3660029237 ...29238ok 5762 sequential/test-watch-mode-worker29239 ---29240 duration_ms: 3010.4100029241 ...29242ok 5763 sequential/test-without-async-context-frame29243 ---29244 duration_ms: 1709.3100029245 ...29246ok 5764 sequential/test-worker-eventlooputil29247 ---29248 duration_ms: 408.0050029249 ...29250ok 5765 sequential/test-worker-fshandles-error-on-termination29251 ---29252 duration_ms: 407.8490029253 ...29254ok 5766 sequential/test-worker-fshandles-open-close-on-termination29255 ---29256 duration_ms: 508.4100029257 ...29258ok 5767 sequential/test-worker-heapsnapshot-options29259 ---29260 duration_ms: 809.3180029261 ...29262ok 5768 sequential/test-worker-prof29263 ---29264 duration_ms: 2110.1220029265 ...29266ok 5769 sequential/test-write-heapsnapshot-options29267 ---29268 duration_ms: 2010.2130029269 ...29270ok 5770 sequential/test-zlib-crc32-fast-api29271 ---29272 duration_ms: 210.8810029273 ...2927429275Failed tests:29276out/Release/node /build/node-v26.9.0/test/parallel/test-fs-cp-async-file-modes.mjs29277make: *** [Makefile:631: test-ci-js] Error 1