nixbot

builds

failed nodejs-slim-26.9.0 checks.aarch64-linux.pkgs-hermes-desktop · build #5024 · raw

1bld4: building w5na4iaq87mgxjc7qiyzp1iyprk5zk5a-nodejs-slim-26.9.0.drv2structuredAttrs is enabled
unpackPhase
3unpacking source archive /nix/store/7ajvk1c4mspigbdgf21bn9d7f7p9kmgk-node-v26.9.0.tar.xz4source root is node-v26.9.05setting SOURCE_DATE_EPOCH to timestamp 1789550914 of file "node-v26.9.0/tools/nix/v8.nix"
patchPhase
6applying patch /nix/store/j4p9lc7z8hi4g40cpqpj3qxb9a7bvanp-configure-armv6-vfpv2.patch7patching file configure.py8Hunk #1 succeeded at 49 with fuzz 1 (offset -1 lines).9applying patch /nix/store/igz0qnjkvwi4f2mn7i13h3ndxl9n5ryi-node-npm-build-npm-package-logic.patch10patching file deps/npm/node_modules/@npmcli/run-script/lib/set-path.js11Hunk #1 succeeded at 13 with fuzz 2 (offset 1 line).12Hunk #2 succeeded at 37 (offset 8 lines).13patching file deps/npm/node_modules/pacote/lib/git.js14Hunk #1 succeeded at 186 (offset -2 lines).15patching file deps/npm/node_modules/@npmcli/arborist/lib/arborist/build-ideal-tree.js16Hunk #1 succeeded at 802 (offset 62 lines).17patching file deps/npm/node_modules/@npmcli/arborist/lib/arborist/load-actual.js18Hunk #1 succeeded at 121 with fuzz 1 (offset -26 lines).19applying patch /nix/store/57n0csr7hpdd0y91ljxpiwlfw7fsx3kl-use-correct-env-in-tests.patch20patching file test/parallel/test-child-process-default-options.js21patching file test/parallel/test-child-process-env.js22patching file test/parallel/test-child-process-exec-env.js23applying patch /nix/store/p2mhv95s89kaqmdynhz6y6asalf8y4dh-bin-sh-node-run-v22.patch24patching file test/fixtures/run-script/node_modules/.bin/positional-args25Hunk #1 succeeded at 1 with fuzz 1.26applying patch /nix/store/3za8p3x3hjfr1a9b1lc3z4aapp9sm2ja-use-nix-codesign.patch27patching file test/parallel/test-macos-app-sandbox.js28applying patch /nix/store/6whc7i794ygkcwjwrprw7y9aglfl238g-fix-temporal-integration-with-shared-icu.patch29patching file deps/v8/src/objects/js-temporal-zoneinfo64.cc30patching file tools/v8_gypfiles/v8.gyp31Hunk #1 succeeded at 1398 (offset 19 lines).32Hunk #2 succeeded at 2051 (offset 93 lines).
updateAutotoolsGnuConfigScriptsPhase
33Updating Autotools / GNU config script to a newer upstream version: ./deps/ngtcp2/ngtcp2/third-party/libev/config.sub34Updating Autotools / GNU config script to a newer upstream version: ./deps/cares/config/config.sub35Updating Autotools / GNU config script to a newer upstream version: ./deps/libffi/config.sub36Updating Autotools / GNU config script to a newer upstream version: ./deps/ngtcp2/ngtcp2/third-party/libev/config.guess37Updating Autotools / GNU config script to a newer upstream version: ./deps/cares/config/config.guess38Updating Autotools / GNU config script to a newer upstream version: ./deps/libffi/config.guess
configurePhase
39fixing libtool script ./deps/ngtcp2/ngtcp2/third-party/libev/ltmain.sh40fixing libtool script ./deps/cares/config/ltmain.sh41fixing libtool script ./deps/libffi/ltmain.sh42./deps/ngtcp2/ngtcp2/third-party/libev/configure43./deps/cares/configure44./deps/libffi/configure45configure flags: --prefix=/nix/store/0pnrss6n3aspfki7hglgiillsrwwfc7f-nodejs-slim-26.9.0 --ninja --with-intl=system-icu --openssl-use-def-ca-store --no-cross-compiling --dest-os=linux --dest-cpu=arm64 --v8-enable-temporal-support --use-prefix-to-find-headers --shared-abseil --shared-abseil-libpath=/nix/store/r45nbi89lw5sq68hli3xlrr4zahkdb90-abseil-cpp-20260107.1/lib --shared-ada --shared-ada-libpath=/nix/store/adrkcplbsaxnvj2w751xsvzhm4cfar8g-ada-4.0.0/lib --shared-brotli --shared-brotli-libpath=/nix/store/0glklzmdllhkd17qkq1269njhngvbgwd-brotli-1.2.0-lib/lib --shared-cares --shared-cares-libpath=/nix/store/m8v2h4gzaf2i7z9kjs8byxqddl4am6lh-c-ares-1.34.8/lib --shared-ffi --shared-ffi-libpath=/nix/store/n31cgnpx6p79f3pbw56n85ckky2j3f0x-libffi-3.8.0/lib --shared-gtest --shared-gtest-libpath=/nix/store/q37k767ll7cc22x0hh5fbb760bqdw317-gtest-1.18.0/lib --shared-hdr-histogram --shared-hdr-histogram-libpath=/nix/store/2c3bix9p476qx35vwzk2k2h93wiwf90f-hdrhistogram_c-0.11.10/lib --shared-highway --shared-highway-libpath=/nix/store/bccxpqws3spiwag5z7vrmhc9mw7gvhn3-libhwy-1.4.0/lib --shared-http-parser --shared-http-parser-libpath=/nix/store/60fmiv4q0i02alhsr9l3giwkaryn56ic-llhttp-9.4.3/lib --shared-libuv --shared-libuv-libpath=/nix/store/xzxbps3rn5d2m8cp8shfin3w7lbvrdj1-libuv-1.52.1/lib --shared-lief --shared-lief-libpath=/nix/store/j0q9dl3khlqq0qdz52qn0n3lx5y1m7rs-lief-0.17.6/lib --shared-merve --shared-merve-libpath=/nix/store/k7sc1hhdv25plzzkz176dgr4is3nj6zz-merve-1.2.2/lib --shared-nbytes --shared-nbytes-libpath=/nix/store/33qw58z7kdlniv51g75a4sr9m15kk2jx-nbytes-0.1.4/lib --shared-nghttp2 --shared-nghttp2-libpath=/nix/store/717hhzngx3cd36rnw5d3mv2ia0vzr87r-nghttp2-1.70.0-lib/lib --shared-nghttp3 --shared-nghttp3-libpath=/nix/store/2n3j3j85n60axyib6h4kxk7zsjm4a7y0-nghttp3-1.16.0/lib --shared-ngtcp2 --shared-ngtcp2-libpath=/nix/store/5731mwd8sb24ls072pv05m7skfrxjzia-ngtcp2-1.23.0/lib --shared-openssl --shared-openssl-libpath=/nix/store/v89yca35zsb13k51ibz0mcz2rrzjwwrj-openssl-3.6.4/lib --shared-simdjson --shared-simdjson-libpath=/nix/store/4kg2ikzp03l897y89m99ayrrqhq999r9-simdjson-4.6.8/lib --shared-simdutf --shared-simdutf-libpath=/nix/store/m37cwyj66cj9w35p43a702dlv6ggyfrk-simdutf-9.1.0/lib --shared-sqlite --shared-sqlite-libpath=/nix/store/1z13nb8zh15n25d3ym19079kd3qb0yyl-sqlite-3.53.3/lib --shared-temporal_capi --shared-temporal_capi-libpath=/nix/store/vfn19vs39w8m3ncbq9bmfhg249slliig-temporal_capi-0.2.6/lib --shared-uvwasi --shared-uvwasi-libpath=/nix/store/v97c955w6axf4vafwj0n8yrb31blyz5p-uvwasi-0.0.23/lib --shared-zlib --shared-zlib-libpath=/nix/store/8m1ckjz4k9v5ly0dkbyqpaw02kaxrp33-zlib-1.3.2/lib --shared-zstd --shared-zstd-libpath=/nix/store/zf5kl4x0zjkf6zl5d84ac0xahpp0las8-zstd-1.5.7/lib46INFO: configure completed successfully
buildPhase
47build flags: -j8 SHELL=/nix/store/idnyqaaix26szkvhs1mjgi7990jajz9a-bash-5.3p15/bin/bash48TERM=dumb ninja -C out/Release -j849ninja: Entering directory `out/Release'50[1/1875] CXX obj/deps/v8/src/base/v8_libbase.abort-mode.o51[2/1875] CXX obj/deps/v8/src/base/v8_libbase.bits.o52[3/1875] CXX obj/deps/v8/src/base/v8_libbase.division-by-constant.o53[4/1875] CXX obj/deps/v8/src/base/debug/v8_libbase.stack_trace.o54[5/1875] CXX obj/deps/v8/src/base/v8_libbase.cpu.o55[6/1875] CXX obj/deps/v8/src/base/v8_libbase.file-utils.o56[7/1875] CXX obj/deps/v8/src/base/v8_libbase.fpu.o57[8/1875] CXX obj/deps/v8/src/base/numbers/v8_libbase.cached-powers.o58[9/1875] CXX obj/deps/v8/src/base/v8_libbase.emulated-virtual-address-subspace.o59[10/1875] CXX obj/deps/v8/src/base/v8_libbase.bounded-page-allocator.o60[11/1875] CXX obj/deps/v8/src/base/numbers/v8_libbase.diy-fp.o61[12/1875] CXX obj/deps/v8/src/base/v8_libbase.ieee754.o62[13/1875] CXX obj/deps/v8/src/base/numbers/v8_libbase.bignum-dtoa.o63[14/1875] CXX obj/deps/v8/src/base/numbers/v8_libbase.bignum.o64[15/1875] CXX obj/deps/v8/src/base/v8_libbase.logging.o65[16/1875] CXX obj/deps/v8/src/base/v8_libbase.once.o66[17/1875] CXX obj/deps/v8/src/base/platform/v8_libbase.memory-protection-key.o67[18/1875] CXX obj/deps/v8/src/base/numbers/v8_libbase.dtoa.o68[19/1875] CXX obj/deps/v8/src/base/v8_libbase.page-allocator.o69[20/1875] CXX obj/deps/v8/src/base/numbers/v8_libbase.strtod.o70[21/1875] CXX obj/deps/v8/src/base/numbers/v8_libbase.fast-dtoa.o71[22/1875] CXX obj/deps/v8/src/base/numbers/v8_libbase.fixed-dtoa.o72[23/1875] CXX obj/deps/v8/src/base/platform/v8_libbase.condition-variable.o73[24/1875] CXX obj/deps/v8/src/base/platform/v8_libbase.platform.o74[25/1875] CXX obj/deps/v8/src/base/platform/v8_libbase.semaphore.o75[26/1875] CXX obj/deps/v8/src/base/sanitizer/v8_libbase.lsan-page-allocator.o76[27/1875] CXX obj/deps/v8/src/base/v8_libbase.region-allocator.o77[28/1875] CXX obj/deps/v8/src/base/platform/v8_libbase.mutex.o78[29/1875] CXX obj/deps/v8/src/base/sanitizer/v8_libbase.lsan-virtual-address-space.o79[30/1875] CXX obj/deps/v8/src/base/v8_libbase.sys-info.o80[31/1875] CXX obj/deps/v8/src/base/platform/v8_libbase.time.o81[32/1875] CXX obj/deps/v8/src/base/v8_libbase.vlq-base64.o82[33/1875] CXX obj/deps/v8/src/base/v8_libbase.strings.o83[34/1875] CXX obj/deps/v8/src/base/platform/v8_libbase.platform-posix-time.o84[35/1875] CXX obj/deps/v8/src/base/utils/v8_libbase.random-number-generator.o85[36/1875] CXX obj/deps/v8/src/base/debug/v8_libbase.stack_trace_posix.o86[37/1875] CXX obj/deps/v8/src/base/v8_libbase.virtual-address-space-page-allocator.o87[38/1875] CXX obj/deps/v8/src/base/v8_libbase.virtual-address-space.o88[39/1875] CXX obj/deps/v8/src/base/platform/v8_libbase.platform-linux.o89[40/1875] CXX obj/deps/v8/src/base/platform/v8_libbase.platform-posix.o90[41/1875] AR obj/tools/v8_gypfiles/libv8_libbase.a91[42/1875] CXX obj/deps/v8/src/torque/torque_base.cpp-builder.o92[43/1875] CXX obj/deps/v8/src/torque/torque_base.declarable.o93[44/1875] CXX obj/deps/v8/src/torque/torque_base.cfg.o94[45/1875] CXX obj/deps/v8/src/torque/torque_base.cc-generator.o95[46/1875] CXX obj/deps/v8/src/torque/torque_base.class-debug-reader-generator.o96[47/1875] CXX obj/deps/v8/src/torque/torque_base.csa-generator.o97[48/1875] CXX obj/deps/v8/src/torque/torque_base.earley-parser.o98[49/1875] CXX obj/deps/v8/src/torque/torque_base.declarations.o99[50/1875] CXX obj/deps/v8/src/torque/torque_base.global-context.o100[51/1875] CXX obj/deps/v8/src/torque/torque_base.declaration-visitor.o101[52/1875] CXX obj/deps/v8/src/torque/torque_base.source-positions.o102[53/1875] CXX obj/deps/v8/src/torque/torque_base.instance-type-generator.o103[54/1875] CXX obj/deps/v8/src/torque/torque_base.server-data.o104[55/1875] CXX obj/deps/v8/src/torque/torque_base.torque-code-generator.o105[56/1875] CXX obj/deps/v8/src/torque/torque_base.kythe-data.o106[57/1875] CXX obj/deps/v8/src/torque/torque_base.instructions.o107[58/1875] CXX obj/deps/v8/src/torque/torque_base.type-inference.o108[59/1875] CXX obj/deps/v8/src/torque/torque_base.type-oracle.o109[60/1875] CXX obj/deps/v8/src/torque/torque_base.torque-compiler.o110[61/1875] CXX obj/deps/v8/src/torque/torque_base.utils.o111[62/1875] CXX obj/deps/v8/src/interpreter/bytecode_builtins_list_generator.bytecode-operands.o112[63/1875] CXX obj/deps/v8/src/builtins/bytecode_builtins_list_generator.generate-bytecodes-builtins-list.o113[64/1875] ACTION Checking inspector protocol compatibility114[65/1875] CXX obj/deps/v8/src/interpreter/bytecode_builtins_list_generator.bytecodes.o115[66/1875] ACTION Generating inspector protocol sources from protocol json116[67/1875] STAMP obj/tools/v8_gypfiles/v8_flags.actions_depends.stamp117[68/1875] STAMP obj/tools/v8_gypfiles/v8_inspector_headers.actions_rules_copies.stamp118[69/1875] ACTION Generating temporal zoneinfo static data119[70/1875] LINK bytecode_builtins_list_generator120[71/1875] ACTION generate_bytecode_builtins_list: generate_bytecode_builtins_list_action_73a03d1964edbe79fc19deb968fa21d5c456544c3d095b62158c8959ed2aeed1121[72/1875] CC obj/deps/v8/third_party/zlib/v8_zlib.adler32.o122cc1: warning: command-line option '-fvisibility-inlines-hidden' is valid for C++/ObjC++ but not for C123[73/1875] CC obj/deps/v8/third_party/zlib/v8_zlib.compress.o124cc1: warning: command-line option '-fvisibility-inlines-hidden' is valid for C++/ObjC++ but not for C125[74/1875] CC obj/deps/v8/third_party/zlib/v8_zlib.cpu_features.o126cc1: warning: command-line option '-fvisibility-inlines-hidden' is valid for C++/ObjC++ but not for C127[75/1875] CC obj/deps/v8/third_party/zlib/v8_zlib.crc32.o128cc1: warning: command-line option '-fvisibility-inlines-hidden' is valid for C++/ObjC++ but not for C129[76/1875] CXX obj/deps/v8/src/regexp/gen-regexp-special-case.gen-regexp-special-case.o130[77/1875] CC obj/deps/v8/third_party/zlib/v8_zlib.gzclose.o131cc1: warning: command-line option '-fvisibility-inlines-hidden' is valid for C++/ObjC++ but not for C132[78/1875] CXX obj/deps/v8/src/torque/torque.torque.o133[79/1875] CC obj/deps/v8/third_party/zlib/v8_zlib.gzlib.o134cc1: warning: command-line option '-fvisibility-inlines-hidden' is valid for C++/ObjC++ but not for C135[80/1875] LINK gen-regexp-special-case136[81/1875] CXX obj/deps/v8/src/torque/torque_base.type-visitor.o137[82/1875] ACTION run_gen-regexp-special-case: run_gen-regexp-special-case_action_72d03329d19e24c609ee6e65eeeb110034e9261c37b8a8d83522628d574e9fa7138[83/1875] CC obj/deps/v8/third_party/zlib/v8_zlib.gzread.o139cc1: warning: command-line option '-fvisibility-inlines-hidden' is valid for C++/ObjC++ but not for C140[84/1875] CC obj/deps/v8/third_party/zlib/v8_zlib.gzwrite.o141cc1: warning: command-line option '-fvisibility-inlines-hidden' is valid for C++/ObjC++ but not for C142[85/1875] CC obj/deps/v8/third_party/zlib/v8_zlib.deflate.o143cc1: warning: command-line option '-fvisibility-inlines-hidden' is valid for C++/ObjC++ but not for C144[86/1875] CC obj/deps/v8/third_party/zlib/v8_zlib.inffast.o145cc1: warning: command-line option '-fvisibility-inlines-hidden' is valid for C++/ObjC++ but not for C146[87/1875] CC obj/deps/v8/third_party/zlib/v8_zlib.infback.o147cc1: warning: command-line option '-fvisibility-inlines-hidden' is valid for C++/ObjC++ but not for C148[88/1875] CC obj/deps/v8/third_party/zlib/v8_zlib.inftrees.o149cc1: warning: command-line option '-fvisibility-inlines-hidden' is valid for C++/ObjC++ but not for C150[89/1875] CC obj/deps/v8/third_party/zlib/v8_zlib.uncompr.o151cc1: warning: command-line option '-fvisibility-inlines-hidden' is valid for C++/ObjC++ but not for C152[90/1875] CC obj/deps/v8/third_party/zlib/v8_zlib.zutil.o153cc1: warning: command-line option '-fvisibility-inlines-hidden' is valid for C++/ObjC++ but not for C154[91/1875] CXX obj/deps/v8/third_party/zlib/google/v8_zlib.compression_utils_portable.o155[92/1875] CC obj/deps/v8/third_party/zlib/v8_zlib.trees.o156cc1: warning: command-line option '-fvisibility-inlines-hidden' is valid for C++/ObjC++ but not for C157[93/1875] CC obj/deps/v8/third_party/zlib/v8_zlib.inflate.o158cc1: warning: command-line option '-fvisibility-inlines-hidden' is valid for C++/ObjC++ but not for C159[94/1875] CXX obj/deps/v8/src/libplatform/v8_libplatform.default-thread-isolated-allocator.o160[95/1875] CXX obj/deps/v8/src/torque/torque_base.types.o161[96/1875] CXX obj/deps/v8/src/libplatform/v8_libplatform.default-job.o162[97/1875] CXX obj/deps/v8/src/libplatform/v8_libplatform.default-worker-threads-task-runner.o163[98/1875] CXX obj/deps/v8/src/libplatform/v8_libplatform.default-foreground-task-runner.o164[99/1875] CXX obj/deps/v8/src/libplatform/v8_libplatform.default-platform.o165[100/1875] CXX obj/deps/v8/src/libplatform/v8_libplatform.delayed-task-queue.o166[101/1875] CXX obj/deps/v8/src/libplatform/tracing/v8_libplatform.trace-config.o167[102/1875] CXX obj/deps/v8/src/libplatform/v8_libplatform.task-queue.o168[103/1875] CXX obj/deps/v8/src/libplatform/tracing/v8_libplatform.trace-object.o169[104/1875] CXX obj/deps/v8/src/libplatform/tracing/v8_libplatform.trace-buffer.o170[105/1875] CXX obj/deps/v8/src/libplatform/tracing/v8_libplatform.trace-writer.o171[106/1875] CXX obj/src/node_js2c.embedded_data.o172[107/1875] AR obj/tools/v8_gypfiles/libv8_zlib.a173[108/1875] CXX obj/src/node_js2c.builtin_info.o174[109/1875] CXX obj/deps/v8/src/libplatform/tracing/v8_libplatform.tracing-controller.o175[110/1875] CXX obj/deps/v8/src/libplatform/v8_libplatform.worker-thread.o176[111/1875] AR obj/tools/v8_gypfiles/libv8_libplatform.a177[112/1875] CXX obj/deps/ncrypto/ncrypto_engine.engine.o178[113/1875] CXX obj/deps/inspector_protocol/crdtp/crdtp.error_support.o179[114/1875] CXX obj/tools/node_js2c.js2c.o180[115/1875] CXX obj/deps/inspector_protocol/crdtp/crdtp.cbor.o181[116/1875] LINK node_js2c182[117/1875] STAMP obj/node_base.actions_depends.stamp183[118/1875] ACTION node_base: convert_node_protocol_to_json_f26a10641803f604d1307d23f68bde8b450ad8f073bd43313642df31e7a3478c184[119/1875] ACTION node_base: concatenate_protocols_f26a10641803f604d1307d23f68bde8b450ad8f073bd43313642df31e7a3478c185[120/1875] ACTION node_base: node_js2c_f26a10641803f604d1307d23f68bde8b450ad8f073bd43313642df31e7a3478c186[121/1875] CXX obj/deps/inspector_protocol/crdtp/crdtp.dispatch.o187[122/1875] ACTION node_base: v8_inspector_compress_protocol_json_f26a10641803f604d1307d23f68bde8b450ad8f073bd43313642df31e7a3478c188[123/1875] CXX obj/deps/inspector_protocol/crdtp/crdtp.json_platform.o189[124/1875] ACTION Generating node protocol sources from protocol json190[125/1875] STAMP obj/node_base.actions_rules_copies.stamp191[126/1875] CXX obj/deps/inspector_protocol/crdtp/crdtp.span.o192[127/1875] CXX obj/deps/inspector_protocol/crdtp/crdtp.serializable.o193[128/1875] CXX obj/deps/inspector_protocol/crdtp/crdtp.protocol_core.o194[129/1875] CXX obj/deps/inspector_protocol/crdtp/crdtp.status.o195[130/1875] CXX obj/deps/inspector_protocol/crdtp/crdtp.json.o196[131/1875] CXX obj/deps/ncrypto/ncrypto.ncrypto.o197[132/1875] CXX obj/gen/src/node/inspector/protocol/node_base.NodeWorker.o198In file included from ../../src/util.h:29,199 from ../../src/inspector/node_string.h:10,200 from gen/src/node/inspector/protocol/Forward.h:19,201 from gen/src/node/inspector/protocol/Protocol.h:18,202 from gen/src/node/inspector/protocol/NodeWorker.h:10,203 from gen/src/node/inspector/protocol/NodeWorker.cpp:7:204../../deps/v8/include/v8-profiler.h: In constructor 'v8::HeapProfiler::HeapSnapshotOptions::HeapSnapshotOptions()':205../../deps/v8/include/v8-profiler.h:1128:27: warning: 'v8::HeapProfiler::HeapSnapshotOptions::global_object_name_resolver' is deprecated: Use context_name_resolver callback instead. [-Wdeprecated-declarations]206 1128 | HeapSnapshotOptions() {}207 | ^208../../deps/v8/include/v8-profiler.h:1142:25: note: declared here209 1142 | ObjectNameResolver* global_object_name_resolver = nullptr;210 | ^~~~~~~~~~~~~~~~~~~~~~~~~~~211../../deps/v8/include/v8-profiler.h:1128:27: warning: 'v8::HeapProfiler::HeapSnapshotOptions::global_object_name_resolver' is deprecated: Use context_name_resolver callback instead. [-Wdeprecated-declarations]212 1128 | HeapSnapshotOptions() {}213 | ^214../../deps/v8/include/v8-profiler.h:1142:25: note: declared here215 1142 | ObjectNameResolver* global_object_name_resolver = nullptr;216 | ^~~~~~~~~~~~~~~~~~~~~~~~~~~217[133/1875] CXX obj/gen/src/node/inspector/protocol/node_base.Protocol.o218In file included from ../../src/util.h:29,219 from ../../src/inspector/node_string.h:10,220 from gen/src/node/inspector/protocol/Forward.h:19,221 from gen/src/node/inspector/protocol/Protocol.h:18,222 from gen/src/node/inspector/protocol/Protocol.cpp:7:223../../deps/v8/include/v8-profiler.h: In constructor 'v8::HeapProfiler::HeapSnapshotOptions::HeapSnapshotOptions()':224../../deps/v8/include/v8-profiler.h:1128:27: warning: 'v8::HeapProfiler::HeapSnapshotOptions::global_object_name_resolver' is deprecated: Use context_name_resolver callback instead. [-Wdeprecated-declarations]225 1128 | HeapSnapshotOptions() {}226 | ^227../../deps/v8/include/v8-profiler.h:1142:25: note: declared here228 1142 | ObjectNameResolver* global_object_name_resolver = nullptr;229 | ^~~~~~~~~~~~~~~~~~~~~~~~~~~230../../deps/v8/include/v8-profiler.h:1128:27: warning: 'v8::HeapProfiler::HeapSnapshotOptions::global_object_name_resolver' is deprecated: Use context_name_resolver callback instead. [-Wdeprecated-declarations]231 1128 | HeapSnapshotOptions() {}232 | ^233../../deps/v8/include/v8-profiler.h:1142:25: note: declared here234 1142 | ObjectNameResolver* global_object_name_resolver = nullptr;235 | ^~~~~~~~~~~~~~~~~~~~~~~~~~~236[134/1875] CXX obj/deps/v8/third_party/simdutf/simdutf.simdutf.o237[135/1875] AR obj/tools/v8_gypfiles/libsimdutf.a238[136/1875] CXX obj/gen/src/node/inspector/protocol/node_base.NodeTracing.o239In file included from ../../src/util.h:29,240 from ../../src/inspector/node_string.h:10,241 from gen/src/node/inspector/protocol/Forward.h:19,242 from gen/src/node/inspector/protocol/Protocol.h:18,243 from gen/src/node/inspector/protocol/NodeTracing.h:10,244 from gen/src/node/inspector/protocol/NodeTracing.cpp:7:245../../deps/v8/include/v8-profiler.h: In constructor 'v8::HeapProfiler::HeapSnapshotOptions::HeapSnapshotOptions()':246../../deps/v8/include/v8-profiler.h:1128:27: warning: 'v8::HeapProfiler::HeapSnapshotOptions::global_object_name_resolver' is deprecated: Use context_name_resolver callback instead. [-Wdeprecated-declarations]247 1128 | HeapSnapshotOptions() {}248 | ^249../../deps/v8/include/v8-profiler.h:1142:25: note: declared here250 1142 | ObjectNameResolver* global_object_name_resolver = nullptr;251 | ^~~~~~~~~~~~~~~~~~~~~~~~~~~252../../deps/v8/include/v8-profiler.h:1128:27: warning: 'v8::HeapProfiler::HeapSnapshotOptions::global_object_name_resolver' is deprecated: Use context_name_resolver callback instead. [-Wdeprecated-declarations]253 1128 | HeapSnapshotOptions() {}254 | ^255../../deps/v8/include/v8-profiler.h:1142:25: note: declared here256 1142 | ObjectNameResolver* global_object_name_resolver = nullptr;257 | ^~~~~~~~~~~~~~~~~~~~~~~~~~~258[137/1875] CXX obj/deps/v8/src/torque/torque_base.implementation-visitor.o259[138/1875] CXX obj/gen/src/node/inspector/protocol/node_base.NodeRuntime.o260In file included from ../../src/util.h:29,261 from ../../src/inspector/node_string.h:10,262 from gen/src/node/inspector/protocol/Forward.h:19,263 from gen/src/node/inspector/protocol/Protocol.h:18,264 from gen/src/node/inspector/protocol/NodeRuntime.h:10,265 from gen/src/node/inspector/protocol/NodeRuntime.cpp:7:266../../deps/v8/include/v8-profiler.h: In constructor 'v8::HeapProfiler::HeapSnapshotOptions::HeapSnapshotOptions()':267../../deps/v8/include/v8-profiler.h:1128:27: warning: 'v8::HeapProfiler::HeapSnapshotOptions::global_object_name_resolver' is deprecated: Use context_name_resolver callback instead. [-Wdeprecated-declarations]268 1128 | HeapSnapshotOptions() {}269 | ^270../../deps/v8/include/v8-profiler.h:1142:25: note: declared here271 1142 | ObjectNameResolver* global_object_name_resolver = nullptr;272 | ^~~~~~~~~~~~~~~~~~~~~~~~~~~273../../deps/v8/include/v8-profiler.h:1128:27: warning: 'v8::HeapProfiler::HeapSnapshotOptions::global_object_name_resolver' is deprecated: Use context_name_resolver callback instead. [-Wdeprecated-declarations]274 1128 | HeapSnapshotOptions() {}275 | ^276../../deps/v8/include/v8-profiler.h:1142:25: note: declared here277 1142 | ObjectNameResolver* global_object_name_resolver = nullptr;278 | ^~~~~~~~~~~~~~~~~~~~~~~~~~~279[139/1875] CXX obj/gen/src/node/inspector/protocol/node_base.Target.o280In file included from ../../src/util.h:29,281 from ../../src/inspector/node_string.h:10,282 from gen/src/node/inspector/protocol/Forward.h:19,283 from gen/src/node/inspector/protocol/Protocol.h:18,284 from gen/src/node/inspector/protocol/Target.h:10,285 from gen/src/node/inspector/protocol/Target.cpp:7:286../../deps/v8/include/v8-profiler.h: In constructor 'v8::HeapProfiler::HeapSnapshotOptions::HeapSnapshotOptions()':287../../deps/v8/include/v8-profiler.h:1128:27: warning: 'v8::HeapProfiler::HeapSnapshotOptions::global_object_name_resolver' is deprecated: Use context_name_resolver callback instead. [-Wdeprecated-declarations]288 1128 | HeapSnapshotOptions() {}289 | ^290../../deps/v8/include/v8-profiler.h:1142:25: note: declared here291 1142 | ObjectNameResolver* global_object_name_resolver = nullptr;292 | ^~~~~~~~~~~~~~~~~~~~~~~~~~~293../../deps/v8/include/v8-profiler.h:1128:27: warning: 'v8::HeapProfiler::HeapSnapshotOptions::global_object_name_resolver' is deprecated: Use context_name_resolver callback instead. [-Wdeprecated-declarations]294 1128 | HeapSnapshotOptions() {}295 | ^296../../deps/v8/include/v8-profiler.h:1142:25: note: declared here297 1142 | ObjectNameResolver* global_object_name_resolver = nullptr;298 | ^~~~~~~~~~~~~~~~~~~~~~~~~~~299[140/1875] CXX obj/gen/src/node/inspector/protocol/node_base.Network.o300In file included from ../../src/util.h:29,301 from ../../src/inspector/node_string.h:10,302 from gen/src/node/inspector/protocol/Forward.h:19,303 from gen/src/node/inspector/protocol/Protocol.h:18,304 from gen/src/node/inspector/protocol/Network.h:10,305 from gen/src/node/inspector/protocol/Network.cpp:7:306../../deps/v8/include/v8-profiler.h: In constructor 'v8::HeapProfiler::HeapSnapshotOptions::HeapSnapshotOptions()':307../../deps/v8/include/v8-profiler.h:1128:27: warning: 'v8::HeapProfiler::HeapSnapshotOptions::global_object_name_resolver' is deprecated: Use context_name_resolver callback instead. [-Wdeprecated-declarations]308 1128 | HeapSnapshotOptions() {}309 | ^310../../deps/v8/include/v8-profiler.h:1142:25: note: declared here311 1142 | ObjectNameResolver* global_object_name_resolver = nullptr;312 | ^~~~~~~~~~~~~~~~~~~~~~~~~~~313../../deps/v8/include/v8-profiler.h:1128:27: warning: 'v8::HeapProfiler::HeapSnapshotOptions::global_object_name_resolver' is deprecated: Use context_name_resolver callback instead. [-Wdeprecated-declarations]314 1128 | HeapSnapshotOptions() {}315 | ^316../../deps/v8/include/v8-profiler.h:1142:25: note: declared here317 1142 | ObjectNameResolver* global_object_name_resolver = nullptr;318 | ^~~~~~~~~~~~~~~~~~~~~~~~~~~319[141/1875] CXX obj/gen/src/node/inspector/protocol/node_base.IO.o320In file included from ../../src/util.h:29,321 from ../../src/inspector/node_string.h:10,322 from gen/src/node/inspector/protocol/Forward.h:19,323 from gen/src/node/inspector/protocol/Protocol.h:18,324 from gen/src/node/inspector/protocol/IO.h:10,325 from gen/src/node/inspector/protocol/IO.cpp:7:326../../deps/v8/include/v8-profiler.h: In constructor 'v8::HeapProfiler::HeapSnapshotOptions::HeapSnapshotOptions()':327../../deps/v8/include/v8-profiler.h:1128:27: warning: 'v8::HeapProfiler::HeapSnapshotOptions::global_object_name_resolver' is deprecated: Use context_name_resolver callback instead. [-Wdeprecated-declarations]328 1128 | HeapSnapshotOptions() {}329 | ^330../../deps/v8/include/v8-profiler.h:1142:25: note: declared here331 1142 | ObjectNameResolver* global_object_name_resolver = nullptr;332 | ^~~~~~~~~~~~~~~~~~~~~~~~~~~333../../deps/v8/include/v8-profiler.h:1128:27: warning: 'v8::HeapProfiler::HeapSnapshotOptions::global_object_name_resolver' is deprecated: Use context_name_resolver callback instead. [-Wdeprecated-declarations]334 1128 | HeapSnapshotOptions() {}335 | ^336../../deps/v8/include/v8-profiler.h:1142:25: note: declared here337 1142 | ObjectNameResolver* global_object_name_resolver = nullptr;338 | ^~~~~~~~~~~~~~~~~~~~~~~~~~~339[142/1875] CXX obj/gen/src/node/inspector/protocol/node_base.Storage.o340In file included from ../../src/util.h:29,341 from ../../src/inspector/node_string.h:10,342 from gen/src/node/inspector/protocol/Forward.h:19,343 from gen/src/node/inspector/protocol/Protocol.h:18,344 from gen/src/node/inspector/protocol/Storage.h:10,345 from gen/src/node/inspector/protocol/Storage.cpp:7:346../../deps/v8/include/v8-profiler.h: In constructor 'v8::HeapProfiler::HeapSnapshotOptions::HeapSnapshotOptions()':347../../deps/v8/include/v8-profiler.h:1128:27: warning: 'v8::HeapProfiler::HeapSnapshotOptions::global_object_name_resolver' is deprecated: Use context_name_resolver callback instead. [-Wdeprecated-declarations]348 1128 | HeapSnapshotOptions() {}349 | ^350../../deps/v8/include/v8-profiler.h:1142:25: note: declared here351 1142 | ObjectNameResolver* global_object_name_resolver = nullptr;352 | ^~~~~~~~~~~~~~~~~~~~~~~~~~~353../../deps/v8/include/v8-profiler.h:1128:27: warning: 'v8::HeapProfiler::HeapSnapshotOptions::global_object_name_resolver' is deprecated: Use context_name_resolver callback instead. [-Wdeprecated-declarations]354 1128 | HeapSnapshotOptions() {}355 | ^356../../deps/v8/include/v8-profiler.h:1142:25: note: declared here357 1142 | ObjectNameResolver* global_object_name_resolver = nullptr;358 | ^~~~~~~~~~~~~~~~~~~~~~~~~~~359[143/1875] CXX obj/gen/src/node/inspector/protocol/node_base.DOMStorage.o360In file included from ../../src/util.h:29,361 from ../../src/inspector/node_string.h:10,362 from gen/src/node/inspector/protocol/Forward.h:19,363 from gen/src/node/inspector/protocol/Protocol.h:18,364 from gen/src/node/inspector/protocol/DOMStorage.h:10,365 from gen/src/node/inspector/protocol/DOMStorage.cpp:7:366../../deps/v8/include/v8-profiler.h: In constructor 'v8::HeapProfiler::HeapSnapshotOptions::HeapSnapshotOptions()':367../../deps/v8/include/v8-profiler.h:1128:27: warning: 'v8::HeapProfiler::HeapSnapshotOptions::global_object_name_resolver' is deprecated: Use context_name_resolver callback instead. [-Wdeprecated-declarations]368 1128 | HeapSnapshotOptions() {}369 | ^370../../deps/v8/include/v8-profiler.h:1142:25: note: declared here371 1142 | ObjectNameResolver* global_object_name_resolver = nullptr;372 | ^~~~~~~~~~~~~~~~~~~~~~~~~~~373../../deps/v8/include/v8-profiler.h:1128:27: warning: 'v8::HeapProfiler::HeapSnapshotOptions::global_object_name_resolver' is deprecated: Use context_name_resolver callback instead. [-Wdeprecated-declarations]374 1128 | HeapSnapshotOptions() {}375 | ^376../../deps/v8/include/v8-profiler.h:1142:25: note: declared here377 1142 | ObjectNameResolver* global_object_name_resolver = nullptr;378 | ^~~~~~~~~~~~~~~~~~~~~~~~~~~379[144/1875] CXX obj/deps/v8/src/torque/torque_base.torque-parser.o380[145/1875] AR obj/tools/v8_gypfiles/libtorque_base.a381[146/1875] STAMP obj/tools/v8_gypfiles/torque.actions_depends.stamp382[147/1875] LINK torque383bld4: building w5na4iaq87mgxjc7qiyzp1iyprk5zk5a-nodejs-slim-26.9.0.drv384structuredAttrs is enabled
unpackPhase
385unpacking source archive /nix/store/7ajvk1c4mspigbdgf21bn9d7f7p9kmgk-node-v26.9.0.tar.xz386source root is node-v26.9.0387setting SOURCE_DATE_EPOCH to timestamp 1789550914 of file "node-v26.9.0/tools/nix/v8.nix"
patchPhase
388applying patch /nix/store/j4p9lc7z8hi4g40cpqpj3qxb9a7bvanp-configure-armv6-vfpv2.patch389patching file configure.py390Hunk #1 succeeded at 49 with fuzz 1 (offset -1 lines).391applying patch /nix/store/igz0qnjkvwi4f2mn7i13h3ndxl9n5ryi-node-npm-build-npm-package-logic.patch392patching file deps/npm/node_modules/@npmcli/run-script/lib/set-path.js393Hunk #1 succeeded at 13 with fuzz 2 (offset 1 line).394Hunk #2 succeeded at 37 (offset 8 lines).395patching file deps/npm/node_modules/pacote/lib/git.js396Hunk #1 succeeded at 186 (offset -2 lines).397patching file deps/npm/node_modules/@npmcli/arborist/lib/arborist/build-ideal-tree.js398Hunk #1 succeeded at 802 (offset 62 lines).399patching file deps/npm/node_modules/@npmcli/arborist/lib/arborist/load-actual.js400Hunk #1 succeeded at 121 with fuzz 1 (offset -26 lines).401applying patch /nix/store/57n0csr7hpdd0y91ljxpiwlfw7fsx3kl-use-correct-env-in-tests.patch402patching file test/parallel/test-child-process-default-options.js403patching file test/parallel/test-child-process-env.js404patching file test/parallel/test-child-process-exec-env.js405applying patch /nix/store/p2mhv95s89kaqmdynhz6y6asalf8y4dh-bin-sh-node-run-v22.patch406patching file test/fixtures/run-script/node_modules/.bin/positional-args407Hunk #1 succeeded at 1 with fuzz 1.408applying patch /nix/store/3za8p3x3hjfr1a9b1lc3z4aapp9sm2ja-use-nix-codesign.patch409patching file test/parallel/test-macos-app-sandbox.js410applying patch /nix/store/6whc7i794ygkcwjwrprw7y9aglfl238g-fix-temporal-integration-with-shared-icu.patch411patching file deps/v8/src/objects/js-temporal-zoneinfo64.cc412patching file tools/v8_gypfiles/v8.gyp413Hunk #1 succeeded at 1398 (offset 19 lines).414Hunk #2 succeeded at 2051 (offset 93 lines).
updateAutotoolsGnuConfigScriptsPhase
415Updating Autotools / GNU config script to a newer upstream version: ./deps/libffi/config.sub416Updating Autotools / GNU config script to a newer upstream version: ./deps/cares/config/config.sub417Updating Autotools / GNU config script to a newer upstream version: ./deps/ngtcp2/ngtcp2/third-party/libev/config.sub418Updating Autotools / GNU config script to a newer upstream version: ./deps/libffi/config.guess419Updating Autotools / GNU config script to a newer upstream version: ./deps/cares/config/config.guess420Updating Autotools / GNU config script to a newer upstream version: ./deps/ngtcp2/ngtcp2/third-party/libev/config.guess
configurePhase
421fixing libtool script ./deps/libffi/ltmain.sh422fixing libtool script ./deps/cares/config/ltmain.sh423fixing libtool script ./deps/ngtcp2/ngtcp2/third-party/libev/ltmain.sh424./deps/libffi/configure425./deps/cares/configure426./deps/ngtcp2/ngtcp2/third-party/libev/configure427configure flags: --prefix=/nix/store/0pnrss6n3aspfki7hglgiillsrwwfc7f-nodejs-slim-26.9.0 --ninja --with-intl=system-icu --openssl-use-def-ca-store --no-cross-compiling --dest-os=linux --dest-cpu=arm64 --v8-enable-temporal-support --use-prefix-to-find-headers --shared-abseil --shared-abseil-libpath=/nix/store/r45nbi89lw5sq68hli3xlrr4zahkdb90-abseil-cpp-20260107.1/lib --shared-ada --shared-ada-libpath=/nix/store/adrkcplbsaxnvj2w751xsvzhm4cfar8g-ada-4.0.0/lib --shared-brotli --shared-brotli-libpath=/nix/store/0glklzmdllhkd17qkq1269njhngvbgwd-brotli-1.2.0-lib/lib --shared-cares --shared-cares-libpath=/nix/store/m8v2h4gzaf2i7z9kjs8byxqddl4am6lh-c-ares-1.34.8/lib --shared-ffi --shared-ffi-libpath=/nix/store/n31cgnpx6p79f3pbw56n85ckky2j3f0x-libffi-3.8.0/lib --shared-gtest --shared-gtest-libpath=/nix/store/q37k767ll7cc22x0hh5fbb760bqdw317-gtest-1.18.0/lib --shared-hdr-histogram --shared-hdr-histogram-libpath=/nix/store/2c3bix9p476qx35vwzk2k2h93wiwf90f-hdrhistogram_c-0.11.10/lib --shared-highway --shared-highway-libpath=/nix/store/bccxpqws3spiwag5z7vrmhc9mw7gvhn3-libhwy-1.4.0/lib --shared-http-parser --shared-http-parser-libpath=/nix/store/60fmiv4q0i02alhsr9l3giwkaryn56ic-llhttp-9.4.3/lib --shared-libuv --shared-libuv-libpath=/nix/store/xzxbps3rn5d2m8cp8shfin3w7lbvrdj1-libuv-1.52.1/lib --shared-lief --shared-lief-libpath=/nix/store/j0q9dl3khlqq0qdz52qn0n3lx5y1m7rs-lief-0.17.6/lib --shared-merve --shared-merve-libpath=/nix/store/k7sc1hhdv25plzzkz176dgr4is3nj6zz-merve-1.2.2/lib --shared-nbytes --shared-nbytes-libpath=/nix/store/33qw58z7kdlniv51g75a4sr9m15kk2jx-nbytes-0.1.4/lib --shared-nghttp2 --shared-nghttp2-libpath=/nix/store/717hhzngx3cd36rnw5d3mv2ia0vzr87r-nghttp2-1.70.0-lib/lib --shared-nghttp3 --shared-nghttp3-libpath=/nix/store/2n3j3j85n60axyib6h4kxk7zsjm4a7y0-nghttp3-1.16.0/lib --shared-ngtcp2 --shared-ngtcp2-libpath=/nix/store/5731mwd8sb24ls072pv05m7skfrxjzia-ngtcp2-1.23.0/lib --shared-openssl --shared-openssl-libpath=/nix/store/v89yca35zsb13k51ibz0mcz2rrzjwwrj-openssl-3.6.4/lib --shared-simdjson --shared-simdjson-libpath=/nix/store/4kg2ikzp03l897y89m99ayrrqhq999r9-simdjson-4.6.8/lib --shared-simdutf --shared-simdutf-libpath=/nix/store/m37cwyj66cj9w35p43a702dlv6ggyfrk-simdutf-9.1.0/lib --shared-sqlite --shared-sqlite-libpath=/nix/store/1z13nb8zh15n25d3ym19079kd3qb0yyl-sqlite-3.53.3/lib --shared-temporal_capi --shared-temporal_capi-libpath=/nix/store/vfn19vs39w8m3ncbq9bmfhg249slliig-temporal_capi-0.2.6/lib --shared-uvwasi --shared-uvwasi-libpath=/nix/store/v97c955w6axf4vafwj0n8yrb31blyz5p-uvwasi-0.0.23/lib --shared-zlib --shared-zlib-libpath=/nix/store/8m1ckjz4k9v5ly0dkbyqpaw02kaxrp33-zlib-1.3.2/lib --shared-zstd --shared-zstd-libpath=/nix/store/zf5kl4x0zjkf6zl5d84ac0xahpp0las8-zstd-1.5.7/lib428INFO: configure completed successfully
buildPhase
429build flags: -j8 SHELL=/nix/store/idnyqaaix26szkvhs1mjgi7990jajz9a-bash-5.3p15/bin/bash430TERM=dumb ninja -C out/Release -j8431ninja: Entering directory `out/Release'432[1/1875] CXX obj/deps/v8/src/base/v8_libbase.abort-mode.o433[2/1875] CXX obj/deps/v8/src/base/v8_libbase.bits.o434[3/1875] CXX obj/deps/v8/src/base/v8_libbase.division-by-constant.o435[4/1875] CXX obj/deps/v8/src/base/v8_libbase.cpu.o436[5/1875] CXX obj/deps/v8/src/base/debug/v8_libbase.stack_trace.o437[6/1875] CXX obj/deps/v8/src/base/v8_libbase.file-utils.o438[7/1875] CXX obj/deps/v8/src/base/v8_libbase.fpu.o439[8/1875] CXX obj/deps/v8/src/base/numbers/v8_libbase.cached-powers.o440[9/1875] CXX obj/deps/v8/src/base/numbers/v8_libbase.diy-fp.o441[10/1875] CXX obj/deps/v8/src/base/v8_libbase.emulated-virtual-address-subspace.o442[11/1875] CXX obj/deps/v8/src/base/v8_libbase.bounded-page-allocator.o443[12/1875] CXX obj/deps/v8/src/base/v8_libbase.ieee754.o444[13/1875] CXX obj/deps/v8/src/base/numbers/v8_libbase.bignum-dtoa.o445[14/1875] CXX obj/deps/v8/src/base/numbers/v8_libbase.bignum.o446[15/1875] CXX obj/deps/v8/src/base/v8_libbase.logging.o447[16/1875] CXX obj/deps/v8/src/base/v8_libbase.once.o448[17/1875] CXX obj/deps/v8/src/base/platform/v8_libbase.memory-protection-key.o449[18/1875] CXX obj/deps/v8/src/base/numbers/v8_libbase.dtoa.o450[19/1875] CXX obj/deps/v8/src/base/v8_libbase.page-allocator.o451[20/1875] CXX obj/deps/v8/src/base/numbers/v8_libbase.fast-dtoa.o452[21/1875] CXX obj/deps/v8/src/base/numbers/v8_libbase.fixed-dtoa.o453[22/1875] CXX obj/deps/v8/src/base/numbers/v8_libbase.strtod.o454[23/1875] CXX obj/deps/v8/src/base/platform/v8_libbase.condition-variable.o455[24/1875] CXX obj/deps/v8/src/base/platform/v8_libbase.platform.o456[25/1875] CXX obj/deps/v8/src/base/platform/v8_libbase.semaphore.o457[26/1875] CXX obj/deps/v8/src/base/platform/v8_libbase.mutex.o458[27/1875] CXX obj/deps/v8/src/base/sanitizer/v8_libbase.lsan-page-allocator.o459[28/1875] CXX obj/deps/v8/src/base/v8_libbase.region-allocator.o460[29/1875] CXX obj/deps/v8/src/base/sanitizer/v8_libbase.lsan-virtual-address-space.o461[30/1875] CXX obj/deps/v8/src/base/v8_libbase.sys-info.o462[31/1875] CXX obj/deps/v8/src/base/platform/v8_libbase.time.o463[32/1875] CXX obj/deps/v8/src/base/v8_libbase.strings.o464[33/1875] CXX obj/deps/v8/src/base/v8_libbase.vlq-base64.o465[34/1875] CXX obj/deps/v8/src/base/platform/v8_libbase.platform-posix-time.o466[35/1875] CXX obj/deps/v8/src/base/utils/v8_libbase.random-number-generator.o467[36/1875] CXX obj/deps/v8/src/base/debug/v8_libbase.stack_trace_posix.o468[37/1875] CXX obj/deps/v8/src/base/v8_libbase.virtual-address-space-page-allocator.o469[38/1875] CXX obj/deps/v8/src/base/v8_libbase.virtual-address-space.o470[39/1875] CXX obj/deps/v8/src/base/platform/v8_libbase.platform-linux.o471[40/1875] CXX obj/deps/v8/src/base/platform/v8_libbase.platform-posix.o472[41/1875] AR obj/tools/v8_gypfiles/libv8_libbase.a473[42/1875] CXX obj/deps/v8/src/torque/torque_base.cpp-builder.o474[43/1875] CXX obj/deps/v8/src/torque/torque_base.declarable.o475[44/1875] CXX obj/deps/v8/src/torque/torque_base.cfg.o476[45/1875] CXX obj/deps/v8/src/torque/torque_base.cc-generator.o477[46/1875] CXX obj/deps/v8/src/torque/torque_base.class-debug-reader-generator.o478[47/1875] CXX obj/deps/v8/src/torque/torque_base.earley-parser.o479[48/1875] CXX obj/deps/v8/src/torque/torque_base.csa-generator.o480[49/1875] CXX obj/deps/v8/src/torque/torque_base.declarations.o481[50/1875] CXX obj/deps/v8/src/torque/torque_base.global-context.o482[51/1875] CXX obj/deps/v8/src/torque/torque_base.declaration-visitor.o483[52/1875] CXX obj/deps/v8/src/torque/torque_base.source-positions.o484[53/1875] CXX obj/deps/v8/src/torque/torque_base.instance-type-generator.o485[54/1875] CXX obj/deps/v8/src/torque/torque_base.server-data.o486[55/1875] CXX obj/deps/v8/src/torque/torque_base.kythe-data.o487[56/1875] CXX obj/deps/v8/src/torque/torque_base.torque-code-generator.o488[57/1875] CXX obj/deps/v8/src/torque/torque_base.instructions.o489[58/1875] CXX obj/deps/v8/src/torque/torque_base.type-inference.o490[59/1875] CXX obj/deps/v8/src/torque/torque_base.type-oracle.o491[60/1875] CXX obj/deps/v8/src/torque/torque_base.utils.o492[61/1875] CXX obj/deps/v8/src/torque/torque_base.torque-compiler.o493[62/1875] CXX obj/deps/v8/src/builtins/bytecode_builtins_list_generator.generate-bytecodes-builtins-list.o494[63/1875] CXX obj/deps/v8/src/interpreter/bytecode_builtins_list_generator.bytecode-operands.o495[64/1875] ACTION Checking inspector protocol compatibility496[65/1875] ACTION Generating inspector protocol sources from protocol json497[66/1875] STAMP obj/tools/v8_gypfiles/v8_flags.actions_depends.stamp498[67/1875] STAMP obj/tools/v8_gypfiles/v8_inspector_headers.actions_rules_copies.stamp499[68/1875] ACTION Generating temporal zoneinfo static data500[69/1875] CXX obj/deps/v8/src/interpreter/bytecode_builtins_list_generator.bytecodes.o501[70/1875] CC obj/deps/v8/third_party/zlib/v8_zlib.adler32.o502cc1: warning: command-line option '-fvisibility-inlines-hidden' is valid for C++/ObjC++ but not for C503[71/1875] CC obj/deps/v8/third_party/zlib/v8_zlib.compress.o504cc1: warning: command-line option '-fvisibility-inlines-hidden' is valid for C++/ObjC++ but not for C505[72/1875] CC obj/deps/v8/third_party/zlib/v8_zlib.cpu_features.o506cc1: warning: command-line option '-fvisibility-inlines-hidden' is valid for C++/ObjC++ but not for C507[73/1875] LINK bytecode_builtins_list_generator508[74/1875] ACTION generate_bytecode_builtins_list: generate_bytecode_builtins_list_action_73a03d1964edbe79fc19deb968fa21d5c456544c3d095b62158c8959ed2aeed1509[75/1875] CC obj/deps/v8/third_party/zlib/v8_zlib.crc32.o510cc1: warning: command-line option '-fvisibility-inlines-hidden' is valid for C++/ObjC++ but not for C511[76/1875] CC obj/deps/v8/third_party/zlib/v8_zlib.gzclose.o512cc1: warning: command-line option '-fvisibility-inlines-hidden' is valid for C++/ObjC++ but not for C513[77/1875] CC obj/deps/v8/third_party/zlib/v8_zlib.gzlib.o514cc1: warning: command-line option '-fvisibility-inlines-hidden' is valid for C++/ObjC++ but not for C515[78/1875] CXX obj/deps/v8/src/regexp/gen-regexp-special-case.gen-regexp-special-case.o516[79/1875] CC obj/deps/v8/third_party/zlib/v8_zlib.gzread.o517cc1: warning: command-line option '-fvisibility-inlines-hidden' is valid for C++/ObjC++ but not for C518[80/1875] CXX obj/deps/v8/src/torque/torque.torque.o519[81/1875] LINK gen-regexp-special-case520[82/1875] CC obj/deps/v8/third_party/zlib/v8_zlib.deflate.o521cc1: warning: command-line option '-fvisibility-inlines-hidden' is valid for C++/ObjC++ but not for C522[83/1875] CC obj/deps/v8/third_party/zlib/v8_zlib.gzwrite.o523cc1: warning: command-line option '-fvisibility-inlines-hidden' is valid for C++/ObjC++ but not for C524[84/1875] CXX obj/deps/v8/src/torque/torque_base.type-visitor.o525[85/1875] ACTION run_gen-regexp-special-case: run_gen-regexp-special-case_action_72d03329d19e24c609ee6e65eeeb110034e9261c37b8a8d83522628d574e9fa7526[86/1875] CC obj/deps/v8/third_party/zlib/v8_zlib.infback.o527cc1: warning: command-line option '-fvisibility-inlines-hidden' is valid for C++/ObjC++ but not for C528[87/1875] CC obj/deps/v8/third_party/zlib/v8_zlib.inftrees.o529cc1: warning: command-line option '-fvisibility-inlines-hidden' is valid for C++/ObjC++ but not for C530[88/1875] CC obj/deps/v8/third_party/zlib/v8_zlib.uncompr.o531cc1: warning: command-line option '-fvisibility-inlines-hidden' is valid for C++/ObjC++ but not for C532[89/1875] CC obj/deps/v8/third_party/zlib/v8_zlib.inffast.o533cc1: warning: command-line option '-fvisibility-inlines-hidden' is valid for C++/ObjC++ but not for C534[90/1875] CC obj/deps/v8/third_party/zlib/v8_zlib.zutil.o535cc1: warning: command-line option '-fvisibility-inlines-hidden' is valid for C++/ObjC++ but not for C536[91/1875] CXX obj/deps/v8/third_party/zlib/google/v8_zlib.compression_utils_portable.o537[92/1875] CC obj/deps/v8/third_party/zlib/v8_zlib.trees.o538cc1: warning: command-line option '-fvisibility-inlines-hidden' is valid for C++/ObjC++ but not for C539[93/1875] CC obj/deps/v8/third_party/zlib/v8_zlib.inflate.o540cc1: warning: command-line option '-fvisibility-inlines-hidden' is valid for C++/ObjC++ but not for C541[94/1875] CXX obj/deps/v8/src/libplatform/v8_libplatform.default-thread-isolated-allocator.o542[95/1875] CXX obj/deps/v8/src/torque/torque_base.types.o543[96/1875] CXX obj/deps/v8/src/libplatform/v8_libplatform.default-job.o544[97/1875] CXX obj/deps/v8/src/libplatform/v8_libplatform.default-worker-threads-task-runner.o545[98/1875] CXX obj/deps/v8/src/libplatform/v8_libplatform.default-foreground-task-runner.o546[99/1875] CXX obj/deps/v8/src/libplatform/v8_libplatform.default-platform.o547[100/1875] CXX obj/deps/v8/src/libplatform/v8_libplatform.delayed-task-queue.o548[101/1875] CXX obj/deps/v8/src/libplatform/v8_libplatform.task-queue.o549[102/1875] CXX obj/deps/v8/src/libplatform/tracing/v8_libplatform.trace-config.o550[103/1875] CXX obj/deps/v8/src/libplatform/tracing/v8_libplatform.trace-object.o551[104/1875] CXX obj/deps/v8/src/libplatform/tracing/v8_libplatform.trace-writer.o552[105/1875] CXX obj/deps/v8/src/libplatform/tracing/v8_libplatform.trace-buffer.o553[106/1875] CXX obj/src/node_js2c.embedded_data.o554[107/1875] AR obj/tools/v8_gypfiles/libv8_zlib.a555[108/1875] CXX obj/src/node_js2c.builtin_info.o556[109/1875] CXX obj/deps/v8/src/libplatform/tracing/v8_libplatform.tracing-controller.o557[110/1875] CXX obj/deps/ncrypto/ncrypto_engine.engine.o558[111/1875] CXX obj/deps/v8/src/libplatform/v8_libplatform.worker-thread.o559[112/1875] AR obj/tools/v8_gypfiles/libv8_libplatform.a560[113/1875] CXX obj/deps/inspector_protocol/crdtp/crdtp.error_support.o561[114/1875] CXX obj/tools/node_js2c.js2c.o562[115/1875] CXX obj/deps/inspector_protocol/crdtp/crdtp.cbor.o563[116/1875] LINK node_js2c564[117/1875] STAMP obj/node_base.actions_depends.stamp565[118/1875] ACTION node_base: convert_node_protocol_to_json_f26a10641803f604d1307d23f68bde8b450ad8f073bd43313642df31e7a3478c566[119/1875] ACTION node_base: concatenate_protocols_f26a10641803f604d1307d23f68bde8b450ad8f073bd43313642df31e7a3478c567[120/1875] ACTION node_base: node_js2c_f26a10641803f604d1307d23f68bde8b450ad8f073bd43313642df31e7a3478c568[121/1875] CXX obj/deps/inspector_protocol/crdtp/crdtp.dispatch.o569[122/1875] ACTION node_base: v8_inspector_compress_protocol_json_f26a10641803f604d1307d23f68bde8b450ad8f073bd43313642df31e7a3478c570[123/1875] CXX obj/deps/inspector_protocol/crdtp/crdtp.json_platform.o571[124/1875] ACTION Generating node protocol sources from protocol json572[125/1875] STAMP obj/node_base.actions_rules_copies.stamp573[126/1875] CXX obj/deps/inspector_protocol/crdtp/crdtp.span.o574[127/1875] CXX obj/deps/inspector_protocol/crdtp/crdtp.serializable.o575[128/1875] CXX obj/deps/inspector_protocol/crdtp/crdtp.protocol_core.o576[129/1875] CXX obj/deps/inspector_protocol/crdtp/crdtp.status.o577[130/1875] CXX obj/deps/inspector_protocol/crdtp/crdtp.json.o578[131/1875] CXX obj/deps/ncrypto/ncrypto.ncrypto.o579[132/1875] CXX obj/gen/src/node/inspector/protocol/node_base.NodeWorker.o580In file included from ../../src/util.h:29,581 from ../../src/inspector/node_string.h:10,582 from gen/src/node/inspector/protocol/Forward.h:19,583 from gen/src/node/inspector/protocol/Protocol.h:18,584 from gen/src/node/inspector/protocol/NodeWorker.h:10,585 from gen/src/node/inspector/protocol/NodeWorker.cpp:7:586../../deps/v8/include/v8-profiler.h: In constructor 'v8::HeapProfiler::HeapSnapshotOptions::HeapSnapshotOptions()':587../../deps/v8/include/v8-profiler.h:1128:27: warning: 'v8::HeapProfiler::HeapSnapshotOptions::global_object_name_resolver' is deprecated: Use context_name_resolver callback instead. [-Wdeprecated-declarations]588 1128 | HeapSnapshotOptions() {}589 | ^590../../deps/v8/include/v8-profiler.h:1142:25: note: declared here591 1142 | ObjectNameResolver* global_object_name_resolver = nullptr;592 | ^~~~~~~~~~~~~~~~~~~~~~~~~~~593../../deps/v8/include/v8-profiler.h:1128:27: warning: 'v8::HeapProfiler::HeapSnapshotOptions::global_object_name_resolver' is deprecated: Use context_name_resolver callback instead. [-Wdeprecated-declarations]594 1128 | HeapSnapshotOptions() {}595 | ^596../../deps/v8/include/v8-profiler.h:1142:25: note: declared here597 1142 | ObjectNameResolver* global_object_name_resolver = nullptr;598 | ^~~~~~~~~~~~~~~~~~~~~~~~~~~599[133/1875] CXX obj/deps/v8/third_party/simdutf/simdutf.simdutf.o600[134/1875] AR obj/tools/v8_gypfiles/libsimdutf.a601[135/1875] CXX obj/gen/src/node/inspector/protocol/node_base.Protocol.o602In file included from ../../src/util.h:29,603 from ../../src/inspector/node_string.h:10,604 from gen/src/node/inspector/protocol/Forward.h:19,605 from gen/src/node/inspector/protocol/Protocol.h:18,606 from gen/src/node/inspector/protocol/Protocol.cpp:7:607../../deps/v8/include/v8-profiler.h: In constructor 'v8::HeapProfiler::HeapSnapshotOptions::HeapSnapshotOptions()':608../../deps/v8/include/v8-profiler.h:1128:27: warning: 'v8::HeapProfiler::HeapSnapshotOptions::global_object_name_resolver' is deprecated: Use context_name_resolver callback instead. [-Wdeprecated-declarations]609 1128 | HeapSnapshotOptions() {}610 | ^611../../deps/v8/include/v8-profiler.h:1142:25: note: declared here612 1142 | ObjectNameResolver* global_object_name_resolver = nullptr;613 | ^~~~~~~~~~~~~~~~~~~~~~~~~~~614../../deps/v8/include/v8-profiler.h:1128:27: warning: 'v8::HeapProfiler::HeapSnapshotOptions::global_object_name_resolver' is deprecated: Use context_name_resolver callback instead. [-Wdeprecated-declarations]615 1128 | HeapSnapshotOptions() {}616 | ^617../../deps/v8/include/v8-profiler.h:1142:25: note: declared here618 1142 | ObjectNameResolver* global_object_name_resolver = nullptr;619 | ^~~~~~~~~~~~~~~~~~~~~~~~~~~620[136/1875] CXX obj/gen/src/node/inspector/protocol/node_base.NodeTracing.o621In file included from ../../src/util.h:29,622 from ../../src/inspector/node_string.h:10,623 from gen/src/node/inspector/protocol/Forward.h:19,624 from gen/src/node/inspector/protocol/Protocol.h:18,625 from gen/src/node/inspector/protocol/NodeTracing.h:10,626 from gen/src/node/inspector/protocol/NodeTracing.cpp:7:627../../deps/v8/include/v8-profiler.h: In constructor 'v8::HeapProfiler::HeapSnapshotOptions::HeapSnapshotOptions()':628../../deps/v8/include/v8-profiler.h:1128:27: warning: 'v8::HeapProfiler::HeapSnapshotOptions::global_object_name_resolver' is deprecated: Use context_name_resolver callback instead. [-Wdeprecated-declarations]629 1128 | HeapSnapshotOptions() {}630 | ^631../../deps/v8/include/v8-profiler.h:1142:25: note: declared here632 1142 | ObjectNameResolver* global_object_name_resolver = nullptr;633 | ^~~~~~~~~~~~~~~~~~~~~~~~~~~634../../deps/v8/include/v8-profiler.h:1128:27: warning: 'v8::HeapProfiler::HeapSnapshotOptions::global_object_name_resolver' is deprecated: Use context_name_resolver callback instead. [-Wdeprecated-declarations]635 1128 | HeapSnapshotOptions() {}636 | ^637../../deps/v8/include/v8-profiler.h:1142:25: note: declared here638 1142 | ObjectNameResolver* global_object_name_resolver = nullptr;639 | ^~~~~~~~~~~~~~~~~~~~~~~~~~~640[137/1875] CXX obj/deps/v8/src/torque/torque_base.implementation-visitor.o641[138/1875] CXX obj/gen/src/node/inspector/protocol/node_base.NodeRuntime.o642In file included from ../../src/util.h:29,643 from ../../src/inspector/node_string.h:10,644 from gen/src/node/inspector/protocol/Forward.h:19,645 from gen/src/node/inspector/protocol/Protocol.h:18,646 from gen/src/node/inspector/protocol/NodeRuntime.h:10,647 from gen/src/node/inspector/protocol/NodeRuntime.cpp:7:648../../deps/v8/include/v8-profiler.h: In constructor 'v8::HeapProfiler::HeapSnapshotOptions::HeapSnapshotOptions()':649../../deps/v8/include/v8-profiler.h:1128:27: warning: 'v8::HeapProfiler::HeapSnapshotOptions::global_object_name_resolver' is deprecated: Use context_name_resolver callback instead. [-Wdeprecated-declarations]650 1128 | HeapSnapshotOptions() {}651 | ^652../../deps/v8/include/v8-profiler.h:1142:25: note: declared here653 1142 | ObjectNameResolver* global_object_name_resolver = nullptr;654 | ^~~~~~~~~~~~~~~~~~~~~~~~~~~655../../deps/v8/include/v8-profiler.h:1128:27: warning: 'v8::HeapProfiler::HeapSnapshotOptions::global_object_name_resolver' is deprecated: Use context_name_resolver callback instead. [-Wdeprecated-declarations]656 1128 | HeapSnapshotOptions() {}657 | ^658../../deps/v8/include/v8-profiler.h:1142:25: note: declared here659 1142 | ObjectNameResolver* global_object_name_resolver = nullptr;660 | ^~~~~~~~~~~~~~~~~~~~~~~~~~~661[139/1875] CXX obj/gen/src/node/inspector/protocol/node_base.IO.o662In file included from ../../src/util.h:29,663 from ../../src/inspector/node_string.h:10,664 from gen/src/node/inspector/protocol/Forward.h:19,665 from gen/src/node/inspector/protocol/Protocol.h:18,666 from gen/src/node/inspector/protocol/IO.h:10,667 from gen/src/node/inspector/protocol/IO.cpp:7:668../../deps/v8/include/v8-profiler.h: In constructor 'v8::HeapProfiler::HeapSnapshotOptions::HeapSnapshotOptions()':669../../deps/v8/include/v8-profiler.h:1128:27: warning: 'v8::HeapProfiler::HeapSnapshotOptions::global_object_name_resolver' is deprecated: Use context_name_resolver callback instead. [-Wdeprecated-declarations]670 1128 | HeapSnapshotOptions() {}671 | ^672../../deps/v8/include/v8-profiler.h:1142:25: note: declared here673 1142 | ObjectNameResolver* global_object_name_resolver = nullptr;674 | ^~~~~~~~~~~~~~~~~~~~~~~~~~~675../../deps/v8/include/v8-profiler.h:1128:27: warning: 'v8::HeapProfiler::HeapSnapshotOptions::global_object_name_resolver' is deprecated: Use context_name_resolver callback instead. [-Wdeprecated-declarations]676 1128 | HeapSnapshotOptions() {}677 | ^678../../deps/v8/include/v8-profiler.h:1142:25: note: declared here679 1142 | ObjectNameResolver* global_object_name_resolver = nullptr;680 | ^~~~~~~~~~~~~~~~~~~~~~~~~~~681[140/1875] CXX obj/gen/src/node/inspector/protocol/node_base.Target.o682In file included from ../../src/util.h:29,683 from ../../src/inspector/node_string.h:10,684 from gen/src/node/inspector/protocol/Forward.h:19,685 from gen/src/node/inspector/protocol/Protocol.h:18,686 from gen/src/node/inspector/protocol/Target.h:10,687 from gen/src/node/inspector/protocol/Target.cpp:7:688../../deps/v8/include/v8-profiler.h: In constructor 'v8::HeapProfiler::HeapSnapshotOptions::HeapSnapshotOptions()':689../../deps/v8/include/v8-profiler.h:1128:27: warning: 'v8::HeapProfiler::HeapSnapshotOptions::global_object_name_resolver' is deprecated: Use context_name_resolver callback instead. [-Wdeprecated-declarations]690 1128 | HeapSnapshotOptions() {}691 | ^692../../deps/v8/include/v8-profiler.h:1142:25: note: declared here693 1142 | ObjectNameResolver* global_object_name_resolver = nullptr;694 | ^~~~~~~~~~~~~~~~~~~~~~~~~~~695../../deps/v8/include/v8-profiler.h:1128:27: warning: 'v8::HeapProfiler::HeapSnapshotOptions::global_object_name_resolver' is deprecated: Use context_name_resolver callback instead. [-Wdeprecated-declarations]696 1128 | HeapSnapshotOptions() {}697 | ^698../../deps/v8/include/v8-profiler.h:1142:25: note: declared here699 1142 | ObjectNameResolver* global_object_name_resolver = nullptr;700 | ^~~~~~~~~~~~~~~~~~~~~~~~~~~701[141/1875] CXX obj/gen/src/node/inspector/protocol/node_base.Storage.o702In file included from ../../src/util.h:29,703 from ../../src/inspector/node_string.h:10,704 from gen/src/node/inspector/protocol/Forward.h:19,705 from gen/src/node/inspector/protocol/Protocol.h:18,706 from gen/src/node/inspector/protocol/Storage.h:10,707 from gen/src/node/inspector/protocol/Storage.cpp:7:708../../deps/v8/include/v8-profiler.h: In constructor 'v8::HeapProfiler::HeapSnapshotOptions::HeapSnapshotOptions()':709../../deps/v8/include/v8-profiler.h:1128:27: warning: 'v8::HeapProfiler::HeapSnapshotOptions::global_object_name_resolver' is deprecated: Use context_name_resolver callback instead. [-Wdeprecated-declarations]710 1128 | HeapSnapshotOptions() {}711 | ^712../../deps/v8/include/v8-profiler.h:1142:25: note: declared here713 1142 | ObjectNameResolver* global_object_name_resolver = nullptr;714 | ^~~~~~~~~~~~~~~~~~~~~~~~~~~715../../deps/v8/include/v8-profiler.h:1128:27: warning: 'v8::HeapProfiler::HeapSnapshotOptions::global_object_name_resolver' is deprecated: Use context_name_resolver callback instead. [-Wdeprecated-declarations]716 1128 | HeapSnapshotOptions() {}717 | ^718../../deps/v8/include/v8-profiler.h:1142:25: note: declared here719 1142 | ObjectNameResolver* global_object_name_resolver = nullptr;720 | ^~~~~~~~~~~~~~~~~~~~~~~~~~~721[142/1875] CXX obj/gen/src/node/inspector/protocol/node_base.Network.o722In file included from ../../src/util.h:29,723 from ../../src/inspector/node_string.h:10,724 from gen/src/node/inspector/protocol/Forward.h:19,725 from gen/src/node/inspector/protocol/Protocol.h:18,726 from gen/src/node/inspector/protocol/Network.h:10,727 from gen/src/node/inspector/protocol/Network.cpp:7:728../../deps/v8/include/v8-profiler.h: In constructor 'v8::HeapProfiler::HeapSnapshotOptions::HeapSnapshotOptions()':729../../deps/v8/include/v8-profiler.h:1128:27: warning: 'v8::HeapProfiler::HeapSnapshotOptions::global_object_name_resolver' is deprecated: Use context_name_resolver callback instead. [-Wdeprecated-declarations]730 1128 | HeapSnapshotOptions() {}731 | ^732../../deps/v8/include/v8-profiler.h:1142:25: note: declared here733 1142 | ObjectNameResolver* global_object_name_resolver = nullptr;734 | ^~~~~~~~~~~~~~~~~~~~~~~~~~~735../../deps/v8/include/v8-profiler.h:1128:27: warning: 'v8::HeapProfiler::HeapSnapshotOptions::global_object_name_resolver' is deprecated: Use context_name_resolver callback instead. [-Wdeprecated-declarations]736 1128 | HeapSnapshotOptions() {}737 | ^738../../deps/v8/include/v8-profiler.h:1142:25: note: declared here739 1142 | ObjectNameResolver* global_object_name_resolver = nullptr;740 | ^~~~~~~~~~~~~~~~~~~~~~~~~~~741[143/1875] CXX obj/gen/src/node/inspector/protocol/node_base.DOMStorage.o742In file included from ../../src/util.h:29,743 from ../../src/inspector/node_string.h:10,744 from gen/src/node/inspector/protocol/Forward.h:19,745 from gen/src/node/inspector/protocol/Protocol.h:18,746 from gen/src/node/inspector/protocol/DOMStorage.h:10,747 from gen/src/node/inspector/protocol/DOMStorage.cpp:7:748../../deps/v8/include/v8-profiler.h: In constructor 'v8::HeapProfiler::HeapSnapshotOptions::HeapSnapshotOptions()':749../../deps/v8/include/v8-profiler.h:1128:27: warning: 'v8::HeapProfiler::HeapSnapshotOptions::global_object_name_resolver' is deprecated: Use context_name_resolver callback instead. [-Wdeprecated-declarations]750 1128 | HeapSnapshotOptions() {}751 | ^752../../deps/v8/include/v8-profiler.h:1142:25: note: declared here753 1142 | ObjectNameResolver* global_object_name_resolver = nullptr;754 | ^~~~~~~~~~~~~~~~~~~~~~~~~~~755../../deps/v8/include/v8-profiler.h:1128:27: warning: 'v8::HeapProfiler::HeapSnapshotOptions::global_object_name_resolver' is deprecated: Use context_name_resolver callback instead. [-Wdeprecated-declarations]756 1128 | HeapSnapshotOptions() {}757 | ^758../../deps/v8/include/v8-profiler.h:1142:25: note: declared here759 1142 | ObjectNameResolver* global_object_name_resolver = nullptr;760 | ^~~~~~~~~~~~~~~~~~~~~~~~~~~761[144/1875] CXX obj/deps/v8/src/torque/torque_base.torque-parser.o762[145/1875] AR obj/tools/v8_gypfiles/libtorque_base.a763[146/1875] STAMP obj/tools/v8_gypfiles/torque.actions_depends.stamp764[147/1875] LINK torque765[148/1875] CXX obj/src/api/node_base.async_resource.o766In file included from ../../src/memory_tracker.h:6,767 from ../../src/base_object.h:29,768 from ../../src/async_context_frame.h:6,769 from ../../src/api/async_resource.cc:1:770../../deps/v8/include/v8-profiler.h: In constructor 'v8::HeapProfiler::HeapSnapshotOptions::HeapSnapshotOptions()':771../../deps/v8/include/v8-profiler.h:1128:27: warning: 'v8::HeapProfiler::HeapSnapshotOptions::global_object_name_resolver' is deprecated: Use context_name_resolver callback instead. [-Wdeprecated-declarations]772 1128 | HeapSnapshotOptions() {}773 | ^774../../deps/v8/include/v8-profiler.h:1142:25: note: declared here775 1142 | ObjectNameResolver* global_object_name_resolver = nullptr;776 | ^~~~~~~~~~~~~~~~~~~~~~~~~~~777../../deps/v8/include/v8-profiler.h:1128:27: warning: 'v8::HeapProfiler::HeapSnapshotOptions::global_object_name_resolver' is deprecated: Use context_name_resolver callback instead. [-Wdeprecated-declarations]778 1128 | HeapSnapshotOptions() {}779 | ^780../../deps/v8/include/v8-profiler.h:1142:25: note: declared here781 1142 | ObjectNameResolver* global_object_name_resolver = nullptr;782 | ^~~~~~~~~~~~~~~~~~~~~~~~~~~783[149/1875] CXX obj/src/api/node_base.encoding.o784In file included from ../../src/memory_tracker.h:6,785 from ../../src/aliased_buffer.h:7,786 from ../../src/aliased_buffer-inl.h:6,787 from ../../src/env-inl.h:27,788 from ../../src/string_bytes.h:30,789 from ../../src/api/encoding.cc:2:790../../deps/v8/include/v8-profiler.h: In constructor 'v8::HeapProfiler::HeapSnapshotOptions::HeapSnapshotOptions()':791../../deps/v8/include/v8-profiler.h:1128:27: warning: 'v8::HeapProfiler::HeapSnapshotOptions::global_object_name_resolver' is deprecated: Use context_name_resolver callback instead. [-Wdeprecated-declarations]792 1128 | HeapSnapshotOptions() {}793 | ^794../../deps/v8/include/v8-profiler.h:1142:25: note: declared here795 1142 | ObjectNameResolver* global_object_name_resolver = nullptr;796 | ^~~~~~~~~~~~~~~~~~~~~~~~~~~797../../deps/v8/include/v8-profiler.h:1128:27: warning: 'v8::HeapProfiler::HeapSnapshotOptions::global_object_name_resolver' is deprecated: Use context_name_resolver callback instead. [-Wdeprecated-declarations]798 1128 | HeapSnapshotOptions() {}799 | ^800../../deps/v8/include/v8-profiler.h:1142:25: note: declared here801 1142 | ObjectNameResolver* global_object_name_resolver = nullptr;802 | ^~~~~~~~~~~~~~~~~~~~~~~~~~~803[150/1875] CXX obj/src/api/node_base.callback.o804In file included from ../../src/memory_tracker.h:6,805 from ../../src/base_object.h:29,806 from ../../src/async_context_frame.h:6,807 from ../../src/api/callback.cc:1:808../../deps/v8/include/v8-profiler.h: In constructor 'v8::HeapProfiler::HeapSnapshotOptions::HeapSnapshotOptions()':809../../deps/v8/include/v8-profiler.h:1128:27: warning: 'v8::HeapProfiler::HeapSnapshotOptions::global_object_name_resolver' is deprecated: Use context_name_resolver callback instead. [-Wdeprecated-declarations]810 1128 | HeapSnapshotOptions() {}811 | ^812../../deps/v8/include/v8-profiler.h:1142:25: note: declared here813 1142 | ObjectNameResolver* global_object_name_resolver = nullptr;814 | ^~~~~~~~~~~~~~~~~~~~~~~~~~~815../../deps/v8/include/v8-profiler.h:1128:27: warning: 'v8::HeapProfiler::HeapSnapshotOptions::global_object_name_resolver' is deprecated: Use context_name_resolver callback instead. [-Wdeprecated-declarations]816 1128 | HeapSnapshotOptions() {}817 | ^818../../deps/v8/include/v8-profiler.h:1142:25: note: declared here819 1142 | ObjectNameResolver* global_object_name_resolver = nullptr;820 | ^~~~~~~~~~~~~~~~~~~~~~~~~~~821[151/1875] CXX obj/src/api/node_base.embed_helpers.o822In file included from ../../src/memory_tracker.h:6,823 from ../../src/base_object.h:29,824 from ../../src/async_wrap.h:27,825 from ../../src/debug_utils.h:6,826 from ../../src/debug_utils-inl.h:6,827 from ../../src/api/embed_helpers.cc:1:828../../deps/v8/include/v8-profiler.h: In constructor 'v8::HeapProfiler::HeapSnapshotOptions::HeapSnapshotOptions()':829../../deps/v8/include/v8-profiler.h:1128:27: warning: 'v8::HeapProfiler::HeapSnapshotOptions::global_object_name_resolver' is deprecated: Use context_name_resolver callback instead. [-Wdeprecated-declarations]830 1128 | HeapSnapshotOptions() {}831 | ^832../../deps/v8/include/v8-profiler.h:1142:25: note: declared here833 1142 | ObjectNameResolver* global_object_name_resolver = nullptr;834 | ^~~~~~~~~~~~~~~~~~~~~~~~~~~835../../deps/v8/include/v8-profiler.h:1128:27: warning: 'v8::HeapProfiler::HeapSnapshotOptions::global_object_name_resolver' is deprecated: Use context_name_resolver callback instead. [-Wdeprecated-declarations]836 1128 | HeapSnapshotOptions() {}837 | ^838../../deps/v8/include/v8-profiler.h:1142:25: note: declared here839 1142 | ObjectNameResolver* global_object_name_resolver = nullptr;840 | ^~~~~~~~~~~~~~~~~~~~~~~~~~~841[152/1875] CXX obj/src/api/node_base.exceptions.o842In file included from ../../src/memory_tracker.h:6,843 from ../../src/aliased_buffer.h:7,844 from ../../src/aliased_buffer-inl.h:6,845 from ../../src/env-inl.h:27,846 from ../../src/api/exceptions.cc:3:847../../deps/v8/include/v8-profiler.h: In constructor 'v8::HeapProfiler::HeapSnapshotOptions::HeapSnapshotOptions()':848../../deps/v8/include/v8-profiler.h:1128:27: warning: 'v8::HeapProfiler::HeapSnapshotOptions::global_object_name_resolver' is deprecated: Use context_name_resolver callback instead. [-Wdeprecated-declarations]849 1128 | HeapSnapshotOptions() {}850 | ^851../../deps/v8/include/v8-profiler.h:1142:25: note: declared here852 1142 | ObjectNameResolver* global_object_name_resolver = nullptr;853 | ^~~~~~~~~~~~~~~~~~~~~~~~~~~854../../deps/v8/include/v8-profiler.h:1128:27: warning: 'v8::HeapProfiler::HeapSnapshotOptions::global_object_name_resolver' is deprecated: Use context_name_resolver callback instead. [-Wdeprecated-declarations]855 1128 | HeapSnapshotOptions() {}856 | ^857../../deps/v8/include/v8-profiler.h:1142:25: note: declared here858 1142 | ObjectNameResolver* global_object_name_resolver = nullptr;859 | ^~~~~~~~~~~~~~~~~~~~~~~~~~~860[153/1875] CXX obj/src/api/node_base.utils.o861[154/1875] CXX obj/src/api/node_base.environment.o862In file included from ../../src/memory_tracker.h:6,863 from ../../src/base_object.h:29,864 from ../../src/async_wrap.h:27,865 from ../../src/crypto/crypto_util.h:6,866 from ../../src/api/environment.cc:3:867../../deps/v8/include/v8-profiler.h: In constructor 'v8::HeapProfiler::HeapSnapshotOptions::HeapSnapshotOptions()':868../../deps/v8/include/v8-profiler.h:1128:27: warning: 'v8::HeapProfiler::HeapSnapshotOptions::global_object_name_resolver' is deprecated: Use context_name_resolver callback instead. [-Wdeprecated-declarations]869 1128 | HeapSnapshotOptions() {}870 | ^871../../deps/v8/include/v8-profiler.h:1142:25: note: declared here872 1142 | ObjectNameResolver* global_object_name_resolver = nullptr;873 | ^~~~~~~~~~~~~~~~~~~~~~~~~~~874../../deps/v8/include/v8-profiler.h:1128:27: warning: 'v8::HeapProfiler::HeapSnapshotOptions::global_object_name_resolver' is deprecated: Use context_name_resolver callback instead. [-Wdeprecated-declarations]875 1128 | HeapSnapshotOptions() {}876 | ^877../../deps/v8/include/v8-profiler.h:1142:25: note: declared here878 1142 | ObjectNameResolver* global_object_name_resolver = nullptr;879 | ^~~~~~~~~~~~~~~~~~~~~~~~~~~880[155/1875] CXX obj/src/node_base.builtin_info.o881[156/1875] ACTION run_torque: run_torque_action_cea83c9e621e0e182fdfeec0429b2fb789657831bb31bd721b9a7d823e9ef3a8882[157/1875] STAMP obj/tools/v8_gypfiles/run_torque.actions_rules_copies.stamp883[158/1875] STAMP obj/tools/v8_gypfiles/v8_internal_headers.compile_depends.stamp884[159/1875] ACTION postmortem-metadata: gen-postmortem-metadata_63ceec4fe112e619d2413cab4d13e9ecf973439b0b10d648a5f5842216527688885[160/1875] STAMP obj/tools/v8_gypfiles/v8_internal_headers.actions_depends.stamp886[161/1875] STAMP obj/tools/v8_gypfiles/torque_generated_definitions.compile_depends.stamp887[162/1875] STAMP obj/tools/v8_gypfiles/torque_generated_definitions.actions_depends.stamp888[163/1875] STAMP obj/tools/v8_gypfiles/v8_base_without_compiler.compile_depends.stamp889[164/1875] STAMP obj/tools/v8_gypfiles/v8_base_without_compiler.actions_depends.stamp890[165/1875] CXX obj/gen/node_base.node_javascript.o891In file included from ../../src/memory_tracker.h:6,892 from ../../src/aliased_buffer.h:7,893 from ../../src/aliased_buffer-inl.h:6,894 from ../../src/env-inl.h:27,895 from gen/node_javascript.cc:2:896../../deps/v8/include/v8-profiler.h: In constructor 'v8::HeapProfiler::HeapSnapshotOptions::HeapSnapshotOptions()':897../../deps/v8/include/v8-profiler.h:1128:27: warning: 'v8::HeapProfiler::HeapSnapshotOptions::global_object_name_resolver' is deprecated: Use context_name_resolver callback instead. [-Wdeprecated-declarations]898 1128 | HeapSnapshotOptions() {}899 | ^900../../deps/v8/include/v8-profiler.h:1142:25: note: declared here901 1142 | ObjectNameResolver* global_object_name_resolver = nullptr;902 | ^~~~~~~~~~~~~~~~~~~~~~~~~~~903../../deps/v8/include/v8-profiler.h:1128:27: warning: 'v8::HeapProfiler::HeapSnapshotOptions::global_object_name_resolver' is deprecated: Use context_name_resolver callback instead. [-Wdeprecated-declarations]904 1128 | HeapSnapshotOptions() {}905 | ^906../../deps/v8/include/v8-profiler.h:1142:25: note: declared here907 1142 | ObjectNameResolver* global_object_name_resolver = nullptr;908 | ^~~~~~~~~~~~~~~~~~~~~~~~~~~909[166/1875] CXX obj/src/node_base.cleanup_queue.o910In file included from ../../src/memory_tracker.h:6,911 from ../../src/cleanup_queue.h:11,912 from ../../src/cleanup_queue.cc:1:913../../deps/v8/include/v8-profiler.h: In constructor 'v8::HeapProfiler::HeapSnapshotOptions::HeapSnapshotOptions()':914../../deps/v8/include/v8-profiler.h:1128:27: warning: 'v8::HeapProfiler::HeapSnapshotOptions::global_object_name_resolver' is deprecated: Use context_name_resolver callback instead. [-Wdeprecated-declarations]915 1128 | HeapSnapshotOptions() {}916 | ^917../../deps/v8/include/v8-profiler.h:1142:25: note: declared here918 1142 | ObjectNameResolver* global_object_name_resolver = nullptr;919 | ^~~~~~~~~~~~~~~~~~~~~~~~~~~920../../deps/v8/include/v8-profiler.h:1128:27: warning: 'v8::HeapProfiler::HeapSnapshotOptions::global_object_name_resolver' is deprecated: Use context_name_resolver callback instead. [-Wdeprecated-declarations]921 1128 | HeapSnapshotOptions() {}922 | ^923../../deps/v8/include/v8-profiler.h:1142:25: note: declared here924 1142 | ObjectNameResolver* global_object_name_resolver = nullptr;925 | ^~~~~~~~~~~~~~~~~~~~~~~~~~~926[167/1875] CXX obj/src/api/node_base.hooks.o927In file included from ../../src/memory_tracker.h:6,928 from ../../src/aliased_buffer.h:7,929 from ../../src/aliased_buffer-inl.h:6,930 from ../../src/env-inl.h:27,931 from ../../src/api/hooks.cc:1:932../../deps/v8/include/v8-profiler.h: In constructor 'v8::HeapProfiler::HeapSnapshotOptions::HeapSnapshotOptions()':933../../deps/v8/include/v8-profiler.h:1128:27: warning: 'v8::HeapProfiler::HeapSnapshotOptions::global_object_name_resolver' is deprecated: Use context_name_resolver callback instead. [-Wdeprecated-declarations]934 1128 | HeapSnapshotOptions() {}935 | ^936../../deps/v8/include/v8-profiler.h:1142:25: note: declared here937 1142 | ObjectNameResolver* global_object_name_resolver = nullptr;938 | ^~~~~~~~~~~~~~~~~~~~~~~~~~~939../../deps/v8/include/v8-profiler.h:1128:27: warning: 'v8::HeapProfiler::HeapSnapshotOptions::global_object_name_resolver' is deprecated: Use context_name_resolver callback instead. [-Wdeprecated-declarations]940 1128 | HeapSnapshotOptions() {}941 | ^942../../deps/v8/include/v8-profiler.h:1142:25: note: declared here943 1142 | ObjectNameResolver* global_object_name_resolver = nullptr;944 | ^~~~~~~~~~~~~~~~~~~~~~~~~~~945[168/1875] CXX obj/src/node_base.async_context_frame.o946In file included from ../../src/memory_tracker.h:6,947 from ../../src/base_object.h:29,948 from ../../src/async_context_frame.h:6,949 from ../../src/async_context_frame.cc:1:950../../deps/v8/include/v8-profiler.h: In constructor 'v8::HeapProfiler::HeapSnapshotOptions::HeapSnapshotOptions()':951../../deps/v8/include/v8-profiler.h:1128:27: warning: 'v8::HeapProfiler::HeapSnapshotOptions::global_object_name_resolver' is deprecated: Use context_name_resolver callback instead. [-Wdeprecated-declarations]952 1128 | HeapSnapshotOptions() {}953 | ^954../../deps/v8/include/v8-profiler.h:1142:25: note: declared here955 1142 | ObjectNameResolver* global_object_name_resolver = nullptr;956 | ^~~~~~~~~~~~~~~~~~~~~~~~~~~957../../deps/v8/include/v8-profiler.h:1128:27: warning: 'v8::HeapProfiler::HeapSnapshotOptions::global_object_name_resolver' is deprecated: Use context_name_resolver callback instead. [-Wdeprecated-declarations]958 1128 | HeapSnapshotOptions() {}959 | ^960../../deps/v8/include/v8-profiler.h:1142:25: note: declared here961 1142 | ObjectNameResolver* global_object_name_resolver = nullptr;962 | ^~~~~~~~~~~~~~~~~~~~~~~~~~~963[169/1875] CXX obj/src/node_base.async_wrap.o964In file included from ../../src/memory_tracker.h:6,965 from ../../src/base_object.h:29,966 from ../../src/async_wrap.h:27,967 from ../../src/async_wrap.cc:22:968../../deps/v8/include/v8-profiler.h: In constructor 'v8::HeapProfiler::HeapSnapshotOptions::HeapSnapshotOptions()':969../../deps/v8/include/v8-profiler.h:1128:27: warning: 'v8::HeapProfiler::HeapSnapshotOptions::global_object_name_resolver' is deprecated: Use context_name_resolver callback instead. [-Wdeprecated-declarations]970 1128 | HeapSnapshotOptions() {}971 | ^972../../deps/v8/include/v8-profiler.h:1142:25: note: declared here973 1142 | ObjectNameResolver* global_object_name_resolver = nullptr;974 | ^~~~~~~~~~~~~~~~~~~~~~~~~~~975../../deps/v8/include/v8-profiler.h:1128:27: warning: 'v8::HeapProfiler::HeapSnapshotOptions::global_object_name_resolver' is deprecated: Use context_name_resolver callback instead. [-Wdeprecated-declarations]976 1128 | HeapSnapshotOptions() {}977 | ^978../../deps/v8/include/v8-profiler.h:1142:25: note: declared here979 1142 | ObjectNameResolver* global_object_name_resolver = nullptr;980 | ^~~~~~~~~~~~~~~~~~~~~~~~~~~981[170/1875] CXX obj/src/node_base.base_object.o982In file included from ../../src/memory_tracker.h:6,983 from ../../src/base_object.h:29,984 from ../../src/base_object.cc:1:985../../deps/v8/include/v8-profiler.h: In constructor 'v8::HeapProfiler::HeapSnapshotOptions::HeapSnapshotOptions()':986../../deps/v8/include/v8-profiler.h:1128:27: warning: 'v8::HeapProfiler::HeapSnapshotOptions::global_object_name_resolver' is deprecated: Use context_name_resolver callback instead. [-Wdeprecated-declarations]987 1128 | HeapSnapshotOptions() {}988 | ^989../../deps/v8/include/v8-profiler.h:1142:25: note: declared here990 1142 | ObjectNameResolver* global_object_name_resolver = nullptr;991 | ^~~~~~~~~~~~~~~~~~~~~~~~~~~992../../deps/v8/include/v8-profiler.h:1128:27: warning: 'v8::HeapProfiler::HeapSnapshotOptions::global_object_name_resolver' is deprecated: Use context_name_resolver callback instead. [-Wdeprecated-declarations]993 1128 | HeapSnapshotOptions() {}994 | ^995../../deps/v8/include/v8-profiler.h:1142:25: note: declared here996 1142 | ObjectNameResolver* global_object_name_resolver = nullptr;997 | ^~~~~~~~~~~~~~~~~~~~~~~~~~~998[171/1875] CXX obj/deps/v8/src/ast/v8_base_without_compiler.ast-function-literal-id-reindexer.o999[172/1875] CXX obj/src/node_base.cares_wrap.o1000In file included from ../../src/memory_tracker.h:6,1001 from ../../src/base_object.h:29,1002 from ../../src/async_wrap.h:27,1003 from ../../src/cares_wrap.h:8,1004 from ../../src/cares_wrap.cc:22:1005../../deps/v8/include/v8-profiler.h: In constructor 'v8::HeapProfiler::HeapSnapshotOptions::HeapSnapshotOptions()':1006../../deps/v8/include/v8-profiler.h:1128:27: warning: 'v8::HeapProfiler::HeapSnapshotOptions::global_object_name_resolver' is deprecated: Use context_name_resolver callback instead. [-Wdeprecated-declarations]1007 1128 | HeapSnapshotOptions() {}1008 | ^1009../../deps/v8/include/v8-profiler.h:1142:25: note: declared here1010 1142 | ObjectNameResolver* global_object_name_resolver = nullptr;1011 | ^~~~~~~~~~~~~~~~~~~~~~~~~~~1012../../deps/v8/include/v8-profiler.h:1128:27: warning: 'v8::HeapProfiler::HeapSnapshotOptions::global_object_name_resolver' is deprecated: Use context_name_resolver callback instead. [-Wdeprecated-declarations]1013 1128 | HeapSnapshotOptions() {}1014 | ^1015../../deps/v8/include/v8-profiler.h:1142:25: note: declared here1016 1142 | ObjectNameResolver* global_object_name_resolver = nullptr;1017 | ^~~~~~~~~~~~~~~~~~~~~~~~~~~1018../../src/cares_wrap.cc: In function 'v8::Maybe<int> node::cares_wrap::{anonymous}::ParseGeneralReply(node::Environment*, const unsigned char*, int, int*, v8::Local<v8::Array>, void*, int*)':1019../../src/cares_wrap.cc:244:34: warning: 'int ares_parse_a_reply(const unsigned char*, int, hostent**, ares_addrttl*, int*)' is deprecated: Use ares_dns_parse instead [-Wdeprecated-declarations]1020 244 | status = ares_parse_a_reply(buf,1021 | ~~~~~~~~~~~~~~~~~~^~~~~1022 245 | len,1023 | ~~~~1024 246 | &host,1025 | ~~~~~~1026 247 | static_cast<ares_addrttl*>(addrttls),1027 | ~~~~~~~~~~~~~~~~~~~~~~~~~~~~~~~~~~~~~1028 248 | naddrttls);1029 | ~~~~~~~~~~1030In file included from ../../src/cares_wrap.h:17:1031/nix/store/s834lvsxrjlg33f839fg2all3h545c81-c-ares-1.34.8-dev/include/ares.h:1106:55: note: declared here1032 1106 | CARES_EXTERN CARES_DEPRECATED_FOR(ares_dns_parse) int ares_parse_a_reply(1033 | ^~~~~~~~~~~~~~~~~~1034../../src/cares_wrap.cc:251:37: warning: 'int ares_parse_aaaa_reply(const unsigned char*, int, hostent**, ares_addr6ttl*, int*)' is deprecated: Use ares_dns_parse instead [-Wdeprecated-declarations]1035 251 | status = ares_parse_aaaa_reply(buf,1036 | ~~~~~~~~~~~~~~~~~~~~~^~~~~1037 252 | len,1038 | ~~~~1039 253 | &host,1040 | ~~~~~~1041 254 | static_cast<ares_addr6ttl*>(addrttls),1042 | ~~~~~~~~~~~~~~~~~~~~~~~~~~~~~~~~~~~~~~1043 255 | naddrttls);1044 | ~~~~~~~~~~1045/nix/store/s834lvsxrjlg33f839fg2all3h545c81-c-ares-1.34.8-dev/include/ares.h:1110:55: note: declared here1046 1110 | CARES_EXTERN CARES_DEPRECATED_FOR(ares_dns_parse) int ares_parse_aaaa_reply(1047 | ^~~~~~~~~~~~~~~~~~~~~1048../../src/cares_wrap.cc:258:35: warning: 'int ares_parse_ns_reply(const unsigned char*, int, hostent**)' is deprecated: Use ares_dns_parse instead [-Wdeprecated-declarations]1049 258 | status = ares_parse_ns_reply(buf, len, &host);1050 | ~~~~~~~~~~~~~~~~~~~^~~~~~~~~~~~~~~~~1051/nix/store/s834lvsxrjlg33f839fg2all3h545c81-c-ares-1.34.8-dev/include/ares.h:1121:55: note: declared here1052 1121 | CARES_EXTERN CARES_DEPRECATED_FOR(ares_dns_parse) int ares_parse_ns_reply(1053 | ^~~~~~~~~~~~~~~~~~~1054../../src/cares_wrap.cc:261:36: warning: 'int ares_parse_ptr_reply(const unsigned char*, int, const void*, int, int, hostent**)' is deprecated: Use ares_dns_parse instead [-Wdeprecated-declarations]1055 261 | status = ares_parse_ptr_reply(buf, len, nullptr, 0, AF_INET, &host);1056 | ~~~~~~~~~~~~~~~~~~~~^~~~~~~~~~~~~~~~~~~~~~~~~~~~~~~~~~~~~~1057/nix/store/s834lvsxrjlg33f839fg2all3h545c81-c-ares-1.34.8-dev/include/ares.h:1117:55: note: declared here1058 1117 | CARES_EXTERN CARES_DEPRECATED_FOR(ares_dns_parse) int ares_parse_ptr_reply(1059 | ^~~~~~~~~~~~~~~~~~~~1060../../src/cares_wrap.cc: In function 'v8::Maybe<int> node::cares_wrap::{anonymous}::ParseMxReply(node::Environment*, const unsigned char*, int, v8::Local<v8::Array>, bool)':1061../../src/cares_wrap.cc:337:35: warning: 'int ares_parse_mx_reply(const unsigned char*, int, ares_mx_reply**)' is deprecated: Use ares_dns_parse instead [-Wdeprecated-declarations]1062 337 | int status = ares_parse_mx_reply(buf, len, &mx_start);1063 | ~~~~~~~~~~~~~~~~~~~^~~~~~~~~~~~~~~~~~~~~1064/nix/store/s834lvsxrjlg33f839fg2all3h545c81-c-ares-1.34.8-dev/include/ares.h:1127:55: note: declared here1065 1127 | CARES_EXTERN CARES_DEPRECATED_FOR(ares_dns_parse) int ares_parse_mx_reply(1066 | ^~~~~~~~~~~~~~~~~~~1067../../src/cares_wrap.cc: In function 'v8::Maybe<int> node::cares_wrap::{anonymous}::ParseCaaReply(node::Environment*, const unsigned char*, int, v8::Local<v8::Array>, bool)':1068../../src/cares_wrap.cc:383:36: warning: 'int ares_parse_caa_reply(const unsigned char*, int, ares_caa_reply**)' is deprecated: Use ares_dns_parse instead [-Wdeprecated-declarations]1069 383 | int status = ares_parse_caa_reply(buf, len, &caa_start);1070 | ~~~~~~~~~~~~~~~~~~~~^~~~~~~~~~~~~~~~~~~~~~1071/nix/store/s834lvsxrjlg33f839fg2all3h545c81-c-ares-1.34.8-dev/include/ares.h:1114:55: note: declared here1072 1114 | CARES_EXTERN CARES_DEPRECATED_FOR(ares_dns_parse) int ares_parse_caa_reply(1073 | ^~~~~~~~~~~~~~~~~~~~1074../../src/cares_wrap.cc: In function 'v8::Maybe<int> node::cares_wrap::{anonymous}::ParseTxtReply(node::Environment*, const unsigned char*, int, v8::Local<v8::Array>, bool)':1075../../src/cares_wrap.cc:511:40: warning: 'int ares_parse_txt_reply_ext(const unsigned char*, int, ares_txt_ext**)' is deprecated: Use ares_dns_parse instead [-Wdeprecated-declarations]1076 511 | int status = ares_parse_txt_reply_ext(buf, len, &txt_out);1077 | ~~~~~~~~~~~~~~~~~~~~~~~~^~~~~~~~~~~~~~~~~~~~1078/nix/store/s834lvsxrjlg33f839fg2all3h545c81-c-ares-1.34.8-dev/include/ares.h:1133:55: note: declared here1079 1133 | CARES_EXTERN CARES_DEPRECATED_FOR(ares_dns_parse) int ares_parse_txt_reply_ext(1080 | ^~~~~~~~~~~~~~~~~~~~~~~~1081../../src/cares_wrap.cc: In function 'v8::Maybe<int> node::cares_wrap::{anonymous}::ParseSrvReply(node::Environment*, const unsigned char*, int, v8::Local<v8::Array>, bool)':1082../../src/cares_wrap.cc:598:36: warning: 'int ares_parse_srv_reply(const unsigned char*, int, ares_srv_reply**)' is deprecated: Use ares_dns_parse instead [-Wdeprecated-declarations]1083 598 | int status = ares_parse_srv_reply(buf, len, &srv_start);1084 | ~~~~~~~~~~~~~~~~~~~~^~~~~~~~~~~~~~~~~~~~~~1085/nix/store/s834lvsxrjlg33f839fg2all3h545c81-c-ares-1.34.8-dev/include/ares.h:1124:55: note: declared here1086 1124 | CARES_EXTERN CARES_DEPRECATED_FOR(ares_dns_parse) int ares_parse_srv_reply(1087 | ^~~~~~~~~~~~~~~~~~~~1088../../src/cares_wrap.cc: In function 'v8::Maybe<int> node::cares_wrap::{anonymous}::ParseNaptrReply(node::Environment*, const unsigned char*, int, v8::Local<v8::Array>, bool)':1089../../src/cares_wrap.cc:653:38: warning: 'int ares_parse_naptr_reply(const unsigned char*, int, ares_naptr_reply**)' is deprecated: Use ares_dns_parse instead [-Wdeprecated-declarations]1090 653 | int status = ares_parse_naptr_reply(buf, len, &naptr_start);1091 | ~~~~~~~~~~~~~~~~~~~~~~^~~~~~~~~~~~~~~~~~~~~~~~1092/nix/store/s834lvsxrjlg33f839fg2all3h545c81-c-ares-1.34.8-dev/include/ares.h:1136:55: note: declared here1093 1136 | CARES_EXTERN CARES_DEPRECATED_FOR(ares_dns_parse) int ares_parse_naptr_reply(1094 | ^~~~~~~~~~~~~~~~~~~~~~1095../../src/cares_wrap.cc: In member function 'void node::cares_wrap::ChannelWrap::EnsureServers()':1096../../src/cares_wrap.cc:1000:25: warning: 'int ares_get_servers_ports(const ares_channel_t*, ares_addr_port_node**)' is deprecated: Use ares_get_servers_csv instead [-Wdeprecated-declarations]1097 1000 | ares_get_servers_ports(channel_, &servers);1098 | ~~~~~~~~~~~~~~~~~~~~~~^~~~~~~~~~~~~~~~~~~~1099/nix/store/s834lvsxrjlg33f839fg2all3h545c81-c-ares-1.34.8-dev/include/ares.h:1196:28: note: declared here1100 1196 | int ares_get_servers_ports(const ares_channel_t *channel,1101 | ^~~~~~~~~~~~~~~~~~~~~~1102../../src/cares_wrap.cc: In static member function 'static v8::Maybe<int> node::cares_wrap::SoaTraits::Parse(node::cares_wrap::QuerySoaWrap*, const std::unique_ptr<node::cares_wrap::ResponseData>&)':1103../../src/cares_wrap.cc:1711:36: warning: 'int ares_parse_soa_reply(const unsigned char*, int, ares_soa_reply**)' is deprecated: Use ares_dns_parse instead [-Wdeprecated-declarations]1104 1711 | int status = ares_parse_soa_reply(buf, len, &soa_out);1105 | ~~~~~~~~~~~~~~~~~~~~^~~~~~~~~~~~~~~~~~~~1106/nix/store/s834lvsxrjlg33f839fg2all3h545c81-c-ares-1.34.8-dev/include/ares.h:1139:55: note: declared here1107 1139 | CARES_EXTERN CARES_DEPRECATED_FOR(ares_dns_parse) int ares_parse_soa_reply(1108 | ^~~~~~~~~~~~~~~~~~~~1109../../src/cares_wrap.cc: In function 'void node::cares_wrap::{anonymous}::GetServers(const v8::FunctionCallbackInfo<v8::Value>&)':1110../../src/cares_wrap.cc:2092:33: warning: 'int ares_get_servers_ports(const ares_channel_t*, ares_addr_port_node**)' is deprecated: Use ares_get_servers_csv instead [-Wdeprecated-declarations]1111 2092 | int r = ares_get_servers_ports(channel->cares_channel(), &servers);1112 | ~~~~~~~~~~~~~~~~~~~~~~^~~~~~~~~~~~~~~~~~~~~~~~~~~~~~~~~~~~1113/nix/store/s834lvsxrjlg33f839fg2all3h545c81-c-ares-1.34.8-dev/include/ares.h:1196:28: note: declared here1114 1196 | int ares_get_servers_ports(const ares_channel_t *channel,1115 | ^~~~~~~~~~~~~~~~~~~~~~1116../../src/cares_wrap.cc: In function 'void node::cares_wrap::{anonymous}::SetServers(const v8::FunctionCallbackInfo<v8::Value>&)':1117../../src/cares_wrap.cc:2137:30: warning: 'int ares_set_servers(ares_channel_t*, const ares_addr_node*)' is deprecated: Use ares_set_servers_csv instead [-Wdeprecated-declarations]1118 2137 | int rv = ares_set_servers(channel->cares_channel(), nullptr);1119 | ~~~~~~~~~~~~~~~~^~~~~~~~~~~~~~~~~~~~~~~~~~~~~~~~~~~1120/nix/store/s834lvsxrjlg33f839fg2all3h545c81-c-ares-1.34.8-dev/include/ares.h:1176:61: note: declared here1121 1176 | CARES_EXTERN CARES_DEPRECATED_FOR(ares_set_servers_csv) int ares_set_servers(1122 | ^~~~~~~~~~~~~~~~1123../../src/cares_wrap.cc:2197:33: warning: 'int ares_set_servers_ports(ares_channel_t*, const ares_addr_port_node*)' is deprecated: Use ares_set_servers_ports_csv instead [-Wdeprecated-declarations]1124 2197 | err = ares_set_servers_ports(channel->cares_channel(), servers.data());1125 | ~~~~~~~~~~~~~~~~~~~~~~^~~~~~~~~~~~~~~~~~~~~~~~~~~~~~~~~~~~~~~~~~1126/nix/store/s834lvsxrjlg33f839fg2all3h545c81-c-ares-1.34.8-dev/include/ares.h:1181:20: note: declared here1127 1181 | int ares_set_servers_ports(ares_channel_t *channel,1128 | ^~~~~~~~~~~~~~~~~~~~~~1129[173/1875] CXX obj/deps/v8/src/api/v8_base_without_compiler.api-arguments.o1130[174/1875] CXX obj/deps/v8/src/api/v8_base_without_compiler.api-natives.o1131[175/1875] CXX obj/deps/v8/src/ast/v8_base_without_compiler.modules.o1132[176/1875] CXX obj/deps/v8/src/ast/v8_base_without_compiler.ast.o1133[177/1875] CXX obj/deps/v8/src/ast/v8_base_without_compiler.ast-value-factory.o1134[178/1875] CXX obj/deps/v8/src/ast/v8_base_without_compiler.source-range-ast-visitor.o1135[179/1875] CXX obj/deps/v8/src/ast/v8_base_without_compiler.variables.o1136[180/1875] CXX obj/deps/v8/src/ast/v8_base_without_compiler.prettyprinter.o1137[181/1875] CXX obj/deps/v8/src/ast/v8_base_without_compiler.scopes.o1138[182/1875] CXX obj/deps/v8/src/api/v8_base_without_compiler.api.o1139[183/1875] CXX obj/deps/v8/src/baseline/v8_base_without_compiler.bytecode-offset-iterator.o1140[184/1875] CXX obj/deps/v8/src/baseline/v8_base_without_compiler.baseline.o1141[185/1875] CXX obj/deps/v8/src/builtins/v8_base_without_compiler.accessors.o1142[186/1875] CXX obj/deps/v8/src/builtins/v8_base_without_compiler.builtins-abstract-module-source.o1143[187/1875] CXX obj/deps/v8/src/builtins/v8_base_without_compiler.builtins-api.o1144[188/1875] CXX obj/deps/v8/src/builtins/v8_base_without_compiler.builtins-array.o1145[189/1875] CXX obj/deps/v8/src/builtins/v8_base_without_compiler.builtins-arraybuffer.o1146[190/1875] CXX obj/deps/v8/src/builtins/v8_base_without_compiler.builtins-async-disposable-stack.o1147[191/1875] CXX obj/deps/v8/src/builtins/v8_base_without_compiler.builtins-async-module.o1148[192/1875] CXX obj/deps/v8/src/builtins/v8_base_without_compiler.builtins-atomics-synchronization.o1149[193/1875] CXX obj/deps/v8/src/builtins/v8_base_without_compiler.builtins-bigint.o1150[194/1875] CXX obj/deps/v8/src/builtins/v8_base_without_compiler.builtins-callsite.o1151[195/1875] CXX obj/deps/v8/src/builtins/v8_base_without_compiler.builtins-collections.o1152[196/1875] CXX obj/deps/v8/src/builtins/v8_base_without_compiler.builtins-console.o1153[197/1875] CXX obj/deps/v8/src/builtins/v8_base_without_compiler.builtins-effects-analyzer.o1154[198/1875] CXX obj/deps/v8/src/builtins/v8_base_without_compiler.builtins-dataview.o1155[199/1875] CXX obj/deps/v8/src/builtins/v8_base_without_compiler.builtins-date.o1156[200/1875] CXX obj/deps/v8/src/builtins/v8_base_without_compiler.builtins-disposable-stack.o1157[201/1875] CXX obj/deps/v8/src/builtins/v8_base_without_compiler.builtins-math-xsum.o1158[202/1875] CXX obj/deps/v8/src/builtins/v8_base_without_compiler.builtins-error.o1159[203/1875] CXX obj/deps/v8/src/builtins/v8_base_without_compiler.builtins-global.o1160[204/1875] CXX obj/deps/v8/src/builtins/v8_base_without_compiler.builtins-function.o1161[205/1875] CXX obj/deps/v8/src/builtins/v8_base_without_compiler.builtins-internal.o1162[206/1875] CXX obj/deps/v8/src/builtins/v8_base_without_compiler.builtins-json.o1163[207/1875] CXX obj/deps/v8/src/builtins/v8_base_without_compiler.builtins-intl.o1164[208/1875] CXX obj/deps/v8/src/builtins/v8_base_without_compiler.builtins-math.o1165[209/1875] CXX obj/deps/v8/src/builtins/v8_base_without_compiler.builtins-number.o1166[210/1875] CXX obj/deps/v8/src/builtins/v8_base_without_compiler.builtins-object.o1167[211/1875] CXX obj/deps/v8/src/builtins/v8_base_without_compiler.builtins-reflect.o1168[212/1875] CXX obj/deps/v8/src/builtins/v8_base_without_compiler.builtins-regexp.o1169[213/1875] CXX obj/deps/v8/src/builtins/v8_base_without_compiler.builtins-shadow-realm.o1170[214/1875] CXX obj/deps/v8/src/builtins/v8_base_without_compiler.builtins-shared-array.o1171[215/1875] CXX obj/deps/v8/src/builtins/v8_base_without_compiler.builtins-sharedarraybuffer.o1172[216/1875] CXX obj/deps/v8/src/builtins/v8_base_without_compiler.builtins-string.o1173[217/1875] CXX obj/deps/v8/src/builtins/v8_base_without_compiler.builtins-symbol.o1174[218/1875] CXX obj/deps/v8/src/codegen/v8_base_without_compiler.aligned-slot-allocator.o1175[219/1875] CXX obj/deps/v8/src/builtins/v8_base_without_compiler.builtins-struct.o1176[220/1875] CXX obj/deps/v8/src/codegen/v8_base_without_compiler.bailout-reason.o1177[221/1875] CXX obj/deps/v8/src/builtins/v8_base_without_compiler.builtins-trace.o1178[222/1875] CXX obj/deps/v8/src/builtins/v8_base_without_compiler.builtins-typed-array.o1179[223/1875] CXX obj/deps/v8/src/builtins/v8_base_without_compiler.builtins-weak-refs.o1180[224/1875] CXX obj/deps/v8/src/builtins/v8_base_without_compiler.constants-table-builder.o1181[225/1875] CXX obj/deps/v8/src/builtins/v8_base_without_compiler.builtins.o1182[226/1875] CXX obj/deps/v8/src/codegen/v8_base_without_compiler.code-comments.o1183[227/1875] CXX obj/deps/v8/src/codegen/v8_base_without_compiler.assembler.o1184[228/1875] CXX obj/deps/v8/src/codegen/v8_base_without_compiler.code-desc.o1185[229/1875] CXX obj/deps/v8/src/codegen/v8_base_without_compiler.code-factory.o1186[230/1875] CXX obj/deps/v8/src/codegen/v8_base_without_compiler.external-reference-encoder.o1187[231/1875] CXX obj/deps/v8/src/codegen/v8_base_without_compiler.code-reference.o1188[232/1875] CXX obj/deps/v8/src/codegen/v8_base_without_compiler.compilation-cache.o1189[233/1875] CXX obj/deps/v8/src/codegen/v8_base_without_compiler.external-reference-table.o1190[234/1875] CXX obj/deps/v8/src/codegen/v8_base_without_compiler.flush-instruction-cache.o1191[235/1875] CXX obj/deps/v8/src/codegen/v8_base_without_compiler.machine-type.o1192[236/1875] CXX obj/deps/v8/src/codegen/v8_base_without_compiler.handler-table.o1193[237/1875] CXX obj/deps/v8/src/codegen/v8_base_without_compiler.compiler.o1194[238/1875] CXX obj/deps/v8/src/codegen/v8_base_without_compiler.external-reference.o1195In file included from ../../deps/v8/src/regexp/arm64/regexp-macro-assembler-arm64.h:10,1196 from ../../deps/v8/src/regexp/regexp-macro-assembler-arch.h:17,1197 from ../../deps/v8/src/codegen/external-reference.cc:43:1198../../deps/v8/src/codegen/arm64/assembler-arm64.h:95:10: warning: inline function 'v8::internal::Operand::Operand(T) [with T = int]' used but never defined1199 95 | inline Operand(T t); // NOLINT(runtime/explicit)1200 | ^~~~~~~1201[239/1875] CXX obj/deps/v8/src/codegen/v8_base_without_compiler.jump-table-info.o1202[240/1875] CXX obj/deps/v8/src/codegen/v8_base_without_compiler.register-configuration.o1203[241/1875] CXX obj/deps/v8/src/codegen/v8_base_without_compiler.interface-descriptors.o1204[242/1875] CXX obj/deps/v8/src/codegen/v8_base_without_compiler.macro-assembler-base.o1205[243/1875] CXX obj/deps/v8/src/codegen/v8_base_without_compiler.maglev-safepoint-table.o1206[244/1875] CXX obj/deps/v8/src/codegen/v8_base_without_compiler.optimized-compilation-info.o1207[245/1875] CXX obj/deps/v8/src/codegen/v8_base_without_compiler.tnode.o1208[246/1875] CXX obj/deps/v8/src/codegen/v8_base_without_compiler.tick-counter.o1209[247/1875] CXX obj/deps/v8/src/codegen/v8_base_without_compiler.pending-optimization-table.o1210[248/1875] CXX obj/deps/v8/src/codegen/v8_base_without_compiler.safepoint-table.o1211[249/1875] CXX obj/deps/v8/src/codegen/v8_base_without_compiler.reloc-info.o1212[250/1875] CXX obj/deps/v8/src/codegen/v8_base_without_compiler.source-position-table.o1213[251/1875] CXX obj/deps/v8/src/codegen/v8_base_without_compiler.source-position.o1214[252/1875] CXX obj/deps/v8/src/codegen/v8_base_without_compiler.unoptimized-compilation-info.o1215[253/1875] CXX obj/deps/v8/src/common/v8_base_without_compiler.assert-scope.o1216[254/1875] CXX obj/deps/v8/src/common/v8_base_without_compiler.ptr-compr.o1217[255/1875] CXX obj/deps/v8/src/common/v8_base_without_compiler.code-memory-access.o1218[256/1875] CXX obj/deps/v8/src/compiler-dispatcher/v8_base_without_compiler.lazy-compile-dispatcher.o1219[257/1875] CXX obj/deps/v8/src/compiler-dispatcher/v8_base_without_compiler.optimizing-compile-dispatcher.o1220[258/1875] CXX obj/deps/v8/src/compiler/v8_base_without_compiler.linkage.o1221[259/1875] CXX obj/deps/v8/src/date/v8_base_without_compiler.date.o1222[260/1875] CXX obj/deps/v8/src/date/v8_base_without_compiler.dateparser.o1223[261/1875] CXX obj/deps/v8/src/debug/v8_base_without_compiler.debug-evaluate.o1224[262/1875] CXX obj/deps/v8/src/debug/v8_base_without_compiler.debug-coverage.o1225[263/1875] CXX obj/deps/v8/src/debug/v8_base_without_compiler.liveedit-diff.o1226[264/1875] CXX obj/deps/v8/src/debug/v8_base_without_compiler.debug-frames.o1227[265/1875] CXX obj/deps/v8/src/deoptimizer/v8_base_without_compiler.deoptimize-reason.o1228[266/1875] CXX obj/deps/v8/src/debug/v8_base_without_compiler.debug-property-iterator.o1229[267/1875] CXX obj/deps/v8/src/debug/v8_base_without_compiler.debug-stack-trace-iterator.o1230[268/1875] CXX obj/deps/v8/src/debug/v8_base_without_compiler.debug-interface.o1231[269/1875] CXX obj/deps/v8/src/debug/v8_base_without_compiler.debug-scope-iterator.o1232[270/1875] CXX obj/deps/v8/src/debug/v8_base_without_compiler.debug-scopes.o1233[271/1875] CXX obj/deps/v8/src/deoptimizer/v8_base_without_compiler.deoptimized-frame-info.o1234[272/1875] CXX obj/deps/v8/src/diagnostics/v8_base_without_compiler.compilation-statistics.o1235[273/1875] CXX obj/deps/v8/src/debug/v8_base_without_compiler.liveedit.o1236[274/1875] CXX obj/deps/v8/src/debug/v8_base_without_compiler.debug.o1237[275/1875] CXX obj/deps/v8/src/diagnostics/v8_base_without_compiler.eh-frame.o1238[276/1875] CXX obj/deps/v8/src/deoptimizer/v8_base_without_compiler.materialized-object-store.o1239[277/1875] CXX obj/deps/v8/src/diagnostics/v8_base_without_compiler.basic-block-profiler.o1240[278/1875] CXX obj/deps/v8/src/deoptimizer/v8_base_without_compiler.deoptimizer.o1241[279/1875] CXX obj/deps/v8/src/deoptimizer/v8_base_without_compiler.translated-state.o1242[280/1875] CXX obj/deps/v8/src/deoptimizer/v8_base_without_compiler.frame-translation-builder.o1243[281/1875] CXX obj/deps/v8/src/diagnostics/v8_base_without_compiler.unwinder.o1244[282/1875] CXX obj/deps/v8/src/execution/v8_base_without_compiler.clobber-registers.o1245[283/1875] CXX obj/deps/v8/src/execution/v8_base_without_compiler.encoded-c-signature.o1246[284/1875] CXX obj/deps/v8/src/diagnostics/v8_base_without_compiler.disassembler.o1247[285/1875] CXX obj/deps/v8/src/diagnostics/v8_base_without_compiler.gdb-jit.o1248[286/1875] CXX obj/deps/v8/src/execution/v8_base_without_compiler.arguments.o1249[287/1875] CXX obj/deps/v8/src/diagnostics/v8_base_without_compiler.objects-debug.o1250[288/1875] CXX obj/deps/v8/src/diagnostics/v8_base_without_compiler.perf-jit.o1251[289/1875] CXX obj/deps/v8/src/execution/v8_base_without_compiler.embedder-state.o1252[290/1875] CXX obj/deps/v8/src/execution/v8_base_without_compiler.interrupts-scope.o1253[291/1875] CXX obj/deps/v8/src/execution/v8_base_without_compiler.execution.o1254[292/1875] CXX obj/deps/v8/src/execution/v8_base_without_compiler.local-isolate.o1255[293/1875] CXX obj/deps/v8/src/execution/v8_base_without_compiler.futex-emulation.o1256[294/1875] CXX obj/deps/v8/src/execution/v8_base_without_compiler.frames.o1257[295/1875] CXX obj/deps/v8/src/execution/v8_base_without_compiler.thread-id.o1258[296/1875] CXX obj/deps/v8/src/diagnostics/v8_base_without_compiler.objects-printer.o1259[297/1875] CXX obj/deps/v8/src/execution/v8_base_without_compiler.simulator-base.o1260[298/1875] CXX obj/deps/v8/src/execution/v8_base_without_compiler.microtask-queue.o1261[299/1875] CXX obj/deps/v8/src/execution/v8_base_without_compiler.messages.o1262[300/1875] CXX obj/deps/v8/src/execution/v8_base_without_compiler.thread-local-top.o1263[301/1875] CXX obj/deps/v8/src/execution/v8_base_without_compiler.protectors.o1264[302/1875] CXX obj/deps/v8/src/execution/v8_base_without_compiler.isolate.o1265[303/1875] CXX obj/deps/v8/src/execution/v8_base_without_compiler.stack-guard.o1266[304/1875] CXX obj/deps/v8/src/extensions/v8_base_without_compiler.cputracemark-extension.o1267[305/1875] CXX obj/deps/v8/src/extensions/v8_base_without_compiler.trigger-failure-extension.o1268[306/1875] CXX obj/deps/v8/src/execution/v8_base_without_compiler.tiering-manager.o1269[307/1875] CXX obj/deps/v8/src/extensions/v8_base_without_compiler.gc-extension.o1270[308/1875] CXX obj/deps/v8/src/execution/v8_base_without_compiler.v8threads.o1271[309/1875] CXX obj/deps/v8/src/flags/v8_base_without_compiler.save-flags.o1272[310/1875] CXX obj/deps/v8/src/flags/v8_base_without_compiler.flags.o1273[311/1875] CXX obj/deps/v8/src/extensions/v8_base_without_compiler.externalize-string-extension.o1274[312/1875] CXX obj/deps/v8/src/extensions/v8_base_without_compiler.ignition-statistics-extension.o1275[313/1875] CXX obj/deps/v8/src/extensions/v8_base_without_compiler.statistics-extension.o1276[314/1875] CXX obj/deps/v8/src/heap/v8_base_without_compiler.allocation-observer.o1277[315/1875] CXX obj/deps/v8/src/handles/v8_base_without_compiler.handles.o1278[316/1875] CXX obj/deps/v8/src/handles/v8_base_without_compiler.global-handles.o1279[317/1875] CXX obj/deps/v8/src/handles/v8_base_without_compiler.local-handles.o1280[318/1875] CXX obj/deps/v8/src/handles/v8_base_without_compiler.persistent-handles.o1281[319/1875] CXX obj/deps/v8/src/handles/v8_base_without_compiler.shared-object-conveyor-handles.o1282[320/1875] CXX obj/deps/v8/src/handles/v8_base_without_compiler.traced-handles.o1283[321/1875] CXX obj/deps/v8/src/heap/v8_base_without_compiler.base-page.o1284[322/1875] CXX obj/deps/v8/src/heap/v8_base_without_compiler.array-buffer-sweeper.o1285[323/1875] CXX obj/deps/v8/src/heap/v8_base_without_compiler.code-range.o1286[324/1875] CXX obj/deps/v8/src/heap/v8_base_without_compiler.code-stats.o1287[325/1875] CXX obj/deps/v8/src/heap/v8_base_without_compiler.collection-barrier.o1288[326/1875] CXX obj/deps/v8/src/heap/v8_base_without_compiler.combined-heap.o1289[327/1875] CXX obj/deps/v8/src/heap/cppgc-js/v8_base_without_compiler.cpp-heap.o1290[328/1875] CXX obj/deps/v8/src/heap/cppgc-js/v8_base_without_compiler.cross-heap-remembered-set.o1291[329/1875] CXX obj/deps/v8/src/heap/cppgc-js/v8_base_without_compiler.unified-heap-marking-verifier.o1292[330/1875] CXX obj/deps/v8/src/heap/cppgc-js/v8_base_without_compiler.cpp-snapshot.o1293[331/1875] CXX obj/deps/v8/src/heap/cppgc-js/v8_base_without_compiler.unified-heap-marking-state.o1294[332/1875] CXX obj/deps/v8/src/heap/v8_base_without_compiler.concurrent-marking.o1295[333/1875] CXX obj/deps/v8/src/heap/v8_base_without_compiler.ephemeron-remembered-set.o1296[334/1875] CXX obj/deps/v8/src/heap/cppgc-js/v8_base_without_compiler.unified-heap-marking-visitor.o1297[335/1875] CXX obj/deps/v8/src/heap/v8_base_without_compiler.evacuation-allocator.o1298[336/1875] CXX obj/deps/v8/src/heap/v8_base_without_compiler.evacuation-verifier.o1299[337/1875] CXX obj/deps/v8/src/heap/v8_base_without_compiler.finalization-registry-cleanup-task.o1300[338/1875] CXX obj/deps/v8/src/heap/v8_base_without_compiler.free-list.o1301[339/1875] CXX obj/deps/v8/src/heap/v8_base_without_compiler.heap-verifier.o1302[340/1875] CXX obj/deps/v8/src/heap/v8_base_without_compiler.heap-controller.o1303[341/1875] CXX obj/deps/v8/src/heap/v8_base_without_compiler.gc-tracer.o1304[342/1875] CXX obj/deps/v8/src/heap/v8_base_without_compiler.heap-allocator.o1305[343/1875] CXX obj/deps/v8/src/heap/v8_base_without_compiler.factory-base.o1306[344/1875] CXX obj/deps/v8/src/heap/v8_base_without_compiler.heap-layout.o1307[345/1875] CXX obj/deps/v8/src/heap/v8_base_without_compiler.factory.o1308[346/1875] CXX obj/deps/v8/src/heap/v8_base_without_compiler.heap-visitor.o1309[347/1875] CXX obj/deps/v8/src/heap/v8_base_without_compiler.heap-layout-tracer.o1310[348/1875] CXX obj/deps/v8/src/heap/v8_base_without_compiler.index-generator.o1311[349/1875] CXX obj/deps/v8/src/heap/v8_base_without_compiler.heap-write-barrier.o1312[350/1875] CXX obj/deps/v8/src/heap/v8_base_without_compiler.incremental-marking-job.o1313[351/1875] CXX obj/deps/v8/src/heap/v8_base_without_compiler.large-page.o1314[352/1875] CXX obj/deps/v8/src/heap/v8_base_without_compiler.incremental-marking.o1315[353/1875] CXX obj/deps/v8/src/heap/v8_base_without_compiler.heap.o1316[354/1875] CXX obj/deps/v8/src/heap/v8_base_without_compiler.large-spaces.o1317[355/1875] CXX obj/deps/v8/src/heap/v8_base_without_compiler.local-factory.o1318[356/1875] CXX obj/deps/v8/src/heap/v8_base_without_compiler.local-heap.o1319[357/1875] CXX obj/deps/v8/src/heap/v8_base_without_compiler.main-allocator.o1320[358/1875] CXX obj/deps/v8/src/heap/v8_base_without_compiler.mark-sweep-utilities.o1321[359/1875] CXX obj/deps/v8/src/heap/v8_base_without_compiler.marking-worklist.o1322[360/1875] CXX obj/deps/v8/src/heap/v8_base_without_compiler.marking-barrier.o1323[361/1875] CXX obj/deps/v8/src/heap/v8_base_without_compiler.marking.o1324[362/1875] CXX obj/deps/v8/src/heap/v8_base_without_compiler.memory-balancer.o1325[363/1875] CXX obj/deps/v8/src/heap/v8_base_without_compiler.memory-allocator.o1326[364/1875] CXX obj/deps/v8/src/heap/v8_base_without_compiler.memory-chunk.o1327[365/1875] CXX obj/deps/v8/src/heap/v8_base_without_compiler.memory-measurement.o1328[366/1875] CXX obj/deps/v8/src/heap/v8_base_without_compiler.memory-reducer.o1329[367/1875] CXX obj/deps/v8/src/heap/v8_base_without_compiler.mark-compact.o1330[368/1875] CXX obj/deps/v8/src/heap/v8_base_without_compiler.memory-pool.o1331[369/1875] CXX obj/deps/v8/src/heap/v8_base_without_compiler.minor-gc-job.o1332[370/1875] CXX obj/deps/v8/src/heap/v8_base_without_compiler.mutable-page.o1333[371/1875] CXX obj/deps/v8/src/heap/v8_base_without_compiler.new-spaces.o1334[372/1875] CXX obj/deps/v8/src/heap/v8_base_without_compiler.normal-page.o1335[373/1875] CXX obj/deps/v8/src/heap/v8_base_without_compiler.minor-mark-sweep.o1336[374/1875] CXX obj/deps/v8/src/heap/v8_base_without_compiler.read-only-heap.o1337[375/1875] CXX obj/deps/v8/src/heap/v8_base_without_compiler.pretenuring-handler.o1338[376/1875] CXX obj/deps/v8/src/heap/v8_base_without_compiler.paged-spaces.o1339[377/1875] CXX obj/deps/v8/src/heap/v8_base_without_compiler.object-stats.o1340[378/1875] CXX obj/deps/v8/src/heap/v8_base_without_compiler.read-only-promotion.o1341[379/1875] CXX obj/deps/v8/src/heap/v8_base_without_compiler.read-only-spaces.o1342[380/1875] CXX obj/deps/v8/src/heap/v8_base_without_compiler.slot-set.o1343[381/1875] CXX obj/deps/v8/src/heap/v8_base_without_compiler.safepoint.o1344[382/1875] CXX obj/deps/v8/src/heap/v8_base_without_compiler.spaces.o1345[383/1875] CXX obj/deps/v8/src/heap/v8_base_without_compiler.stress-scavenge-observer.o1346[384/1875] CXX obj/deps/v8/src/heap/v8_base_without_compiler.traced-handles-marking-visitor.o1347[385/1875] CXX obj/deps/v8/src/heap/v8_base_without_compiler.scavenger.o1348[386/1875] CXX obj/deps/v8/src/heap/v8_base_without_compiler.sweeper.o1349[387/1875] CXX obj/deps/v8/src/heap/v8_base_without_compiler.trusted-range.o1350[388/1875] CXX obj/deps/v8/src/heap/v8_base_without_compiler.weak-object-worklists.o1351[389/1875] CXX obj/deps/v8/src/heap/v8_base_without_compiler.visit-object.o1352[390/1875] CXX obj/deps/v8/src/init/v8_base_without_compiler.icu_util.o1353[391/1875] CXX obj/deps/v8/src/heap/v8_base_without_compiler.zapping.o1354[392/1875] CXX obj/deps/v8/src/ic/v8_base_without_compiler.call-optimization.o1355[393/1875] CXX obj/deps/v8/src/init/v8_base_without_compiler.startup-data-util.o1356[394/1875] CXX obj/deps/v8/src/ic/v8_base_without_compiler.handler-configuration.o1357[395/1875] CXX obj/deps/v8/src/ic/v8_base_without_compiler.ic-stats.o1358[396/1875] CXX obj/deps/v8/src/ic/v8_base_without_compiler.stub-cache.o1359[397/1875] CXX obj/deps/v8/src/init/v8_base_without_compiler.isolate-group.o1360[398/1875] CXX obj/deps/v8/src/ic/v8_base_without_compiler.ic.o1361[399/1875] CXX obj/deps/v8/src/init/v8_base_without_compiler.v8.o1362[400/1875] CXX obj/deps/v8/src/interpreter/v8_base_without_compiler.bytecode-array-random-iterator.o1363[401/1875] CXX obj/deps/v8/src/interpreter/v8_base_without_compiler.bytecode-array-iterator.o1364[402/1875] CXX obj/deps/v8/src/interpreter/v8_base_without_compiler.bytecode-array-builder.o1365[403/1875] CXX obj/deps/v8/src/interpreter/v8_base_without_compiler.bytecode-array-writer.o1366[404/1875] CXX obj/deps/v8/src/interpreter/v8_base_without_compiler.bytecode-node.o1367[405/1875] CXX obj/deps/v8/src/interpreter/v8_base_without_compiler.bytecode-operands.o1368[406/1875] CXX obj/deps/v8/src/init/v8_base_without_compiler.bootstrapper.o1369[407/1875] CXX obj/deps/v8/src/interpreter/v8_base_without_compiler.bytecode-source-info.o1370[408/1875] CXX obj/deps/v8/src/interpreter/v8_base_without_compiler.bytecode-register.o1371[409/1875] CXX obj/deps/v8/src/interpreter/v8_base_without_compiler.bytecodes.o1372[410/1875] CXX obj/deps/v8/src/interpreter/v8_base_without_compiler.bytecode-decoder.o1373[411/1875] CXX obj/deps/v8/src/interpreter/v8_base_without_compiler.bytecode-flags-and-tokens.o1374[412/1875] CXX obj/deps/v8/src/interpreter/v8_base_without_compiler.interpreter-intrinsics.o1375[413/1875] CXX obj/deps/v8/src/interpreter/v8_base_without_compiler.bytecode-register-optimizer.o1376[414/1875] CXX obj/deps/v8/src/interpreter/v8_base_without_compiler.bytecode-label.o1377[415/1875] CXX obj/deps/v8/src/interpreter/v8_base_without_compiler.control-flow-builders.o1378[416/1875] CXX obj/deps/v8/src/interpreter/v8_base_without_compiler.handler-table-builder.o1379[417/1875] CXX obj/deps/v8/src/interpreter/v8_base_without_compiler.constant-array-builder.o1380[418/1875] CXX obj/deps/v8/src/interpreter/v8_base_without_compiler.bytecode-generator.o1381[419/1875] CXX obj/deps/v8/src/libsampler/v8_base_without_compiler.sampler.o1382[420/1875] CXX obj/deps/v8/src/interpreter/v8_base_without_compiler.interpreter.o1383[421/1875] CXX obj/deps/v8/src/logging/v8_base_without_compiler.metrics.o1384[422/1875] CXX obj/deps/v8/src/interpreter/v8_base_without_compiler.prototype-assignment-sequence-builder.o1385[423/1875] CXX obj/deps/v8/src/logging/v8_base_without_compiler.runtime-call-stats.o1386[424/1875] CXX obj/deps/v8/src/logging/v8_base_without_compiler.tracing-flags.o1387[425/1875] CXX obj/deps/v8/src/logging/v8_base_without_compiler.local-logger.o1388[426/1875] CXX obj/deps/v8/src/numbers/v8_base_without_compiler.ieee754.o1389[427/1875] CXX obj/deps/v8/src/logging/v8_base_without_compiler.log-file.o1390[428/1875] CXX obj/deps/v8/src/logging/v8_base_without_compiler.counters.o1391[429/1875] CXX obj/deps/v8/src/json/v8_base_without_compiler.json-parser.o1392[430/1875] CXX obj/deps/v8/src/json/v8_base_without_compiler.json-stringifier.o1393[431/1875] CXX obj/deps/v8/src/logging/v8_base_without_compiler.log.o1394[432/1875] CXX obj/deps/v8/src/numbers/v8_base_without_compiler.hash-seed.o1395[433/1875] CXX obj/deps/v8/src/numbers/v8_base_without_compiler.math-random.o1396[434/1875] CXX obj/deps/v8/src/objects/v8_base_without_compiler.code-kind.o1397[435/1875] CXX obj/deps/v8/src/numbers/v8_base_without_compiler.conversions.o1398[436/1875] CXX obj/deps/v8/src/objects/v8_base_without_compiler.abstract-code.o1399[437/1875] CXX obj/deps/v8/src/objects/v8_base_without_compiler.backing-store.o1400[438/1875] CXX obj/deps/v8/src/objects/v8_base_without_compiler.bigint.o1401[439/1875] CXX obj/deps/v8/src/objects/v8_base_without_compiler.bytecode-array.o1402[440/1875] CXX obj/deps/v8/src/objects/v8_base_without_compiler.compilation-cache-table.o1403[441/1875] CXX obj/deps/v8/src/objects/v8_base_without_compiler.call-site-info.o1404[442/1875] CXX obj/deps/v8/src/objects/v8_base_without_compiler.code.o1405[443/1875] CXX obj/deps/v8/src/objects/v8_base_without_compiler.contexts.o1406[444/1875] CXX obj/deps/v8/src/objects/v8_base_without_compiler.debug-objects.o1407[445/1875] CXX obj/deps/v8/src/objects/v8_base_without_compiler.dependent-code.o1408[446/1875] CXX obj/deps/v8/src/objects/v8_base_without_compiler.elements-kind.o1409[447/1875] CXX obj/deps/v8/src/objects/v8_base_without_compiler.deoptimization-data.o1410[448/1875] CXX obj/deps/v8/src/objects/v8_base_without_compiler.embedder-data-array.o1411[449/1875] CXX obj/deps/v8/src/objects/v8_base_without_compiler.feedback-vector.o1412[450/1875] CXX obj/deps/v8/src/objects/v8_base_without_compiler.field-type.o1413[451/1875] CXX obj/deps/v8/src/objects/v8_base_without_compiler.fixed-array.o1414[452/1875] CXX obj/deps/v8/src/objects/v8_base_without_compiler.instruction-stream.o1415[453/1875] CXX obj/deps/v8/src/objects/v8_base_without_compiler.js-array-buffer.o1416[454/1875] CXX obj/deps/v8/src/objects/v8_base_without_compiler.js-atomics-synchronization.o1417[455/1875] CXX obj/deps/v8/src/objects/v8_base_without_compiler.intl-objects.o1418[456/1875] CXX obj/deps/v8/src/objects/v8_base_without_compiler.js-break-iterator.o1419[457/1875] CXX obj/deps/v8/src/objects/v8_base_without_compiler.js-collator.o1420[458/1875] CXX obj/deps/v8/src/objects/v8_base_without_compiler.js-display-names.o1421[459/1875] CXX obj/deps/v8/src/objects/v8_base_without_compiler.js-date-time-format.o1422[460/1875] CXX obj/deps/v8/src/objects/v8_base_without_compiler.elements.o1423[461/1875] CXX obj/deps/v8/src/objects/v8_base_without_compiler.js-disposable-stack.o1424[462/1875] CXX obj/deps/v8/src/objects/v8_base_without_compiler.js-duration-format.o1425[463/1875] CXX obj/deps/v8/src/objects/v8_base_without_compiler.js-list-format.o1426[464/1875] CXX obj/deps/v8/src/objects/v8_base_without_compiler.js-function.o1427[465/1875] CXX obj/deps/v8/src/objects/v8_base_without_compiler.js-locale.o1428[466/1875] CXX obj/deps/v8/src/objects/v8_base_without_compiler.js-plural-rules.o1429[467/1875] CXX obj/deps/v8/src/objects/v8_base_without_compiler.js-raw-json.o1430[468/1875] CXX obj/deps/v8/src/objects/v8_base_without_compiler.js-number-format.o1431[469/1875] CXX obj/deps/v8/src/objects/v8_base_without_compiler.js-regexp.o1432[470/1875] CXX obj/deps/v8/src/objects/v8_base_without_compiler.js-segment-iterator.o1433[471/1875] CXX obj/deps/v8/src/objects/v8_base_without_compiler.js-relative-time-format.o1434[472/1875] CXX obj/deps/v8/src/objects/v8_base_without_compiler.js-segmenter.o1435[473/1875] CXX obj/deps/v8/src/objects/v8_base_without_compiler.js-objects.o1436[474/1875] CXX obj/deps/v8/src/objects/v8_base_without_compiler.lookup-cache.o1437[475/1875] CXX obj/deps/v8/src/objects/v8_base_without_compiler.js-segments.o1438[476/1875] CXX obj/deps/v8/src/objects/v8_base_without_compiler.js-struct.o1439[477/1875] CXX obj/deps/v8/src/objects/v8_base_without_compiler.js-temporal-helpers.o1440[478/1875] CXX obj/deps/v8/src/objects/v8_base_without_compiler.js-weak-refs.o1441[479/1875] CXX obj/deps/v8/src/objects/v8_base_without_compiler.keys.o1442[480/1875] CXX obj/deps/v8/src/objects/v8_base_without_compiler.literal-objects.o1443[481/1875] CXX obj/deps/v8/src/objects/v8_base_without_compiler.lookup.o1444[482/1875] CXX obj/deps/v8/src/objects/v8_base_without_compiler.managed.o1445[483/1875] CXX obj/deps/v8/src/objects/v8_base_without_compiler.map-updater.o1446[484/1875] CXX obj/deps/v8/src/objects/v8_base_without_compiler.module.o1447[485/1875] CXX obj/deps/v8/src/objects/v8_base_without_compiler.map.o1448[486/1875] CXX obj/deps/v8/src/objects/v8_base_without_compiler.number-string-cache.o1449[487/1875] CXX obj/deps/v8/src/objects/v8_base_without_compiler.object-type.o1450[488/1875] CXX obj/deps/v8/src/objects/v8_base_without_compiler.option-utils.o1451[489/1875] CXX obj/deps/v8/src/objects/v8_base_without_compiler.ordered-hash-table.o1452[490/1875] CXX obj/deps/v8/src/objects/v8_base_without_compiler.property-descriptor.o1453[491/1875] CXX obj/deps/v8/src/objects/v8_base_without_compiler.property.o1454[492/1875] CXX obj/deps/v8/src/objects/v8_base_without_compiler.regexp-match-info.o1455[493/1875] CXX obj/deps/v8/src/objects/v8_base_without_compiler.scope-info.o1456[494/1875] CXX obj/deps/v8/src/objects/v8_base_without_compiler.script.o1457[495/1875] CXX obj/deps/v8/src/objects/v8_base_without_compiler.objects.o1458[496/1875] CXX obj/deps/v8/src/objects/v8_base_without_compiler.shared-function-info.o1459[497/1875] CXX obj/deps/v8/src/objects/v8_base_without_compiler.simd.o1460[498/1875] CXX obj/deps/v8/src/objects/v8_base_without_compiler.source-text-module.o1461[499/1875] CXX obj/deps/v8/src/objects/v8_base_without_compiler.string-comparator.o1462[500/1875] CXX obj/deps/v8/src/objects/v8_base_without_compiler.string-forwarding-table.o1463[501/1875] CXX obj/deps/v8/src/objects/v8_base_without_compiler.string-table.o1464[502/1875] CXX obj/deps/v8/src/objects/v8_base_without_compiler.symbol-table.o1465[503/1875] CXX obj/deps/v8/src/objects/v8_base_without_compiler.swiss-name-dictionary.o1466[504/1875] CXX obj/deps/v8/src/objects/v8_base_without_compiler.synthetic-module.o1467[505/1875] CXX obj/deps/v8/src/objects/v8_base_without_compiler.string.o1468[506/1875] CXX obj/deps/v8/src/objects/v8_base_without_compiler.type-hints.o1469[507/1875] CXX obj/deps/v8/src/objects/v8_base_without_compiler.template-objects.o1470[508/1875] CXX obj/deps/v8/src/objects/v8_base_without_compiler.tagged-impl.o1471[509/1875] CXX obj/deps/v8/src/objects/v8_base_without_compiler.templates.o1472[510/1875] CXX obj/deps/v8/src/objects/v8_base_without_compiler.transitions.o1473[511/1875] CXX obj/deps/v8/src/parsing/v8_base_without_compiler.import-attributes.o1474[512/1875] CXX obj/deps/v8/src/parsing/v8_base_without_compiler.literal-buffer.o1475[513/1875] CXX obj/deps/v8/src/objects/v8_base_without_compiler.waiter-queue-node.o1476[514/1875] CXX obj/deps/v8/src/objects/v8_base_without_compiler.visitors.o1477[515/1875] CXX obj/deps/v8/src/parsing/v8_base_without_compiler.func-name-inferrer.o1478[516/1875] CXX obj/deps/v8/src/objects/v8_base_without_compiler.value-serializer.o1479[517/1875] CXX obj/deps/v8/src/parsing/v8_base_without_compiler.parse-info.o1480[518/1875] CXX obj/deps/v8/src/parsing/v8_base_without_compiler.pending-compilation-error-handler.o1481[519/1875] CXX obj/deps/v8/src/parsing/v8_base_without_compiler.parsing.o1482[520/1875] CXX obj/deps/v8/src/parsing/v8_base_without_compiler.token.o1483[521/1875] CXX obj/deps/v8/src/parsing/v8_base_without_compiler.preparse-data.o1484[522/1875] CXX obj/deps/v8/src/parsing/v8_base_without_compiler.rewriter.o1485[523/1875] CXX obj/deps/v8/src/parsing/v8_base_without_compiler.scanner-character-streams.o1486[524/1875] CXX obj/deps/v8/src/parsing/v8_base_without_compiler.preparser.o1487[525/1875] CXX obj/deps/v8/src/parsing/v8_base_without_compiler.parser.o1488[526/1875] CXX obj/deps/v8/src/profiler/v8_base_without_compiler.profiler-stats.o1489[527/1875] CXX obj/deps/v8/src/parsing/v8_base_without_compiler.scanner.o1490[528/1875] CXX obj/deps/v8/src/profiler/v8_base_without_compiler.allocation-tracker.o1491[529/1875] CXX obj/deps/v8/src/profiler/v8_base_without_compiler.cpu-profiler.o1492[530/1875] CXX obj/deps/v8/src/profiler/v8_base_without_compiler.heap-profiler.o1493[531/1875] CXX obj/deps/v8/src/profiler/v8_base_without_compiler.profiler-listener.o1494[532/1875] CXX obj/deps/v8/src/profiler/v8_base_without_compiler.sampling-heap-profiler.o1495[533/1875] CXX obj/deps/v8/src/profiler/v8_base_without_compiler.profile-generator.o1496[534/1875] CXX obj/deps/v8/src/profiler/v8_base_without_compiler.symbolizer.o1497[535/1875] CXX obj/deps/v8/src/profiler/v8_base_without_compiler.heap-snapshot-generator.o1498[536/1875] CXX obj/deps/v8/src/profiler/v8_base_without_compiler.strings-storage.o1499[537/1875] CXX obj/deps/v8/src/regexp/experimental/v8_base_without_compiler.experimental-bytecode.o1500[538/1875] CXX obj/deps/v8/src/profiler/v8_base_without_compiler.tracing-cpu-profiler.o1501[539/1875] CXX obj/deps/v8/src/regexp/experimental/v8_base_without_compiler.experimental-compiler.o1502[540/1875] CXX obj/deps/v8/src/regexp/v8_base_without_compiler.regexp-ast.o1503[541/1875] CXX obj/deps/v8/src/profiler/v8_base_without_compiler.tick-sample.o1504[542/1875] CXX obj/deps/v8/src/profiler/v8_base_without_compiler.weak-code-registry.o1505[543/1875] CXX obj/deps/v8/src/regexp/v8_base_without_compiler.regexp-bytecodes.o1506[544/1875] CXX obj/deps/v8/src/regexp/experimental/v8_base_without_compiler.experimental.o1507[545/1875] CXX obj/deps/v8/src/regexp/experimental/v8_base_without_compiler.experimental-interpreter.o1508[546/1875] CXX obj/deps/v8/src/regexp/v8_base_without_compiler.regexp-error.o1509[547/1875] CXX obj/deps/v8/src/regexp/v8_base_without_compiler.regexp-bytecode-iterator.o1510[548/1875] CXX obj/deps/v8/src/regexp/v8_base_without_compiler.regexp-bytecode-generator.o1511[549/1875] CXX obj/deps/v8/src/regexp/v8_base_without_compiler.regexp-bytecode-peephole.o1512[550/1875] CXX obj/deps/v8/src/regexp/v8_base_without_compiler.regexp-bytecode-analysis.o1513[551/1875] CXX obj/deps/v8/src/regexp/v8_base_without_compiler.regexp-compiler-tonode.o1514[552/1875] CXX obj/deps/v8/src/regexp/v8_base_without_compiler.regexp-result-vector.o1515[553/1875] CXX obj/deps/v8/src/regexp/v8_base_without_compiler.regexp-code-generator.o1516[554/1875] CXX obj/deps/v8/src/regexp/v8_base_without_compiler.regexp-compiler.o1517In file included from ../../deps/v8/src/regexp/arm64/regexp-macro-assembler-arm64.h:10,1518 from ../../deps/v8/src/regexp/regexp-macro-assembler-arch.h:17,1519 from ../../deps/v8/src/regexp/regexp-compiler.cc:15:1520../../deps/v8/src/codegen/arm64/assembler-arm64.h:95:10: warning: inline function 'v8::internal::Operand::Operand(T) [with T = int]' used but never defined1521 95 | inline Operand(T t); // NOLINT(runtime/explicit)1522 | ^~~~~~~1523[555/1875] CXX obj/deps/v8/src/regexp/v8_base_without_compiler.regexp-stack.o1524[556/1875] CXX obj/deps/v8/src/regexp/v8_base_without_compiler.regexp-macro-assembler.o1525In file included from ../../deps/v8/src/regexp/arm64/regexp-macro-assembler-arm64.h:10,1526 from ../../deps/v8/src/regexp/regexp-macro-assembler-arch.h:17,1527 from ../../deps/v8/src/regexp/regexp-macro-assembler.cc:10:1528../../deps/v8/src/codegen/arm64/assembler-arm64.h:95:10: warning: inline function 'v8::internal::Operand::Operand(T) [with T = int]' used but never defined1529 95 | inline Operand(T t); // NOLINT(runtime/explicit)1530 | ^~~~~~~1531[557/1875] CXX obj/deps/v8/src/regexp/v8_base_without_compiler.regexp-parser.o1532[558/1875] CXX obj/deps/v8/src/regexp/v8_base_without_compiler.regexp-utils.o1533[559/1875] CXX obj/deps/v8/src/regexp/v8_base_without_compiler.regexp-interpreter.o1534[560/1875] CXX obj/deps/v8/src/roots/v8_base_without_compiler.roots.o1535[561/1875] CXX obj/deps/v8/src/regexp/v8_base_without_compiler.regexp.o1536In file included from ../../deps/v8/src/regexp/arm64/regexp-macro-assembler-arm64.h:10,1537 from ../../deps/v8/src/regexp/regexp-macro-assembler-arch.h:17,1538 from ../../deps/v8/src/regexp/regexp.cc:22:1539../../deps/v8/src/codegen/arm64/assembler-arm64.h:95:10: warning: inline function 'v8::internal::Operand::Operand(T) [with T = int]' used but never defined1540 95 | inline Operand(T t); // NOLINT(runtime/explicit)1541 | ^~~~~~~1542[562/1875] CXX obj/deps/v8/src/runtime/v8_base_without_compiler.runtime-array.o1543[563/1875] CXX obj/deps/v8/src/runtime/v8_base_without_compiler.runtime-atomics.o1544[564/1875] CXX obj/deps/v8/src/runtime/v8_base_without_compiler.runtime-bigint.o1545[565/1875] CXX obj/deps/v8/src/runtime/v8_base_without_compiler.runtime-collections.o1546[566/1875] CXX obj/deps/v8/src/runtime/v8_base_without_compiler.runtime-classes.o1547[567/1875] CXX obj/deps/v8/src/runtime/v8_base_without_compiler.runtime-compiler.o1548[568/1875] CXX obj/deps/v8/src/runtime/v8_base_without_compiler.runtime-date.o1549[569/1875] CXX obj/deps/v8/src/runtime/v8_base_without_compiler.runtime-forin.o1550[570/1875] CXX obj/deps/v8/src/runtime/v8_base_without_compiler.runtime-function.o1551[571/1875] CXX obj/deps/v8/src/runtime/v8_base_without_compiler.runtime-futex.o1552[572/1875] CXX obj/deps/v8/src/runtime/v8_base_without_compiler.runtime-debug.o1553[573/1875] CXX obj/deps/v8/src/runtime/v8_base_without_compiler.runtime-generator.o1554[574/1875] CXX obj/deps/v8/src/runtime/v8_base_without_compiler.runtime-internal.o1555[575/1875] CXX obj/deps/v8/src/runtime/v8_base_without_compiler.runtime-intl.o1556[576/1875] CXX obj/deps/v8/src/runtime/v8_base_without_compiler.runtime-module.o1557[577/1875] CXX obj/deps/v8/src/runtime/v8_base_without_compiler.runtime-literals.o1558[578/1875] CXX obj/deps/v8/src/runtime/v8_base_without_compiler.runtime-numbers.o1559[579/1875] CXX obj/deps/v8/src/runtime/v8_base_without_compiler.runtime-operators.o1560[580/1875] CXX obj/deps/v8/src/runtime/v8_base_without_compiler.runtime-object.o1561[581/1875] CXX obj/deps/v8/src/runtime/v8_base_without_compiler.runtime-promise.o1562[582/1875] CXX obj/deps/v8/src/runtime/v8_base_without_compiler.runtime-proxy.o1563[583/1875] CXX obj/deps/v8/src/runtime/v8_base_without_compiler.runtime-shadow-realm.o1564[584/1875] CXX obj/deps/v8/src/runtime/v8_base_without_compiler.runtime-regexp.o1565[585/1875] CXX obj/deps/v8/src/runtime/v8_base_without_compiler.runtime-scopes.o1566[586/1875] CXX obj/deps/v8/src/runtime/v8_base_without_compiler.runtime-strings.o1567[587/1875] CXX obj/deps/v8/src/runtime/v8_base_without_compiler.runtime-symbol.o1568[588/1875] CXX obj/deps/v8/src/runtime/v8_base_without_compiler.runtime-trace.o1569[589/1875] CXX obj/deps/v8/src/runtime/v8_base_without_compiler.runtime-test.o1570[590/1875] CXX obj/deps/v8/src/runtime/v8_base_without_compiler.runtime-typedarray.o1571[591/1875] CXX obj/deps/v8/src/sandbox/v8_base_without_compiler.cppheap-pointer-table.o1572[592/1875] CXX obj/deps/v8/src/sandbox/v8_base_without_compiler.hardware-support.o1573[593/1875] CXX obj/deps/v8/src/sandbox/v8_base_without_compiler.external-strings-cage.o1574[594/1875] CXX obj/deps/v8/src/sandbox/v8_base_without_compiler.sandbox.o1575[595/1875] CXX obj/deps/v8/src/sandbox/v8_base_without_compiler.sandboxable-thread.o1576[596/1875] CXX obj/deps/v8/src/runtime/v8_base_without_compiler.runtime-weak-refs.o1577[597/1875] CXX obj/deps/v8/src/runtime/v8_base_without_compiler.runtime.o1578[598/1875] CXX obj/deps/v8/src/sandbox/v8_base_without_compiler.external-pointer-table.o1579[599/1875] CXX obj/deps/v8/src/sandbox/v8_base_without_compiler.bytecode-verifier.o1580[600/1875] CXX obj/deps/v8/src/sandbox/v8_base_without_compiler.code-pointer-table.o1581[601/1875] CXX obj/deps/v8/src/sandbox/v8_base_without_compiler.trusted-pointer-table.o1582[602/1875] CXX obj/deps/v8/src/sandbox/v8_base_without_compiler.js-dispatch-table.o1583[603/1875] CXX obj/deps/v8/src/sandbox/v8_base_without_compiler.testing.o1584[604/1875] CXX obj/deps/v8/src/sandbox/v8_base_without_compiler.trusted-pointer-scope.o1585[605/1875] CXX obj/deps/v8/src/snapshot/v8_base_without_compiler.context-deserializer.o1586[606/1875] CXX obj/deps/v8/src/snapshot/v8_base_without_compiler.code-serializer.o1587[607/1875] CXX obj/deps/v8/src/snapshot/v8_base_without_compiler.context-serializer.o1588[608/1875] CXX obj/deps/v8/src/snapshot/v8_base_without_compiler.deserializer.o1589[609/1875] CXX obj/deps/v8/src/snapshot/embedded/v8_base_without_compiler.embedded-data.o1590[610/1875] CXX obj/deps/v8/src/snapshot/v8_base_without_compiler.object-deserializer.o1591[611/1875] CXX obj/deps/v8/src/snapshot/v8_base_without_compiler.roots-serializer.o1592[612/1875] CXX obj/deps/v8/src/snapshot/v8_base_without_compiler.read-only-deserializer.o1593[613/1875] CXX obj/deps/v8/src/snapshot/v8_base_without_compiler.read-only-serializer.o1594[614/1875] CXX obj/deps/v8/src/snapshot/v8_base_without_compiler.snapshot-utils.o1595[615/1875] CXX obj/deps/v8/src/snapshot/v8_base_without_compiler.serializer-deserializer.o1596[616/1875] CXX obj/deps/v8/src/snapshot/v8_base_without_compiler.snapshot-data.o1597[617/1875] CXX obj/deps/v8/src/snapshot/v8_base_without_compiler.shared-heap-deserializer.o1598[618/1875] CXX obj/deps/v8/src/strings/v8_base_without_compiler.char-predicates.o1599[619/1875] CXX obj/deps/v8/src/snapshot/v8_base_without_compiler.shared-heap-serializer.o1600[620/1875] CXX obj/deps/v8/src/snapshot/v8_base_without_compiler.snapshot-source-sink.o1601[621/1875] CXX obj/deps/v8/src/snapshot/v8_base_without_compiler.serializer.o1602[622/1875] CXX obj/deps/v8/src/snapshot/v8_base_without_compiler.sort-builtins.o1603[623/1875] CXX obj/deps/v8/src/strings/v8_base_without_compiler.string-case.o1604[624/1875] CXX obj/deps/v8/src/strings/v8_base_without_compiler.unicode-decoder.o1605[625/1875] CXX obj/deps/v8/src/strings/v8_base_without_compiler.unicode.o1606[626/1875] CXX obj/deps/v8/src/snapshot/v8_base_without_compiler.startup-deserializer.o1607[627/1875] CXX obj/deps/v8/src/snapshot/v8_base_without_compiler.snapshot.o1608[628/1875] CXX obj/deps/v8/src/tasks/v8_base_without_compiler.operations-barrier.o1609[629/1875] CXX obj/deps/v8/src/tasks/v8_base_without_compiler.task-utils.o1610[630/1875] CXX obj/deps/v8/src/snapshot/v8_base_without_compiler.startup-serializer.o1611[631/1875] CXX obj/deps/v8/src/tracing/v8_base_without_compiler.traced-value.o1612[632/1875] CXX obj/deps/v8/src/strings/v8_base_without_compiler.string-builder.o1613[633/1875] CXX obj/deps/v8/src/tasks/v8_base_without_compiler.cancelable-task.o1614[634/1875] CXX obj/deps/v8/src/tracing/v8_base_without_compiler.tracing-category-observer.o1615[635/1875] CXX obj/deps/v8/src/utils/v8_base_without_compiler.detachable-vector.o1616[636/1875] CXX obj/deps/v8/src/utils/v8_base_without_compiler.hex-format.o1617[637/1875] CXX obj/deps/v8/src/utils/v8_base_without_compiler.bit-vector.o1618[638/1875] CXX obj/deps/v8/src/strings/v8_base_without_compiler.string-hasher.o1619[639/1875] CXX obj/deps/v8/src/strings/v8_base_without_compiler.string-stream.o1620[640/1875] CXX obj/deps/v8/src/utils/v8_base_without_compiler.sha-256.o1621[641/1875] CXX obj/deps/v8/src/tracing/v8_base_without_compiler.trace-event.o1622[642/1875] CXX obj/deps/v8/src/utils/v8_base_without_compiler.output-stream.o1623[643/1875] CXX obj/deps/v8/src/utils/v8_base_without_compiler.allocation.o1624[644/1875] CXX obj/deps/v8/src/zone/v8_base_without_compiler.type-stats.o1625[645/1875] CXX obj/deps/v8/src/utils/v8_base_without_compiler.version.o1626[646/1875] CXX obj/deps/v8/src/zone/v8_base_without_compiler.zone-segment.o1627[647/1875] CXX obj/deps/v8/src/utils/v8_base_without_compiler.utils.o1628[648/1875] CXX obj/deps/v8/src/strings/v8_base_without_compiler.uri.o1629[649/1875] CXX obj/deps/v8/third_party/siphash/v8_base_without_compiler.halfsiphash.o1630[650/1875] CXX obj/deps/v8/src/inspector/v8_base_without_compiler.crc32.o1631[651/1875] CXX obj/deps/v8/src/zone/v8_base_without_compiler.zone.o1632[652/1875] CXX obj/deps/v8/src/inspector/v8_base_without_compiler.remote-object-id.o1633[653/1875] CXX obj/deps/v8/src/utils/v8_base_without_compiler.ostreams.o1634[654/1875] CXX obj/deps/v8/src/inspector/v8_base_without_compiler.custom-preview.o1635[655/1875] CXX obj/deps/v8/src/inspector/v8_base_without_compiler.inspected-context.o1636[656/1875] CXX obj/deps/v8/src/inspector/v8_base_without_compiler.string-16.o1637[657/1875] CXX obj/deps/v8/src/zone/v8_base_without_compiler.accounting-allocator.o1638[658/1875] CXX obj/deps/v8/src/utils/v8_base_without_compiler.address-map.o1639[659/1875] CXX obj/deps/v8/src/inspector/v8_base_without_compiler.string-util.o1640[660/1875] CXX obj/deps/v8/src/inspector/v8_base_without_compiler.injected-script.o1641[661/1875] CXX obj/deps/v8/src/inspector/v8_base_without_compiler.search-util.o1642[662/1875] CXX obj/deps/v8/src/inspector/v8_base_without_compiler.v8-debugger-barrier.o1643[663/1875] CXX obj/deps/v8/src/inspector/v8_base_without_compiler.test-interface.o1644[664/1875] CXX obj/deps/v8/src/inspector/v8_base_without_compiler.v8-console-agent-impl.o1645[665/1875] CXX obj/deps/v8/src/utils/v8_base_without_compiler.identity-map.o1646[666/1875] CXX obj/deps/v8/src/inspector/v8_base_without_compiler.v8-debugger-id.o1647[667/1875] CXX obj/deps/v8/src/inspector/v8_base_without_compiler.v8-console-message.o1648[668/1875] CXX obj/deps/v8/src/inspector/v8_base_without_compiler.v8-console.o1649[669/1875] CXX obj/deps/v8/src/inspector/v8_base_without_compiler.v8-debugger-script.o1650[670/1875] CXX obj/deps/v8/src/inspector/v8_base_without_compiler.v8-deep-serializer.o1651[671/1875] CXX obj/deps/v8/src/inspector/v8_base_without_compiler.v8-debugger.o1652[672/1875] CXX obj/deps/v8/src/inspector/v8_base_without_compiler.v8-heap-profiler-agent-impl.o1653[673/1875] CXX obj/deps/v8/src/inspector/v8_base_without_compiler.v8-regex.o1654[674/1875] CXX obj/deps/v8/src/inspector/v8_base_without_compiler.v8-debugger-agent-impl.o1655[675/1875] CXX obj/deps/v8/src/inspector/v8_base_without_compiler.v8-schema-agent-impl.o1656[676/1875] CXX obj/deps/v8/src/inspector/v8_base_without_compiler.v8-inspector-session-impl.o1657[677/1875] CXX obj/deps/v8/src/inspector/v8_base_without_compiler.v8-profiler-agent-impl.o1658[678/1875] CXX obj/deps/v8/src/inspector/v8_base_without_compiler.v8-value-utils.o1659[679/1875] CXX obj/deps/v8/src/inspector/v8_base_without_compiler.v8-inspector-impl.o1660[680/1875] CXX obj/deps/v8/src/inspector/v8_base_without_compiler.v8-string-conversions.o1661[681/1875] CXX obj/deps/v8/src/inspector/v8_base_without_compiler.v8-serialization-duplicate-tracker.o1662[682/1875] CXX obj/deps/v8/third_party/inspector_protocol/crdtp/v8_base_without_compiler.json_platform_v8.o1663[683/1875] CXX obj/deps/v8/third_party/inspector_protocol/crdtp/v8_base_without_compiler.error_support.o1664[684/1875] CXX obj/deps/v8/src/inspector/v8_base_without_compiler.v8-runtime-agent-impl.o1665[685/1875] CXX obj/deps/v8/third_party/inspector_protocol/crdtp/v8_base_without_compiler.serializable.o1666[686/1875] CXX obj/deps/v8/third_party/inspector_protocol/crdtp/v8_base_without_compiler.span.o1667[687/1875] CXX obj/deps/v8/third_party/inspector_protocol/crdtp/v8_base_without_compiler.cbor.o1668[688/1875] CXX obj/deps/v8/third_party/inspector_protocol/crdtp/v8_base_without_compiler.status.o1669[689/1875] CXX obj/deps/v8/third_party/inspector_protocol/crdtp/v8_base_without_compiler.protocol_core.o1670[690/1875] CXX obj/deps/v8/third_party/inspector_protocol/crdtp/v8_base_without_compiler.dispatch.o1671[691/1875] CXX obj/deps/v8/src/inspector/v8_base_without_compiler.v8-stack-trace-impl.o1672[692/1875] CXX obj/deps/v8/third_party/inspector_protocol/crdtp/v8_base_without_compiler.json.o1673[693/1875] CXX obj/tools/v8_gypfiles/gen/inspector-generated-output-root/src/inspector/protocol/v8_base_without_compiler.Console.o1674[694/1875] CXX obj/tools/v8_gypfiles/gen/inspector-generated-output-root/src/inspector/protocol/v8_base_without_compiler.Protocol.o1675[695/1875] CXX obj/deps/v8/src/inspector/v8_base_without_compiler.value-mirror.o1676[696/1875] CXX obj/tools/v8_gypfiles/gen/inspector-generated-output-root/src/inspector/protocol/v8_base_without_compiler.Schema.o1677[697/1875] CXX obj/tools/v8_gypfiles/gen/inspector-generated-output-root/src/inspector/protocol/v8_base_without_compiler.HeapProfiler.o1678[698/1875] CXX obj/deps/v8/src/objects/v8_base_without_compiler.js-temporal-zoneinfo64.o1679[699/1875] CXX obj/tools/v8_gypfiles/gen/inspector-generated-output-root/src/inspector/protocol/v8_base_without_compiler.Profiler.o1680[700/1875] CXX obj/tools/v8_gypfiles/gen/inspector-generated-output-root/src/inspector/protocol/v8_base_without_compiler.Debugger.o1681[701/1875] CXX obj/tools/v8_gypfiles/gen/inspector-generated-output-root/src/inspector/protocol/v8_base_without_compiler.Runtime.o1682[702/1875] CXX obj/deps/v8/src/baseline/v8_base_without_compiler.baseline-batch-compiler.o1683[703/1875] CXX obj/deps/v8/src/builtins/v8_base_without_compiler.builtins-temporal.o1684[704/1875] CXX obj/deps/v8/src/maglev/v8_base_without_compiler.maglev-compilation-info.o1685[705/1875] CXX obj/deps/v8/src/maglev/v8_base_without_compiler.maglev-compilation-unit.o1686[706/1875] CXX obj/deps/v8/src/baseline/v8_base_without_compiler.baseline-compiler.o1687[707/1875] CXX obj/deps/v8/src/maglev/v8_base_without_compiler.maglev-assembler.o1688[708/1875] CXX obj/deps/v8/src/objects/v8_base_without_compiler.js-temporal-objects.o1689[709/1875] CXX obj/deps/v8/src/maglev/v8_base_without_compiler.maglev-graph-labeller.o1690[710/1875] CXX obj/deps/v8/src/maglev/v8_base_without_compiler.maglev-graph-printer.o1691[711/1875] CXX obj/deps/v8/src/maglev/v8_base_without_compiler.maglev-concurrent-dispatcher.o1692[712/1875] CXX obj/deps/v8/src/maglev/v8_base_without_compiler.maglev-code-generator.o1693[713/1875] CXX obj/deps/v8/src/maglev/v8_base_without_compiler.maglev-graph.o1694[714/1875] CXX obj/deps/v8/src/maglev/v8_base_without_compiler.maglev-graph-optimizer.o1695[715/1875] CXX obj/deps/v8/src/maglev/v8_base_without_compiler.maglev-interpreter-frame-state.o1696[716/1875] CXX obj/deps/v8/src/maglev/v8_base_without_compiler.maglev-node-type.o1697[717/1875] CXX obj/deps/v8/src/maglev/v8_base_without_compiler.maglev-known-node-aspects.o1698[718/1875] CXX obj/deps/v8/src/maglev/v8_base_without_compiler.maglev-inlining.o1699[719/1875] CXX obj/deps/v8/src/maglev/v8_base_without_compiler.maglev-pipeline-statistics.o1700[720/1875] CXX obj/deps/v8/src/maglev/v8_base_without_compiler.maglev-phi-representation-selector.o1701[721/1875] CXX obj/deps/v8/src/maglev/v8_base_without_compiler.maglev.o1702[722/1875] CXX obj/deps/v8/src/maglev/v8_base_without_compiler.maglev-range-verification.o1703[723/1875] CXX obj/deps/v8/src/maglev/v8_base_without_compiler.maglev-compiler.o1704[724/1875] CXX obj/deps/v8/src/maglev/v8_base_without_compiler.maglev-ir.o1705[725/1875] CXX obj/deps/v8/src/maglev/v8_base_without_compiler.maglev-truncation.o1706[726/1875] CXX obj/deps/v8/src/asmjs/v8_base_without_compiler.asm-scanner.o1707[727/1875] CXX obj/deps/v8/src/maglev/v8_base_without_compiler.maglev-regalloc.o1708[728/1875] CXX obj/deps/v8/src/asmjs/v8_base_without_compiler.asm-types.o1709[729/1875] CXX obj/deps/v8/src/asmjs/v8_base_without_compiler.asm-js.o1710[730/1875] CXX obj/deps/v8/src/asmjs/v8_base_without_compiler.asm-parser.o1711[731/1875] CXX obj/deps/v8/src/trap-handler/v8_base_without_compiler.handler-inside.o1712[732/1875] CXX obj/deps/v8/src/maglev/arm64/v8_base_without_compiler.maglev-assembler-arm64.o1713[733/1875] CXX obj/deps/v8/src/trap-handler/v8_base_without_compiler.handler-outside.o1714[734/1875] CXX obj/deps/v8/src/trap-handler/v8_base_without_compiler.handler-shared.o1715[735/1875] CXX obj/deps/v8/src/compiler/v8_base_without_compiler.wasm-compiler-definitions.o1716[736/1875] CXX obj/deps/v8/src/maglev/v8_base_without_compiler.maglev-graph-builder.o1717[737/1875] CXX obj/deps/v8/src/maglev/arm64/v8_base_without_compiler.maglev-ir-arm64.o1718[738/1875] CXX obj/deps/v8/src/wasm/v8_base_without_compiler.basic-block-calculator.o1719[739/1875] CXX obj/deps/v8/src/debug/v8_base_without_compiler.debug-wasm-objects.o1720[740/1875] CXX obj/deps/v8/src/runtime/v8_base_without_compiler.runtime-test-wasm.o1721[741/1875] CXX obj/deps/v8/src/wasm/v8_base_without_compiler.compilation-hints-generation.o1722[742/1875] CXX obj/deps/v8/src/wasm/baseline/v8_base_without_compiler.parallel-move.o1723[743/1875] CXX obj/deps/v8/src/wasm/baseline/v8_base_without_compiler.liftoff-assembler.o1724[744/1875] CXX obj/deps/v8/src/runtime/v8_base_without_compiler.runtime-wasm.o1725[745/1875] CXX obj/deps/v8/src/wasm/v8_base_without_compiler.code-space-access.o1726[746/1875] CXX obj/deps/v8/src/wasm/v8_base_without_compiler.local-decl-encoder.o1727[747/1875] CXX obj/deps/v8/src/wasm/v8_base_without_compiler.canonical-types.o1728[748/1875] CXX obj/deps/v8/src/wasm/v8_base_without_compiler.constant-expression-interface.o1729[749/1875] CXX obj/deps/v8/src/wasm/v8_base_without_compiler.jump-table-assembler.o1730[750/1875] CXX obj/deps/v8/src/wasm/v8_base_without_compiler.constant-expression.o1731[751/1875] CXX obj/deps/v8/src/wasm/v8_base_without_compiler.function-body-decoder.o1732[752/1875] CXX obj/deps/v8/src/wasm/v8_base_without_compiler.simd-shuffle.o1733[753/1875] CXX obj/deps/v8/src/wasm/v8_base_without_compiler.pgo.o1734[754/1875] CXX obj/deps/v8/src/wasm/v8_base_without_compiler.function-compiler.o1735[755/1875] CXX obj/deps/v8/src/wasm/v8_base_without_compiler.names-provider.o1736[756/1875] CXX obj/deps/v8/src/wasm/baseline/v8_base_without_compiler.liftoff-compiler.o1737[757/1875] CXX obj/deps/v8/src/wasm/v8_base_without_compiler.module-compiler.o1738[758/1875] CXX obj/deps/v8/src/wasm/v8_base_without_compiler.stacks.o1739[759/1875] CXX obj/deps/v8/src/wasm/v8_base_without_compiler.streaming-decoder.o1740[760/1875] CXX obj/deps/v8/src/wasm/v8_base_without_compiler.value-type.o1741[761/1875] CXX obj/deps/v8/src/wasm/v8_base_without_compiler.module-decoder.o1742[762/1875] CXX obj/deps/v8/src/wasm/v8_base_without_compiler.wasm-deopt-data.o1743[763/1875] CXX obj/deps/v8/src/wasm/v8_base_without_compiler.module-instantiate.o1744[764/1875] CXX obj/deps/v8/src/wasm/v8_base_without_compiler.sync-streaming-decoder.o1745[765/1875] CXX obj/deps/v8/src/wasm/v8_base_without_compiler.wasm-code-pointer-table.o1746[766/1875] CXX obj/deps/v8/src/wasm/v8_base_without_compiler.wasm-disassembler.o1747[767/1875] CXX obj/deps/v8/src/wasm/v8_base_without_compiler.wasm-code-manager.o1748[768/1875] CXX obj/deps/v8/src/wasm/v8_base_without_compiler.wasm-debug.o1749[769/1875] CXX obj/deps/v8/src/wasm/v8_base_without_compiler.wasm-module-sourcemap.o1750[770/1875] CXX obj/deps/v8/src/wasm/v8_base_without_compiler.wasm-export-wrapper-cache.o1751[771/1875] CXX obj/deps/v8/src/wasm/v8_base_without_compiler.wasm-external-refs.o1752[772/1875] CXX obj/deps/v8/src/wasm/v8_base_without_compiler.wasm-engine.o1753[773/1875] CXX obj/deps/v8/src/wasm/v8_base_without_compiler.wasm-features.o1754[774/1875] CXX obj/deps/v8/src/wasm/v8_base_without_compiler.wasm-module-builder.o1755[775/1875] CXX obj/deps/v8/src/wasm/v8_base_without_compiler.wasm-opcodes.o1756[776/1875] CXX obj/deps/v8/src/wasm/v8_base_without_compiler.wasm-subtyping.o1757[777/1875] CXX obj/deps/v8/src/wasm/v8_base_without_compiler.wasm-import-wrapper-cache.o1758[778/1875] CXX obj/deps/v8/src/wasm/v8_base_without_compiler.wasm-tracing.o1759[779/1875] CXX obj/deps/v8/src/wasm/v8_base_without_compiler.wasm-result.o1760[780/1875] CXX obj/deps/v8/src/wasm/v8_base_without_compiler.wasm-wrapper-cache.o1761[781/1875] CXX obj/deps/v8/src/wasm/v8_base_without_compiler.wasm-module.o1762[782/1875] CXX obj/deps/v8/src/wasm/v8_base_without_compiler.well-known-imports.o1763[783/1875] CXX obj/deps/v8/src/wasm/v8_base_without_compiler.wasm-js.o1764[784/1875] CXX obj/deps/v8/src/codegen/arm64/v8_base_without_compiler.cpu-arm64.o1765[785/1875] CXX obj/deps/v8/src/codegen/arm64/v8_base_without_compiler.instructions-arm64-constants.o1766[786/1875] CXX obj/deps/v8/src/wasm/v8_base_without_compiler.wasm-objects.o1767[787/1875] CXX obj/deps/v8/src/wasm/v8_base_without_compiler.wasm-stack-wrapper-cache.o1768[788/1875] CXX obj/deps/v8/src/codegen/arm64/v8_base_without_compiler.register-arm64.o1769[789/1875] CXX obj/deps/v8/src/codegen/arm64/v8_base_without_compiler.utils-arm64.o1770[790/1875] CXX obj/deps/v8/src/codegen/arm64/v8_base_without_compiler.decoder-arm64.o1771[791/1875] CXX obj/deps/v8/src/wasm/v8_base_without_compiler.wasm-serialization.o1772[792/1875] CXX obj/deps/v8/src/diagnostics/arm64/v8_base_without_compiler.unwinder-arm64.o1773[793/1875] CXX obj/deps/v8/src/diagnostics/arm64/v8_base_without_compiler.disasm-arm64.o1774[794/1875] CXX obj/deps/v8/src/execution/arm64/v8_base_without_compiler.pointer-auth-arm64.o1775[795/1875] CXX obj/deps/v8/src/codegen/arm64/v8_base_without_compiler.constant-pool-arm64.o1776[796/1875] CXX obj/deps/v8/src/execution/arm64/v8_base_without_compiler.simulator-logic-arm64.o1777[797/1875] CXX obj/deps/v8/src/codegen/arm64/v8_base_without_compiler.instructions-arm64.o1778[798/1875] CXX obj/deps/v8/src/trap-handler/v8_base_without_compiler.handler-inside-posix.o1779[799/1875] CXX obj/deps/v8/src/trap-handler/v8_base_without_compiler.handler-outside-posix.o1780[800/1875] CXX obj/deps/v8/src/deoptimizer/arm64/v8_base_without_compiler.deoptimizer-arm64.o1781[801/1875] CXX obj/tools/v8_gypfiles/gen/torque-generated/v8_base_without_compiler.class-verifiers.o1782[802/1875] CXX obj/tools/v8_gypfiles/gen/src/regexp/v8_base_without_compiler.special-case.o1783[803/1875] CXX obj/deps/v8/src/codegen/arm64/v8_base_without_compiler.assembler-arm64.o1784[804/1875] CXX obj/tools/v8_gypfiles/gen/torque-generated/src/builtins/v8_base_without_compiler.aggregate-error-tq.o1785[805/1875] CXX obj/tools/v8_gypfiles/gen/torque-generated/src/builtins/v8_base_without_compiler.array-at-tq.o1786[806/1875] CXX obj/tools/v8_gypfiles/gen/torque-generated/src/builtins/v8_base_without_compiler.array-concat-tq.o1787[807/1875] CXX obj/tools/v8_gypfiles/gen/torque-generated/src/builtins/v8_base_without_compiler.array-copywithin-tq.o1788[808/1875] CXX obj/deps/v8/src/diagnostics/arm64/v8_base_without_compiler.eh-frame-arm64.o1789[809/1875] CXX obj/tools/v8_gypfiles/gen/torque-generated/src/builtins/v8_base_without_compiler.array-every-tq.o1790[810/1875] CXX obj/tools/v8_gypfiles/gen/torque-generated/src/builtins/v8_base_without_compiler.array-filter-tq.o1791[811/1875] CXX obj/tools/v8_gypfiles/gen/torque-generated/src/builtins/v8_base_without_compiler.array-find-tq.o1792[812/1875] CXX obj/tools/v8_gypfiles/gen/torque-generated/src/builtins/v8_base_without_compiler.array-findindex-tq.o1793[813/1875] CXX obj/tools/v8_gypfiles/gen/torque-generated/src/builtins/v8_base_without_compiler.array-findlast-tq.o1794[814/1875] CXX obj/tools/v8_gypfiles/gen/torque-generated/src/builtins/v8_base_without_compiler.array-findlastindex-tq.o1795[815/1875] CXX obj/tools/v8_gypfiles/gen/torque-generated/src/builtins/v8_base_without_compiler.array-flat-tq.o1796[816/1875] CXX obj/tools/v8_gypfiles/gen/torque-generated/src/builtins/v8_base_without_compiler.array-foreach-tq.o1797[817/1875] CXX obj/tools/v8_gypfiles/gen/torque-generated/src/builtins/v8_base_without_compiler.array-from-async-tq.o1798[818/1875] CXX obj/tools/v8_gypfiles/gen/torque-generated/src/builtins/v8_base_without_compiler.array-from-tq.o1799[819/1875] CXX obj/tools/v8_gypfiles/gen/torque-generated/src/builtins/v8_base_without_compiler.array-isarray-tq.o1800[820/1875] CXX obj/tools/v8_gypfiles/gen/torque-generated/src/builtins/v8_base_without_compiler.array-join-tq.o1801[821/1875] CXX obj/tools/v8_gypfiles/gen/torque-generated/src/builtins/v8_base_without_compiler.array-lastindexof-tq.o1802[822/1875] CXX obj/tools/v8_gypfiles/gen/torque-generated/src/builtins/v8_base_without_compiler.array-map-tq.o1803[823/1875] CXX obj/tools/v8_gypfiles/gen/torque-generated/src/builtins/v8_base_without_compiler.array-of-tq.o1804[824/1875] CXX obj/tools/v8_gypfiles/gen/torque-generated/src/builtins/v8_base_without_compiler.array-reduce-right-tq.o1805[825/1875] CXX obj/tools/v8_gypfiles/gen/torque-generated/src/builtins/v8_base_without_compiler.array-reduce-tq.o1806[826/1875] CXX obj/tools/v8_gypfiles/gen/torque-generated/src/builtins/v8_base_without_compiler.array-reverse-tq.o1807[827/1875] CXX obj/tools/v8_gypfiles/gen/torque-generated/src/builtins/v8_base_without_compiler.array-shift-tq.o1808[828/1875] CXX obj/tools/v8_gypfiles/gen/torque-generated/src/builtins/v8_base_without_compiler.array-slice-tq.o1809[829/1875] CXX obj/tools/v8_gypfiles/gen/torque-generated/src/builtins/v8_base_without_compiler.array-some-tq.o1810[830/1875] CXX obj/tools/v8_gypfiles/gen/torque-generated/src/builtins/v8_base_without_compiler.array-splice-tq.o1811[831/1875] CXX obj/tools/v8_gypfiles/gen/torque-generated/src/builtins/v8_base_without_compiler.array-to-reversed-tq.o1812[832/1875] CXX obj/tools/v8_gypfiles/gen/torque-generated/src/builtins/v8_base_without_compiler.array-to-sorted-tq.o1813[833/1875] CXX obj/tools/v8_gypfiles/gen/torque-generated/src/builtins/v8_base_without_compiler.array-to-spliced-tq.o1814[834/1875] CXX obj/tools/v8_gypfiles/gen/torque-generated/src/builtins/v8_base_without_compiler.array-unshift-tq.o1815[835/1875] CXX obj/tools/v8_gypfiles/gen/torque-generated/src/builtins/v8_base_without_compiler.array-with-tq.o1816[836/1875] CXX obj/deps/v8/src/execution/arm64/v8_base_without_compiler.simulator-arm64.o1817[837/1875] CXX obj/tools/v8_gypfiles/gen/torque-generated/src/builtins/v8_base_without_compiler.array-tq.o1818[838/1875] CXX obj/tools/v8_gypfiles/gen/torque-generated/src/builtins/v8_base_without_compiler.arraybuffer-tq.o1819[839/1875] CXX obj/tools/v8_gypfiles/gen/torque-generated/src/builtins/v8_base_without_compiler.base-tq.o1820[840/1875] CXX obj/tools/v8_gypfiles/gen/torque-generated/src/builtins/v8_base_without_compiler.boolean-tq.o1821[841/1875] CXX obj/tools/v8_gypfiles/gen/torque-generated/src/builtins/v8_base_without_compiler.builtins-string-tq.o1822[842/1875] CXX obj/tools/v8_gypfiles/gen/torque-generated/src/builtins/v8_base_without_compiler.builtins-bigint-tq.o1823[843/1875] CXX obj/tools/v8_gypfiles/gen/torque-generated/src/builtins/v8_base_without_compiler.cast-tq.o1824[844/1875] CXX obj/tools/v8_gypfiles/gen/torque-generated/src/builtins/v8_base_without_compiler.collections-tq.o1825[845/1875] CXX obj/tools/v8_gypfiles/gen/torque-generated/src/builtins/v8_base_without_compiler.constructor-tq.o1826[846/1875] CXX obj/tools/v8_gypfiles/gen/torque-generated/src/builtins/v8_base_without_compiler.conversion-tq.o1827[847/1875] CXX obj/tools/v8_gypfiles/gen/torque-generated/src/builtins/v8_base_without_compiler.convert-tq.o1828[848/1875] CXX obj/tools/v8_gypfiles/gen/torque-generated/src/builtins/v8_base_without_compiler.console-tq.o1829[849/1875] CXX obj/tools/v8_gypfiles/gen/torque-generated/src/builtins/v8_base_without_compiler.data-view-tq.o1830[850/1875] CXX obj/tools/v8_gypfiles/gen/torque-generated/src/builtins/v8_base_without_compiler.finalization-registry-tq.o1831[851/1875] CXX obj/tools/v8_gypfiles/gen/torque-generated/src/builtins/v8_base_without_compiler.frames-tq.o1832[852/1875] CXX obj/tools/v8_gypfiles/gen/torque-generated/src/builtins/v8_base_without_compiler.frame-arguments-tq.o1833[853/1875] CXX obj/tools/v8_gypfiles/gen/torque-generated/src/builtins/v8_base_without_compiler.function-tq.o1834[854/1875] CXX obj/tools/v8_gypfiles/gen/torque-generated/src/builtins/v8_base_without_compiler.growable-fixed-array-tq.o1835[855/1875] CXX obj/tools/v8_gypfiles/gen/torque-generated/src/builtins/v8_base_without_compiler.ic-callable-tq.o1836[856/1875] CXX obj/tools/v8_gypfiles/gen/torque-generated/src/builtins/v8_base_without_compiler.internal-coverage-tq.o1837[857/1875] CXX obj/tools/v8_gypfiles/gen/torque-generated/src/builtins/v8_base_without_compiler.ic-tq.o1838[858/1875] CXX obj/tools/v8_gypfiles/gen/torque-generated/src/builtins/v8_base_without_compiler.internal-tq.o1839[859/1875] CXX obj/tools/v8_gypfiles/gen/torque-generated/src/builtins/v8_base_without_compiler.iterator-tq.o1840[860/1875] CXX obj/tools/v8_gypfiles/gen/torque-generated/src/builtins/v8_base_without_compiler.iterator-from-tq.o1841[861/1875] CXX obj/tools/v8_gypfiles/gen/torque-generated/src/builtins/v8_base_without_compiler.iterator-helpers-tq.o1842[862/1875] CXX obj/tools/v8_gypfiles/gen/torque-generated/src/builtins/v8_base_without_compiler.map-groupby-tq.o1843[863/1875] CXX obj/tools/v8_gypfiles/gen/torque-generated/src/builtins/v8_base_without_compiler.math-tq.o1844[864/1875] CXX obj/tools/v8_gypfiles/gen/torque-generated/src/builtins/v8_base_without_compiler.number-tq.o1845[865/1875] CXX obj/tools/v8_gypfiles/gen/torque-generated/src/builtins/v8_base_without_compiler.object-fromentries-tq.o1846[866/1875] CXX obj/tools/v8_gypfiles/gen/torque-generated/src/builtins/v8_base_without_compiler.object-groupby-tq.o1847[867/1875] CXX obj/tools/v8_gypfiles/gen/torque-generated/src/builtins/v8_base_without_compiler.object-tq.o1848[868/1875] CXX obj/tools/v8_gypfiles/gen/torque-generated/src/builtins/v8_base_without_compiler.promise-abstract-operations-tq.o1849[869/1875] CXX obj/tools/v8_gypfiles/gen/torque-generated/src/builtins/v8_base_without_compiler.promise-all-tq.o1850[870/1875] CXX obj/tools/v8_gypfiles/gen/torque-generated/src/builtins/v8_base_without_compiler.promise-all-element-closure-tq.o1851[871/1875] CXX obj/tools/v8_gypfiles/gen/torque-generated/src/builtins/v8_base_without_compiler.promise-any-tq.o1852[872/1875] CXX obj/deps/v8/src/execution/arm64/v8_base_without_compiler.frame-constants-arm64.o1853[873/1875] CXX obj/tools/v8_gypfiles/gen/torque-generated/src/builtins/v8_base_without_compiler.promise-constructor-tq.o1854[874/1875] CXX obj/tools/v8_gypfiles/gen/torque-generated/src/builtins/v8_base_without_compiler.promise-finally-tq.o1855[875/1875] CXX obj/tools/v8_gypfiles/gen/torque-generated/src/builtins/v8_base_without_compiler.promise-misc-tq.o1856[876/1875] CXX obj/tools/v8_gypfiles/gen/torque-generated/src/builtins/v8_base_without_compiler.promise-jobs-tq.o1857[877/1875] CXX obj/tools/v8_gypfiles/gen/torque-generated/src/builtins/v8_base_without_compiler.promise-race-tq.o1858[878/1875] CXX obj/tools/v8_gypfiles/gen/torque-generated/src/builtins/v8_base_without_compiler.promise-reaction-job-tq.o1859[879/1875] CXX obj/tools/v8_gypfiles/gen/torque-generated/src/builtins/v8_base_without_compiler.promise-resolve-tq.o1860[880/1875] CXX obj/tools/v8_gypfiles/gen/torque-generated/src/builtins/v8_base_without_compiler.promise-try-tq.o1861[881/1875] CXX obj/tools/v8_gypfiles/gen/torque-generated/src/builtins/v8_base_without_compiler.promise-then-tq.o1862[882/1875] CXX obj/tools/v8_gypfiles/gen/torque-generated/src/builtins/v8_base_without_compiler.promise-withresolvers-tq.o1863[883/1875] CXX obj/tools/v8_gypfiles/gen/torque-generated/src/builtins/v8_base_without_compiler.proxy-constructor-tq.o1864[884/1875] CXX obj/tools/v8_gypfiles/gen/torque-generated/src/builtins/v8_base_without_compiler.proxy-delete-property-tq.o1865[885/1875] CXX obj/tools/v8_gypfiles/gen/torque-generated/src/builtins/v8_base_without_compiler.proxy-get-property-tq.o1866[886/1875] CXX obj/tools/v8_gypfiles/gen/torque-generated/src/builtins/v8_base_without_compiler.proxy-get-prototype-of-tq.o1867[887/1875] CXX obj/tools/v8_gypfiles/gen/torque-generated/src/builtins/v8_base_without_compiler.proxy-has-property-tq.o1868[888/1875] CXX obj/tools/v8_gypfiles/gen/torque-generated/src/builtins/v8_base_without_compiler.proxy-prevent-extensions-tq.o1869[889/1875] CXX obj/tools/v8_gypfiles/gen/torque-generated/src/builtins/v8_base_without_compiler.proxy-is-extensible-tq.o1870[890/1875] CXX obj/tools/v8_gypfiles/gen/torque-generated/src/builtins/v8_base_without_compiler.proxy-revocable-tq.o1871[891/1875] CXX obj/tools/v8_gypfiles/gen/torque-generated/src/builtins/v8_base_without_compiler.proxy-revoke-tq.o1872[892/1875] CXX obj/tools/v8_gypfiles/gen/torque-generated/src/builtins/v8_base_without_compiler.proxy-set-property-tq.o1873[893/1875] CXX obj/tools/v8_gypfiles/gen/torque-generated/src/builtins/v8_base_without_compiler.proxy-tq.o1874[894/1875] CXX obj/tools/v8_gypfiles/gen/torque-generated/src/builtins/v8_base_without_compiler.proxy-set-prototype-of-tq.o1875[895/1875] CXX obj/tools/v8_gypfiles/gen/torque-generated/src/builtins/v8_base_without_compiler.reflect-tq.o1876[896/1875] CXX obj/tools/v8_gypfiles/gen/torque-generated/src/builtins/v8_base_without_compiler.regexp-exec-tq.o1877[897/1875] CXX obj/tools/v8_gypfiles/gen/torque-generated/src/builtins/v8_base_without_compiler.regexp-match-all-tq.o1878[898/1875] CXX obj/tools/v8_gypfiles/gen/torque-generated/src/builtins/v8_base_without_compiler.regexp-match-tq.o1879[899/1875] CXX obj/tools/v8_gypfiles/gen/torque-generated/src/builtins/v8_base_without_compiler.regexp-replace-tq.o1880[900/1875] CXX obj/tools/v8_gypfiles/gen/torque-generated/src/builtins/v8_base_without_compiler.regexp-search-tq.o1881[901/1875] CXX obj/tools/v8_gypfiles/gen/torque-generated/src/builtins/v8_base_without_compiler.regexp-source-tq.o1882[902/1875] CXX obj/tools/v8_gypfiles/gen/torque-generated/src/builtins/v8_base_without_compiler.regexp-split-tq.o1883[903/1875] CXX obj/tools/v8_gypfiles/gen/torque-generated/src/builtins/v8_base_without_compiler.regexp-test-tq.o1884[904/1875] CXX obj/tools/v8_gypfiles/gen/torque-generated/src/builtins/v8_base_without_compiler.regexp-tq.o1885[905/1875] CXX obj/tools/v8_gypfiles/gen/torque-generated/src/builtins/v8_base_without_compiler.set-difference-tq.o1886[906/1875] CXX obj/tools/v8_gypfiles/gen/torque-generated/src/builtins/v8_base_without_compiler.set-intersection-tq.o1887[907/1875] CXX obj/tools/v8_gypfiles/gen/torque-generated/src/builtins/v8_base_without_compiler.set-is-disjoint-from-tq.o1888[908/1875] CXX obj/tools/v8_gypfiles/gen/torque-generated/src/builtins/v8_base_without_compiler.set-is-subset-of-tq.o1889[909/1875] CXX obj/tools/v8_gypfiles/gen/torque-generated/src/builtins/v8_base_without_compiler.set-is-superset-of-tq.o1890[910/1875] CXX obj/tools/v8_gypfiles/gen/torque-generated/src/builtins/v8_base_without_compiler.set-symmetric-difference-tq.o1891[911/1875] CXX obj/tools/v8_gypfiles/gen/torque-generated/src/builtins/v8_base_without_compiler.set-union-tq.o1892[912/1875] CXX obj/tools/v8_gypfiles/gen/torque-generated/src/builtins/v8_base_without_compiler.string-at-tq.o1893[913/1875] CXX obj/tools/v8_gypfiles/gen/torque-generated/src/builtins/v8_base_without_compiler.string-endswith-tq.o1894[914/1875] CXX obj/tools/v8_gypfiles/gen/torque-generated/src/builtins/v8_base_without_compiler.string-html-tq.o1895[915/1875] CXX obj/tools/v8_gypfiles/gen/torque-generated/src/builtins/v8_base_without_compiler.string-includes-tq.o1896[916/1875] CXX obj/tools/v8_gypfiles/gen/torque-generated/src/builtins/v8_base_without_compiler.string-indexof-tq.o1897[917/1875] CXX obj/tools/v8_gypfiles/gen/torque-generated/src/builtins/v8_base_without_compiler.string-iswellformed-tq.o1898[918/1875] CXX obj/tools/v8_gypfiles/gen/torque-generated/src/builtins/v8_base_without_compiler.string-iterator-tq.o1899[919/1875] CXX obj/tools/v8_gypfiles/gen/torque-generated/src/builtins/v8_base_without_compiler.string-match-search-tq.o1900[920/1875] CXX obj/tools/v8_gypfiles/gen/torque-generated/src/builtins/v8_base_without_compiler.string-pad-tq.o1901[921/1875] CXX obj/tools/v8_gypfiles/gen/torque-generated/src/builtins/v8_base_without_compiler.string-repeat-tq.o1902[922/1875] CXX obj/tools/v8_gypfiles/gen/torque-generated/src/builtins/v8_base_without_compiler.string-replaceall-tq.o1903[923/1875] CXX obj/tools/v8_gypfiles/gen/torque-generated/src/builtins/v8_base_without_compiler.string-slice-tq.o1904[924/1875] CXX obj/tools/v8_gypfiles/gen/torque-generated/src/builtins/v8_base_without_compiler.string-startswith-tq.o1905[925/1875] CXX obj/tools/v8_gypfiles/gen/torque-generated/src/builtins/v8_base_without_compiler.string-substr-tq.o1906[926/1875] CXX obj/tools/v8_gypfiles/gen/torque-generated/src/builtins/v8_base_without_compiler.string-substring-tq.o1907[927/1875] CXX obj/tools/v8_gypfiles/gen/torque-generated/src/builtins/v8_base_without_compiler.string-towellformed-tq.o1908[928/1875] CXX obj/tools/v8_gypfiles/gen/torque-generated/src/builtins/v8_base_without_compiler.string-trim-tq.o1909[929/1875] CXX obj/tools/v8_gypfiles/gen/torque-generated/src/builtins/v8_base_without_compiler.suppressed-error-tq.o1910[930/1875] CXX obj/tools/v8_gypfiles/gen/torque-generated/src/builtins/v8_base_without_compiler.symbol-tq.o1911[931/1875] CXX obj/tools/v8_gypfiles/gen/torque-generated/src/builtins/v8_base_without_compiler.torque-internal-tq.o1912[932/1875] CXX obj/tools/v8_gypfiles/gen/torque-generated/src/builtins/v8_base_without_compiler.typed-array-at-tq.o1913[933/1875] CXX obj/tools/v8_gypfiles/gen/torque-generated/src/builtins/v8_base_without_compiler.typed-array-createtypedarray-tq.o1914[934/1875] CXX obj/tools/v8_gypfiles/gen/torque-generated/src/builtins/v8_base_without_compiler.typed-array-every-tq.o1915[935/1875] CXX obj/tools/v8_gypfiles/gen/torque-generated/src/builtins/v8_base_without_compiler.typed-array-entries-tq.o1916[936/1875] CXX obj/tools/v8_gypfiles/gen/torque-generated/src/builtins/v8_base_without_compiler.typed-array-filter-tq.o1917[937/1875] CXX obj/tools/v8_gypfiles/gen/torque-generated/src/builtins/v8_base_without_compiler.typed-array-find-tq.o1918[938/1875] CXX obj/tools/v8_gypfiles/gen/torque-generated/src/builtins/v8_base_without_compiler.typed-array-findindex-tq.o1919[939/1875] CXX obj/tools/v8_gypfiles/gen/torque-generated/src/builtins/v8_base_without_compiler.typed-array-findlast-tq.o1920[940/1875] CXX obj/tools/v8_gypfiles/gen/torque-generated/src/builtins/v8_base_without_compiler.typed-array-findlastindex-tq.o1921[941/1875] CXX obj/tools/v8_gypfiles/gen/torque-generated/src/builtins/v8_base_without_compiler.typed-array-foreach-tq.o1922[942/1875] CXX obj/tools/v8_gypfiles/gen/torque-generated/src/builtins/v8_base_without_compiler.typed-array-from-tq.o1923[943/1875] CXX obj/tools/v8_gypfiles/gen/torque-generated/src/builtins/v8_base_without_compiler.typed-array-keys-tq.o1924[944/1875] CXX obj/tools/v8_gypfiles/gen/torque-generated/src/builtins/v8_base_without_compiler.typed-array-of-tq.o1925[945/1875] CXX obj/tools/v8_gypfiles/gen/torque-generated/src/builtins/v8_base_without_compiler.typed-array-reduce-tq.o1926[946/1875] CXX obj/tools/v8_gypfiles/gen/torque-generated/src/builtins/v8_base_without_compiler.typed-array-reduceright-tq.o1927[947/1875] CXX obj/tools/v8_gypfiles/gen/torque-generated/src/builtins/v8_base_without_compiler.typed-array-set-tq.o1928[948/1875] CXX obj/tools/v8_gypfiles/gen/torque-generated/src/builtins/v8_base_without_compiler.typed-array-slice-tq.o1929[949/1875] CXX obj/tools/v8_gypfiles/gen/torque-generated/src/builtins/v8_base_without_compiler.typed-array-some-tq.o1930[950/1875] CXX obj/tools/v8_gypfiles/gen/torque-generated/src/builtins/v8_base_without_compiler.typed-array-sort-tq.o1931[951/1875] CXX obj/tools/v8_gypfiles/gen/torque-generated/src/builtins/v8_base_without_compiler.typed-array-subarray-tq.o1932[952/1875] CXX obj/tools/v8_gypfiles/gen/torque-generated/src/builtins/v8_base_without_compiler.typed-array-to-reversed-tq.o1933[953/1875] CXX obj/tools/v8_gypfiles/gen/torque-generated/src/builtins/v8_base_without_compiler.typed-array-to-sorted-tq.o1934[954/1875] CXX obj/tools/v8_gypfiles/gen/torque-generated/src/builtins/v8_base_without_compiler.typed-array-values-tq.o1935[955/1875] CXX obj/tools/v8_gypfiles/gen/torque-generated/src/builtins/v8_base_without_compiler.typed-array-with-tq.o1936[956/1875] CXX obj/tools/v8_gypfiles/gen/torque-generated/src/builtins/v8_base_without_compiler.weak-ref-tq.o1937[957/1875] CXX obj/tools/v8_gypfiles/gen/torque-generated/src/builtins/v8_base_without_compiler.typed-array-tq.o1938[958/1875] CXX obj/tools/v8_gypfiles/gen/torque-generated/src/ic/v8_base_without_compiler.handler-configuration-tq.o1939[959/1875] CXX obj/tools/v8_gypfiles/gen/torque-generated/src/objects/v8_base_without_compiler.bigint-tq.o1940[960/1875] CXX obj/deps/v8/src/codegen/arm64/v8_base_without_compiler.macro-assembler-arm64.o1941[961/1875] CXX obj/tools/v8_gypfiles/gen/torque-generated/src/objects/v8_base_without_compiler.allocation-site-tq.o1942[962/1875] CXX obj/tools/v8_gypfiles/gen/torque-generated/src/objects/v8_base_without_compiler.call-site-info-tq.o1943[963/1875] CXX obj/tools/v8_gypfiles/gen/torque-generated/src/objects/v8_base_without_compiler.bytecode-array-tq.o1944[964/1875] CXX obj/deps/v8/src/regexp/arm64/v8_base_without_compiler.regexp-macro-assembler-arm64.o1945[965/1875] CXX obj/tools/v8_gypfiles/gen/torque-generated/src/objects/v8_base_without_compiler.data-handler-tq.o1946[966/1875] CXX obj/tools/v8_gypfiles/gen/torque-generated/src/objects/v8_base_without_compiler.arguments-tq.o1947[967/1875] CXX obj/tools/v8_gypfiles/gen/torque-generated/src/objects/v8_base_without_compiler.api-callbacks-tq.o1948[968/1875] CXX obj/tools/v8_gypfiles/gen/torque-generated/v8_base_without_compiler.factory.o1949[969/1875] CXX obj/tools/v8_gypfiles/gen/torque-generated/src/objects/v8_base_without_compiler.cell-tq.o1950[970/1875] CXX obj/tools/v8_gypfiles/gen/torque-generated/v8_base_without_compiler.objects-printer.o1951[971/1875] CXX obj/tools/v8_gypfiles/gen/torque-generated/src/objects/v8_base_without_compiler.contexts-tq.o1952[972/1875] CXX obj/tools/v8_gypfiles/gen/torque-generated/src/objects/v8_base_without_compiler.cpp-heap-external-object-tq.o1953[973/1875] CXX obj/tools/v8_gypfiles/gen/torque-generated/src/objects/v8_base_without_compiler.free-space-tq.o1954[974/1875] CXX obj/tools/v8_gypfiles/gen/torque-generated/src/objects/v8_base_without_compiler.heap-number-tq.o1955[975/1875] CXX obj/tools/v8_gypfiles/gen/torque-generated/src/objects/v8_base_without_compiler.heap-object-tq.o1956[976/1875] CXX obj/tools/v8_gypfiles/gen/torque-generated/src/objects/v8_base_without_compiler.debug-objects-tq.o1957[977/1875] CXX obj/tools/v8_gypfiles/gen/torque-generated/src/objects/v8_base_without_compiler.embedder-data-array-tq.o1958[978/1875] CXX obj/tools/v8_gypfiles/gen/torque-generated/src/objects/v8_base_without_compiler.descriptor-array-tq.o1959[979/1875] CXX obj/tools/v8_gypfiles/gen/torque-generated/src/objects/v8_base_without_compiler.feedback-cell-tq.o1960[980/1875] CXX obj/tools/v8_gypfiles/gen/torque-generated/src/objects/v8_base_without_compiler.feedback-vector-tq.o1961[981/1875] CXX obj/tools/v8_gypfiles/gen/torque-generated/src/objects/v8_base_without_compiler.fixed-array-tq.o1962[982/1875] CXX obj/tools/v8_gypfiles/gen/torque-generated/src/objects/v8_base_without_compiler.foreign-tq.o1963[983/1875] CXX obj/tools/v8_gypfiles/gen/torque-generated/src/objects/v8_base_without_compiler.js-array-buffer-tq.o1964[984/1875] CXX obj/tools/v8_gypfiles/gen/torque-generated/src/objects/v8_base_without_compiler.js-array-tq.o1965[985/1875] CXX obj/tools/v8_gypfiles/gen/torque-generated/src/objects/v8_base_without_compiler.js-collection-iterator-tq.o1966[986/1875] CXX obj/tools/v8_gypfiles/gen/torque-generated/src/objects/v8_base_without_compiler.js-atomics-synchronization-tq.o1967[987/1875] CXX obj/tools/v8_gypfiles/gen/torque-generated/src/objects/v8_base_without_compiler.js-collection-tq.o1968[988/1875] CXX obj/tools/v8_gypfiles/gen/torque-generated/src/objects/v8_base_without_compiler.js-disposable-stack-tq.o1969[989/1875] CXX obj/tools/v8_gypfiles/gen/torque-generated/src/objects/v8_base_without_compiler.js-function-tq.o1970[990/1875] CXX obj/tools/v8_gypfiles/gen/torque-generated/src/objects/v8_base_without_compiler.js-generator-tq.o1971[991/1875] CXX obj/tools/v8_gypfiles/gen/torque-generated/src/objects/v8_base_without_compiler.js-iterator-helpers-tq.o1972[992/1875] CXX obj/tools/v8_gypfiles/gen/torque-generated/src/objects/v8_base_without_compiler.js-objects-tq.o1973[993/1875] CXX obj/tools/v8_gypfiles/gen/torque-generated/src/objects/v8_base_without_compiler.js-proxy-tq.o1974[994/1875] CXX obj/tools/v8_gypfiles/gen/torque-generated/src/objects/v8_base_without_compiler.js-promise-tq.o1975[995/1875] CXX obj/tools/v8_gypfiles/gen/torque-generated/src/objects/v8_base_without_compiler.js-raw-json-tq.o1976[996/1875] CXX obj/tools/v8_gypfiles/gen/torque-generated/src/objects/v8_base_without_compiler.js-regexp-string-iterator-tq.o1977[997/1875] CXX obj/tools/v8_gypfiles/gen/torque-generated/src/objects/v8_base_without_compiler.js-regexp-tq.o1978[998/1875] CXX obj/tools/v8_gypfiles/gen/torque-generated/src/objects/v8_base_without_compiler.js-shadow-realm-tq.o1979[999/1875] CXX obj/tools/v8_gypfiles/gen/torque-generated/src/objects/v8_base_without_compiler.microtask-tq.o1980[1000/1875] CXX obj/tools/v8_gypfiles/gen/torque-generated/src/objects/v8_base_without_compiler.js-shared-array-tq.o1981[1001/1875] CXX obj/tools/v8_gypfiles/gen/torque-generated/src/objects/v8_base_without_compiler.name-tq.o1982[1002/1875] CXX obj/tools/v8_gypfiles/gen/torque-generated/src/objects/v8_base_without_compiler.hole-tq.o1983[1003/1875] CXX obj/tools/v8_gypfiles/gen/torque-generated/src/objects/v8_base_without_compiler.oddball-tq.o1984[1004/1875] CXX obj/tools/v8_gypfiles/gen/torque-generated/src/objects/v8_base_without_compiler.ordered-hash-table-tq.o1985[1005/1875] CXX obj/tools/v8_gypfiles/gen/torque-generated/src/objects/v8_base_without_compiler.trusted-object-tq.o1986[1006/1875] CXX obj/tools/v8_gypfiles/gen/torque-generated/src/objects/v8_base_without_compiler.js-struct-tq.o1987[1007/1875] CXX obj/tools/v8_gypfiles/gen/torque-generated/src/objects/v8_base_without_compiler.js-weak-refs-tq.o1988[1008/1875] CXX obj/tools/v8_gypfiles/gen/torque-generated/src/objects/v8_base_without_compiler.literal-objects-tq.o1989[1009/1875] CXX obj/tools/v8_gypfiles/gen/torque-generated/src/objects/v8_base_without_compiler.map-tq.o1990[1010/1875] CXX obj/tools/v8_gypfiles/gen/torque-generated/src/objects/v8_base_without_compiler.primitive-heap-object-tq.o1991[1011/1875] CXX obj/tools/v8_gypfiles/gen/torque-generated/src/objects/v8_base_without_compiler.megadom-handler-tq.o1992[1012/1875] CXX obj/tools/v8_gypfiles/gen/torque-generated/src/objects/v8_base_without_compiler.promise-tq.o1993[1013/1875] CXX obj/tools/v8_gypfiles/gen/torque-generated/src/objects/v8_base_without_compiler.property-descriptor-object-tq.o1994[1014/1875] CXX obj/tools/v8_gypfiles/gen/torque-generated/src/objects/v8_base_without_compiler.regexp-match-info-tq.o1995[1015/1875] CXX obj/tools/v8_gypfiles/gen/torque-generated/src/objects/v8_base_without_compiler.module-tq.o1996[1016/1875] CXX obj/tools/v8_gypfiles/gen/torque-generated/src/objects/v8_base_without_compiler.string-tq.o1997[1017/1875] CXX obj/tools/v8_gypfiles/gen/torque-generated/src/objects/v8_base_without_compiler.property-array-tq.o1998[1018/1875] CXX obj/tools/v8_gypfiles/gen/torque-generated/src/objects/v8_base_without_compiler.swiss-hash-table-helpers-tq.o1999[1019/1875] CXX obj/tools/v8_gypfiles/gen/torque-generated/src/objects/v8_base_without_compiler.swiss-name-dictionary-tq.o2000[1020/1875] CXX obj/tools/v8_gypfiles/gen/torque-generated/src/objects/v8_base_without_compiler.property-cell-tq.o26814ok 5018 parallel/test-webstreams-adapters-sync-write-error26815 ---26816 duration_ms: 202.6990026817 ...26818ok 5019 parallel/test-webstreams-adapters-writable-buffer-sources26819 ---26820 duration_ms: 221.1340026821 ...26822ok 5020 parallel/test-webstreams-clone-unref26823 ---26824 duration_ms: 231.3760026825 ...26826ok 5021 parallel/test-webstreams-compose26827 ---26828 duration_ms: 239.4600026829 ...26830ok 5022 parallel/test-webstreams-compression-buffer-source26831 ---26832 duration_ms: 248.8070026833 ...26834ok 5023 parallel/test-webstreams-compression-bad-chunks26835 ---26836 duration_ms: 356.2360026837 ...26838ok 5024 parallel/test-webcrypto-sign-verify-rsa26839 ---26840 duration_ms: 1615.9500026841 ...26842ok 5025 parallel/test-webstreams-duplex-fromweb-writev-unhandled-rejection26843 ---26844 duration_ms: 185.6090026845 ...26846ok 5026 parallel/test-webstreams-decompression-reject-trailing26847 ---26848 duration_ms: 277.6520026849 ...26850ok 5027 parallel/test-webstreams-finished26851 ---26852 duration_ms: 194.3490026853 ...26854ok 5028 parallel/test-webstreams-pipeto-write-request26855 ---26856 duration_ms: 225.0280026857 ...26858ok 5029 parallel/test-webstreams-pipeline26859 ---26860 duration_ms: 284.6960026861 ...26862ok 5030 parallel/test-webstreams-queue-wraparound26863 ---26864 duration_ms: 265.3740026865 ...26866ok 5031 parallel/test-whatwg-encoding-custom-api-basics26867 ---26868 duration_ms: 150.8100026869 ...26870ok 5032 parallel/test-webworker-ref-unref26871 ---26872 duration_ms: 295.6500026873 ...26874ok 5033 parallel/test-whatwg-encoding-custom-fatal-streaming26875 ---26876 duration_ms: 198.4790026877 ...26878ok 5034 parallel/test-whatwg-encoding-custom-internals26879 ---26880 duration_ms: 152.4880026881 ...26882ok 5035 parallel/test-whatwg-encoding-custom-interop26883 ---26884 duration_ms: 155.6310026885 ...26886ok 5036 parallel/test-whatwg-encoding-custom-textdecoder26887 ---26888 duration_ms: 190.1000026889 ...26890ok 5037 parallel/test-whatwg-encoding-custom-textdecoder-ignorebom26891 ---26892 duration_ms: 151.1960026893 ...26894ok 5038 parallel/test-whatwg-encoding-custom-textdecoder-api-invalid-label26895 ---26896 duration_ms: 183.3820026897 ...26898ok 5039 parallel/test-whatwg-encoding-custom-textdecoder-fatal26899 ---26900 duration_ms: 184.8580026901 ...26902ok 5040 parallel/test-whatwg-encoding-custom-textdecoder-invalid-arg26903 ---26904 duration_ms: 158.5050026905 ...26906ok 5041 parallel/test-whatwg-encoding-custom-textdecoder-streaming26907 ---26908 duration_ms: 151.1740026909 ...26910ok 5042 parallel/test-whatwg-encoding-custom-textdecoder-utf16-surrogates26911 ---26912 duration_ms: 181.1860026913 ...26914ok 5043 parallel/test-whatwg-events-add-event-listener-options-passive26915 ---26916 duration_ms: 160.6070026917 ...26918ok 5044 parallel/test-whatwg-events-add-event-listener-options-signal26919 ---26920 duration_ms: 191.4190026921 ...26922ok 5045 parallel/test-whatwg-events-customevent26923 ---26924 duration_ms: 157.1970026925 ...26926ok 5046 parallel/test-webstorage26927 ---26928 duration_ms: 1887.6680026929 ...26930ok 5047 parallel/test-whatwg-encoding-singlebyte26931 ---26932 duration_ms: 343.5700026933 ...26934ok 5048 parallel/test-whatwg-events-event-constructors26935 ---26936 duration_ms: 179.2620026937 ...26938ok 5049 parallel/test-whatwg-events-eventtarget-this-of-listener26939 ---26940 duration_ms: 181.4770026941 ...26942ok 5050 parallel/test-whatwg-headers26943 ---26944 duration_ms: 200.7310026945 ...26946ok 5051 parallel/test-whatwg-readablebytestream26947 ---26948 duration_ms: 233.1290026949 ...26950ok 5052 parallel/test-whatwg-readablebytestream-bad-buffers-and-views26951 ---26952 duration_ms: 190.4610026953 ...26954ok 5053 parallel/test-whatwg-readablestream26955 ---26956 duration_ms: 186.6090026957 ...26958ok 5054 parallel/test-whatwg-readablebytestreambyob26959 ---26960 duration_ms: 204.2390026961 ...26962ok 5055 parallel/test-whatwg-readablestream-byob-read-min26963 ---26964 duration_ms: 183.3100026965 ...26966ok 5056 parallel/test-whatwg-transformstream26967 ---26968 duration_ms: 180.5170026969 ...26970ok 5057 parallel/test-whatwg-readablestream26971 ---26972 duration_ms: 283.0370026973 ...26974ok 5058 parallel/test-whatwg-transformstream-cancel-write-race26975 ---26976 duration_ms: 234.4190026977 ...26978ok 5059 parallel/test-whatwg-url-canparse26979 ---26980 duration_ms: 197.0960026981 ...26982ok 5060 parallel/test-whatwg-url-custom-deepequal26983 ---26984 duration_ms: 202.5910026985 ...26986ok 5061 parallel/test-whatwg-url-custom-global26987 ---26988 duration_ms: 181.1670026989 ...26990ok 5062 parallel/test-whatwg-url-custom-href-side-effect26991 ---26992 duration_ms: 176.8440026993 ...26994ok 5063 parallel/test-whatwg-url-custom-inspect26995 ---26996 duration_ms: 176.7230026997 ...26998ok 5064 parallel/test-whatwg-url-custom-properties26999 ---27000 duration_ms: 185.6820027001 ...27002ok 5065 parallel/test-whatwg-url-custom-searchparams27003 ---27004 duration_ms: 183.8040027005 ...27006ok 5066 parallel/test-whatwg-url-custom-parsing27007 ---27008 duration_ms: 225.2450027009 ...27010ok 5067 parallel/test-whatwg-url-custom-searchparams-append27011 ---27012 duration_ms: 187.0330027013 ...27014ok 5068 parallel/test-whatwg-url-custom-searchparams-constructor27015 ---27016 duration_ms: 188.2610027017 ...27018ok 5069 parallel/test-whatwg-url-custom-searchparams-delete27019 ---27020 duration_ms: 183.6230027021 ...27022ok 5070 parallel/test-webcrypto-wrap-unwrap27023 ---27024 duration_ms: 3005.5120027025 ...27026ok 5071 parallel/test-whatwg-url-custom-searchparams-entries27027 ---27028 duration_ms: 179.6780027029 ...27030ok 5072 parallel/test-whatwg-url-custom-searchparams-foreach27031 ---27032 duration_ms: 176.5630027033 ...27034ok 5073 parallel/test-whatwg-url-custom-searchparams-get27035 ---27036 duration_ms: 175.3970027037 ...27038ok 5074 parallel/test-whatwg-url-custom-searchparams-getall27039 ---27040 duration_ms: 172.8230027041 ...27042ok 5075 parallel/test-whatwg-url-custom-searchparams-has27043 ---27044 duration_ms: 151.2370027045 ...27046ok 5076 parallel/test-whatwg-url-custom-searchparams-inspect27047 ---27048 duration_ms: 179.9370027049 ...27050ok 5077 parallel/test-whatwg-url-custom-searchparams-keys27051 ---27052 duration_ms: 172.5270027053 ...27054ok 5078 parallel/test-whatwg-url-custom-searchparams-sort27055 ---27056 duration_ms: 178.2910027057 ...27058ok 5079 parallel/test-whatwg-url-custom-searchparams-set27059 ---27060 duration_ms: 179.4720027061 ...27062ok 5080 parallel/test-whatwg-url-custom-searchparams-stringifier27063 ---27064 duration_ms: 191.7510027065 ...27066ok 5081 parallel/test-whatwg-url-custom-searchparams-values27067 ---27068 duration_ms: 182.7720027069 ...27070ok 5082 parallel/test-whatwg-url-custom-setters27071 ---27072 duration_ms: 188.8820027073 ...27074ok 5083 parallel/test-whatwg-url-custom-tostringtag27075 ---27076 duration_ms: 161.7230027077 ...27078ok 5084 parallel/test-whatwg-url-invalidthis27079 ---27080 duration_ms: 177.1980027081 ...27082ok 5085 parallel/test-whatwg-url-parse-fast-path27083 ---27084 duration_ms: 178.4730027085 ...27086ok 5086 parallel/test-whatwg-url-override-hostname27087 ---27088 duration_ms: 179.5480027089 ...27090ok 5087 parallel/test-whatwg-url-properties27091 ---27092 duration_ms: 186.1920027093 ...27094ok 5088 parallel/test-whatwg-url-searchparams-fast-path27095 ---27096 duration_ms: 164.4410027097 ...27098ok 5089 parallel/test-whatwg-webstreams-adapters-to-readablestream27099 ---27100 duration_ms: 176.2080027101 ...27102ok 5090 parallel/test-whatwg-webstreams-adapters-streambase27103 ---27104 duration_ms: 179.7440027105 ...27106ok 5091 parallel/test-whatwg-webstreams-adapters-to-readablewritablepair27107 ---27108 duration_ms: 221.0790027109 ...27110ok 5092 parallel/test-whatwg-webstreams-adapters-to-streamwritable27111 ---27112 duration_ms: 185.2630027113 ...27114ok 5093 parallel/test-whatwg-webstreams-adapters-to-streamduplex27115 ---27116 duration_ms: 220.0030027117 ...27118ok 5094 parallel/test-whatwg-webstreams-adapters-to-streamreadable27119 ---27120 duration_ms: 223.8760027121 ...27122ok 5095 parallel/test-whatwg-webstreams-coverage27123 ---27124 duration_ms: 192.4880027125 ...27126ok 5096 parallel/test-whatwg-webstreams-adapters-to-writablestream27127 ---27128 duration_ms: 226.0950027129 ...27130ok 5097 parallel/test-whatwg-webstreams-compression27131 ---27132 duration_ms: 226.0930027133 ...27134ok 5098 parallel/test-whatwg-webstreams-encoding27135 ---27136 duration_ms: 185.9790027137 ...27138ok 5099 parallel/test-whatwg-webstreams-transform-stream-members27139 ---27140 duration_ms: 185.6050027141 ...27142ok 5100 parallel/test-whatwg-writablestream27143 ---27144 duration_ms: 184.9390027145 ...27146ok 5101 parallel/test-windows-abort-exitcode # skip test is windows specific27147 ---27148 duration_ms: 156.7020027149 ...27150ok 5102 parallel/test-windows-failed-heap-allocation # skip Windows-only27151 ---27152 duration_ms: 175.9850027153 ...27154ok 5103 parallel/test-whatwg-writablestream-close27155 ---27156 duration_ms: 227.9730027157 ...27158ok 5104 parallel/test-whatwg-webstreams-transfer27159 ---27160 duration_ms: 337.9680027161 ...27162ok 5105 parallel/test-worker27163 ---27164 duration_ms: 272.1680027165 ...27166ok 5106 parallel/test-worker27167 ---27168 duration_ms: 266.7390027169 ...27170ok 5107 parallel/test-worker-abort-on-uncaught-exception27171 ---27172 duration_ms: 269.6900027173 ...27174ok 5108 parallel/test-worker-abort-on-uncaught-exception-terminate27175 ---27176 duration_ms: 271.6730027177 ...27178ok 5109 parallel/test-worker-beforeexit-throw-exit27179 ---27180 duration_ms: 223.2290027181 ...27182ok 5110 parallel/test-worker-broadcastchannel-wpt27183 ---27184 duration_ms: 237.2940027185 ...27186ok 5111 parallel/test-worker-cjs-workerdata27187 ---27188 duration_ms: 243.1190027189 ...27190ok 5112 parallel/test-worker-broadcastchannel27191 ---27192 duration_ms: 375.3040027193 ...27194ok 5113 parallel/test-worker-cleanup-handles27195 ---27196 duration_ms: 269.2520027197 ...27198ok 5114 parallel/test-worker-arraybuffer-zerofill27199 ---27200 duration_ms: 524.9480027201 ...27202ok 5115 parallel/test-worker-cleanexit-with-js27203 ---27204 duration_ms: 447.5470027205 ...27206ok 5116 parallel/test-worker-cleanexit-with-moduleload27207 ---27208 duration_ms: 544.9990027209 ...27210ok 5117 parallel/test-worker-cpu-usage27211 ---27212 duration_ms: 271.5070027213 ...27214ok 5118 parallel/test-worker-crypto-sign-transfer-result27215 ---27216 duration_ms: 275.6670027217 ...27218ok 5119 parallel/test-worker-cpu-profile27219 ---27220 duration_ms: 360.6450027221 ...27222ok 5120 parallel/test-worker-console-listeners27223 ---27224 duration_ms: 456.1140027225 ...27226ok 5121 parallel/test-worker-cwd-race-condition27227 ---27228 duration_ms: 257.1350027229 ...27230ok 5122 parallel/test-worker-cli-options27231 ---27232 duration_ms: 563.7280027233 ...27234ok 5123 parallel/test-worker-dispose27235 ---27236 duration_ms: 217.6820027237 ...27238ok 5124 parallel/test-worker-dns-terminate27239 ---27240 duration_ms: 222.3860027241 ...27242ok 5125 parallel/test-worker-data-url27243 ---27244 duration_ms: 338.6170027245 ...27246ok 5126 parallel/test-worker-dns-terminate-during-query27247 ---27248 duration_ms: 292.3850027249 ...27250ok 5127 parallel/test-worker-error-stack-getter-throws27251 ---27252 duration_ms: 227.2310027253 ...27254ok 5128 parallel/test-worker-esm-exit27255 ---27256 duration_ms: 251.1130027257 ...27258ok 5129 parallel/test-worker-error-primitive27259 ---27260 duration_ms: 344.2780027261 ...27262ok 5130 parallel/test-worker-esm-missing-main27263 ---27264 duration_ms: 261.8100027265 ...27266ok 5131 parallel/test-worker-environmentdata27267 ---27268 duration_ms: 454.2540027269 ...27270ok 5132 parallel/test-worker-debug27271 ---27272 duration_ms: 619.3450027273 ...27274ok 5133 parallel/test-worker-esmodule27275 ---27276 duration_ms: 217.6610027277 ...27278ok 5134 parallel/test-worker-event27279 ---27280 duration_ms: 219.8580027281 ...27282ok 5135 parallel/test-worker-execargv-invalid27283 ---27284 duration_ms: 189.3010027285 ...27286ok 5136 parallel/test-worker-execargv27287 ---27288 duration_ms: 282.2380027289 ...27290ok 5137 parallel/test-worker-exit-event-error27291 ---27292 duration_ms: 244.4210027293 ...27294ok 5138 parallel/test-worker-exit-from-uncaught-exception27295 ---27296 duration_ms: 250.7390027297 ...27298ok 5139 parallel/test-worker-fs-stat-watcher27299 ---27300 duration_ms: 239.4670027301 ...27302ok 5140 parallel/test-worker-exit-code27303 ---27304 duration_ms: 432.7290027305 ...27306ok 5141 parallel/test-worker-hasref27307 ---27308 duration_ms: 259.7770027309 ...27310ok 5142 parallel/test-worker-heap-profile27311 ---27312 duration_ms: 291.8340027313 ...27314ok 5143 parallel/test-worker-heap-statistics27315 ---27316 duration_ms: 227.3380027317 ...27318ok 5144 parallel/test-worker-heapdump-failure27319 ---27320 duration_ms: 226.8930027321 ...27322ok 5145 parallel/test-worker-eval-typescript27323 ---27324 duration_ms: 831.2270027325 ...27326ok 5146 parallel/test-worker-exit-heapsnapshot27327 ---27328 duration_ms: 668.6940027329 ...27330ok 5147 parallel/test-webcrypto-sign-verify27331 ---27332 duration_ms: 7523.4530027333 ...27334ok 5148 parallel/test-worker-http2-generic-streams-terminate27335 ---27336 duration_ms: 989.5050027337 ...27338ok 5149 parallel/test-worker-invalid-workerdata27339 ---27340 duration_ms: 807.1280027341 ...27342ok 5150 parallel/test-worker-internal-modules27343 ---27344 duration_ms: 870.5610027345 ...27346ok 5151 parallel/test-worker-http2-stream-terminate27347 ---27348 duration_ms: 986.0100027349 ...27350ok 5152 parallel/test-worker-heap-snapshot27351 ---27352 duration_ms: 1302.6720027353 ...27354ok 5153 parallel/test-worker-message-event27355 ---27356 duration_ms: 286.9730027357 ...27358ok 5154 parallel/test-worker-load-file-with-extension-other-than-js27359 ---27360 duration_ms: 348.3480027361 ...27362ok 5155 parallel/test-worker-message-channel27363 ---27364 duration_ms: 348.3110027365 ...27366ok 5156 parallel/test-worker-message-mark-as-uncloneable27367 ---27368 duration_ms: 305.4680027369 ...27370ok 5157 parallel/test-worker-message-channel-sharedarraybuffer27371 ---27372 duration_ms: 354.2190027373 ...27374ok 5158 parallel/test-worker-message-not-serializable27375 ---27376 duration_ms: 402.2900027377 ...27378ok 5159 parallel/test-worker-message-port-arraybuffer27379 ---27380 duration_ms: 247.0560027381 ...27382ok 5160 parallel/test-worker-message-port-close-while-receiving27383 ---27384 duration_ms: 239.4270027385 ...27386ok 5161 parallel/test-worker-message-port-constructor27387 ---27388 duration_ms: 285.4900027389 ...27390ok 5162 parallel/test-worker-message-port27391 ---27392 duration_ms: 340.1880027393 ...27394ok 5163 parallel/test-worker-message-port-close27395 ---27396 duration_ms: 326.4270027397 ...27398ok 5164 parallel/test-worker-message-port-inspect-during-init-hook27399 ---27400 duration_ms: 227.3060027401 ...27402ok 5165 parallel/test-worker-message-port-drain27403 ---27404 duration_ms: 335.6710027405 ...27406ok 5166 parallel/test-worker-message-port-infinite-message-loop27407 ---27408 duration_ms: 252.5460027409 ...27410ok 5167 parallel/test-worker-message-port-jstransferable-nested-untransferable27411 ---27412 duration_ms: 241.6850027413 ...27414ok 5168 parallel/test-worker-message-port-message-port-transferring27415 ---27416 duration_ms: 248.3220027417 ...27418ok 5169 parallel/test-worker-memory27419 ---27420 duration_ms: 936.6170027421 ...27422ok 5170 parallel/test-worker-message-port-receive-message27423 ---27424 duration_ms: 157.7580027425 ...27426ok 5171 parallel/test-worker-message-port-multiple-sharedarraybuffers27427 ---27428 duration_ms: 166.4890027429 ...27430ok 5172 parallel/test-worker-message-port-move27431 ---27432 duration_ms: 239.7280027433 ...27434ok 5173 parallel/test-worker-message-port-transfer-duplicate27435 ---27436 duration_ms: 176.6020027437 ...27438ok 5174 parallel/test-worker-message-port-transfer-closed27439 ---27440 duration_ms: 249.4020027441 ...27442ok 5175 parallel/test-worker-message-port-transfer-fake-js-transferable-internal27443 ---27444 duration_ms: 224.6890027445 ...27446ok 5176 parallel/test-worker-message-port-transfer-filehandle27447 ---27448 duration_ms: 197.6990027449 ...27450ok 5177 parallel/test-worker-message-port-transfer-fake-js-transferable27451 ---27452 duration_ms: 291.7960027453 ...27454ok 5178 parallel/test-worker-message-port-transfer-native27455 ---27456 duration_ms: 212.6280027457 ...27458ok 5179 parallel/test-worker-message-port-transfer-target27459 ---27460 duration_ms: 190.8440027461 ...27462ok 5180 parallel/test-worker-message-port-terminate-transfer-list27463 ---27464 duration_ms: 545.3160027465 ...27466ok 5181 parallel/test-worker-message-port-transfer-self27467 ---27468 duration_ms: 274.0830027469 ...27470ok 5182 parallel/test-worker-message-port-wasm-module27471 ---27472 duration_ms: 234.6820027473 ...27474ok 5183 parallel/test-worker-message-port-transfer-terminate27475 ---27476 duration_ms: 283.4820027477 ...27478ok 5184 parallel/test-worker-init-failure27479 ---27480 duration_ms: 2409.7940027481 ...27482ok 5185 parallel/test-worker-message-port-wasm-threads27483 ---27484 duration_ms: 239.0140027485 ...27486ok 5186 parallel/test-worker-message-transfer-port-mark-as-untransferable27487 ---27488 duration_ms: 166.5580027489 ...27490ok 5187 parallel/test-worker-messageport-hasref27491 ---27492 duration_ms: 214.6840027493 ...27494ok 5188 parallel/test-worker-messaging-errors-invalid27495 ---27496 duration_ms: 247.0040027497 ...27498ok 5189 parallel/test-worker-messaging-errors-handler27499 ---27500 duration_ms: 283.7590027501 ...27502ok 5190 parallel/test-worker-mjs-workerdata27503 ---27504 duration_ms: 261.1240027505 ...27506ok 5191 parallel/test-worker-message-type-unknown27507 ---27508 duration_ms: 436.9340027509 ...27510ok 5192 parallel/test-worker-name27511 ---27512 duration_ms: 215.0390027513 ...27514ok 5193 parallel/test-worker-nested-on-process-exit27515 ---27516 duration_ms: 335.6980027517 ...27518ok 5194 parallel/test-worker-nested-uncaught27519 ---27520 duration_ms: 337.3230027521 ...27522ok 5195 parallel/test-worker-nexttick-terminate27523 ---27524 duration_ms: 335.4430027525 ...27526ok 5196 parallel/test-worker-no-sab27527 ---27528 duration_ms: 339.4770027529 ...27530ok 5197 parallel/test-worker-nearheaplimit-deadlock27531 ---27532 duration_ms: 425.3350027533 ...27534ok 5198 parallel/test-worker-messaging27535 ---27536 duration_ms: 725.6680027537 ...27538ok 5199 parallel/test-worker-messaging-errors-timeout27539 ---27540 duration_ms: 784.9360027541 ...27542ok 5200 parallel/test-worker-no-stdin-stdout-interaction27543 ---27544 duration_ms: 218.9480027545 ...27546ok 5201 parallel/test-worker-non-fatal-uncaught-exception27547 ---27548 duration_ms: 270.5550027549 ...27550ok 5202 parallel/test-worker-onmessage-not-a-function27551 ---27552 duration_ms: 267.1090027553 ...27554ok 5203 parallel/test-worker-onmessage27555 ---27556 duration_ms: 293.2070027557 ...27558ok 5204 parallel/test-worker-message-port-message-before-close27559 ---27560 duration_ms: 1871.3900027561 ...27562ok 5205 parallel/test-worker-parent-port-ref27563 ---27564 duration_ms: 240.9340027565 ...27566ok 5206 parallel/test-worker-on-process-exit27567 ---27568 duration_ms: 411.0610027569 ...27570ok 5207 parallel/test-worker-process-argv27571 ---27572 duration_ms: 278.0470027573 ...27574ok 5208 parallel/test-worker-node-options27575 ---27576 duration_ms: 526.2620027577 ...27578ok 5209 parallel/test-worker-process-exit-async-module27579 ---27580 duration_ms: 218.1870027581 ...27582ok 5210 parallel/test-worker-process-env-shared27583 ---27584 duration_ms: 280.8410027585 ...27586ok 5211 parallel/test-worker-ref27587 ---27588 duration_ms: 230.5640027589 ...27590ok 5212 parallel/test-worker-process-cwd27591 ---27592 duration_ms: 339.7400027593 ...27594ok 5213 parallel/test-worker-ref-onexit27595 ---27596 duration_ms: 220.4690027597 ...27598ok 5214 parallel/test-worker-relative-path27599 ---27600 duration_ms: 258.0930027601 ...27602ok 5215 parallel/test-worker-relative-path-double-dot27603 ---27604 duration_ms: 235.1090027605 ...27606ok 5216 parallel/test-worker-process-env27607 ---27608 duration_ms: 439.3800027609 ...27610ok 5217 parallel/test-worker-safe-getters27611 ---27612 duration_ms: 279.4950027613 ...27614ok 5218 parallel/test-worker-sharedarraybuffer-from-worker-thread27615 ---27616 duration_ms: 279.9130027617 ...27618ok 5219 parallel/test-worker-stack-overflow27619 ---27620 duration_ms: 279.7880027621 ...27622ok 5220 parallel/test-worker-spec-differences27623 ---27624 duration_ms: 345.4510027625 ...27626ok 5221 parallel/test-worker-stdio-flush27627 ---27628 duration_ms: 316.5390027629 ...27630ok 5222 parallel/test-worker-resource-limits27631 ---27632 duration_ms: 536.4520027633 ...27634ok 5223 parallel/test-worker-stdio27635 ---27636 duration_ms: 395.1690027637 ...27638ok 5224 parallel/test-worker-syntax-error-file27639 ---27640 duration_ms: 227.7630027641 ...27642ok 5225 parallel/test-worker-stdio-flush-inflight27643 ---27644 duration_ms: 314.4380027645 ...27646ok 5226 parallel/test-worker-stdio-from-preload-module27647 ---27648 duration_ms: 370.6660027649 ...27650ok 5227 parallel/test-worker-stack-overflow-stack-size27651 ---27652 duration_ms: 551.7410027653 ...27654ok 5228 parallel/test-worker-syntax-error27655 ---27656 duration_ms: 362.3470027657 ...27658ok 5229 parallel/test-worker-terminate-microtask-loop27659 ---27660 duration_ms: 239.8980027661 ...27662ok 5230 parallel/test-worker-terminate-http2-respond-with-file27663 ---27664 duration_ms: 299.4210027665 ...27666ok 5231 parallel/test-worker-terminate-null-handler27667 ---27668 duration_ms: 216.8010027669 ...27670ok 5232 parallel/test-worker-terminate-ref-public-port27671 ---27672 duration_ms: 226.1820027673 ...27674ok 5233 parallel/test-worker-terminate-nested27675 ---27676 duration_ms: 288.9280027677 ...27678ok 5234 parallel/test-worker-terminate-timers27679 ---27680 duration_ms: 231.8450027681 ...27682ok 5235 parallel/test-worker-terminate-source-map27683 ---27684 duration_ms: 275.8140027685 ...27686ok 5236 parallel/test-worker-thread-name27687 ---27688 duration_ms: 233.3780027689 ...27690ok 5237 parallel/test-worker-terminate-unrefed27691 ---27692 duration_ms: 275.5770027693 ...27694ok 5238 parallel/test-worker-type-check27695 ---27696 duration_ms: 168.4920027697 ...27698ok 5239 parallel/test-worker-uncaught-exception-async27699 ---27700 duration_ms: 238.7090027701 ...27702ok 5240 parallel/test-worker-uncaught-exception27703 ---27704 duration_ms: 288.6020027705 ...27706ok 5241 parallel/test-worker-unsupported-eval-on-url27707 ---27708 duration_ms: 178.5180027709 ...27710ok 5242 parallel/test-worker-track-unmanaged-fds27711 ---27712 duration_ms: 360.6120027713 ...27714ok 5243 parallel/test-worker-unsupported-path27715 ---27716 duration_ms: 184.9410027717 ...27718ok 5244 parallel/test-worker-unref-from-message-during-exit27719 ---27720 duration_ms: 298.1160027721 ...27722ok 5245 parallel/test-worker-unsupported-things27723 ---27724 duration_ms: 278.9310027725 ...27726ok 5246 parallel/test-worker-vm-context-terminate27727 ---27728 duration_ms: 280.1790027729 ...27730ok 5247 parallel/test-worker-voluntarily-exit-followed-by-addition27731 ---27732 duration_ms: 219.8300027733 ...27734ok 5248 parallel/test-worker-voluntarily-exit-followed-by-throw27735 ---27736 duration_ms: 230.8930027737 ...27738ok 5249 parallel/test-wrap-js-stream-destroy27739 ---27740 duration_ms: 227.4740027741 ...27742ok 5250 parallel/test-wrap-js-stream-duplex27743 ---27744 duration_ms: 185.4230027745 ...27746ok 5251 parallel/test-worker-workerdata-messageport27747 ---27748 duration_ms: 271.0230027749 ...27750ok 5252 parallel/test-worker-workerdata-sharedarraybuffer27751 ---27752 duration_ms: 290.5730027753 ...27754ok 5253 parallel/test-wrap-js-stream-exceptions27755 ---27756 duration_ms: 194.9340027757 ...27758ok 5254 parallel/test-wrap-js-stream-read-stop27759 ---27760 duration_ms: 187.1530027761 ...27762ok 5255 parallel/test-zlib-brotli-flush27763 ---27764 duration_ms: 177.2560027765 ...27766ok 5256 parallel/test-zlib-brotli-dictionary27767 ---27768 duration_ms: 218.0720027769 ...27770ok 5257 parallel/test-zlib-brotli-from-brotli27771 ---27772 duration_ms: 201.0410027773 ...27774ok 5258 parallel/test-zlib-brotli27775 ---27776 duration_ms: 280.2640027777 ...27778ok 5259 parallel/test-zlib-brotli-flush-invalid-kind27779 ---27780 duration_ms: 233.2800027781 ...27782ok 5260 parallel/test-zlib-brotli-kmaxlength-rangeerror27783 ---27784 duration_ms: 170.4230027785 ...27786ok 5261 parallel/test-zlib-brotli-from-string27787 ---27788 duration_ms: 213.0920027789 ...27790ok 5262 parallel/test-zlib-close-after-error27791 ---27792 duration_ms: 174.6830027793 ...27794ok 5263 parallel/test-zlib-close-after-write27795 ---27796 duration_ms: 175.8850027797 ...27798ok 5264 parallel/test-zlib-close-in-ondata27799 ---27800 duration_ms: 280.4300027801 ...27802ok 5265 parallel/test-zlib-const27803 ---27804 duration_ms: 173.1460027805 ...27806ok 5266 parallel/test-zlib27807 ---27808 duration_ms: 615.2540027809 ...27810ok 5267 parallel/test-zlib-crc3227811 ---27812 duration_ms: 173.7780027813 ...27814ok 5268 parallel/test-zlib-create-raw27815 ---27816 duration_ms: 172.9950027817 ...27818ok 5269 parallel/test-zlib-deflate-constructors27819 ---27820 duration_ms: 178.2030027821 ...27822ok 5270 parallel/test-zlib-deflate-raw-inherits27823 ---27824 duration_ms: 182.4280027825 ...27826ok 5271 parallel/test-zlib-destroy27827 ---27828 duration_ms: 183.3900027829 ...27830ok 5272 parallel/test-zlib-dictionary27831 ---27832 duration_ms: 198.9160027833 ...27834ok 5273 parallel/test-zlib-brotli-16GB27835 ---27836 duration_ms: 833.1220027837 ...27838ok 5274 parallel/test-zlib-failed-init27839 ---27840 duration_ms: 172.9070027841 ...27842ok 5275 parallel/test-zlib-convenience-methods27843 ---27844 duration_ms: 522.2960027845 ...27846ok 5276 parallel/test-zlib-destroy-pipe27847 ---27848 duration_ms: 347.4940027849 ...27850ok 5277 parallel/test-zlib-dictionary-fail27851 ---27852 duration_ms: 217.2520027853 ...27854ok 5278 parallel/test-zlib-empty-buffer27855 ---27856 duration_ms: 219.1250027857 ...27858ok 5279 parallel/test-zlib-flush-drain27859 ---27860 duration_ms: 170.2400027861 ...27862ok 5280 parallel/test-zlib-flush27863 ---27864 duration_ms: 216.1070027865 ...27866ok 5281 parallel/test-zlib-flush-drain-longblock27867 ---27868 duration_ms: 175.9480027869 ...27870ok 5282 parallel/test-zlib-flush-flags27871 ---27872 duration_ms: 177.0940027873 ...27874ok 5283 parallel/test-zlib-flush-write-sync-interleaved27875 ---27876 duration_ms: 182.2120027877 ...27878ok 5284 parallel/test-zlib-from-concatenated-gzip27879 ---27880 duration_ms: 223.4840027881 ...27882ok 5285 parallel/test-zlib-from-string27883 ---27884 duration_ms: 164.2650027885 ...27886ok 5286 parallel/test-zlib-from-gzip27887 ---27888 duration_ms: 223.7270027889 ...27890ok 5287 parallel/test-zlib-from-gzip-with-trailing-garbage27891 ---27892 duration_ms: 229.7070027893 ...27894ok 5288 parallel/test-zlib-invalid-arg-value-brotli-compress27895 ---27896 duration_ms: 183.5740027897 ...27898ok 5289 parallel/test-zlib-no-stream27899 ---27900 duration_ms: 94.7830027901 ...27902ok 5290 parallel/test-zlib-invalid-input27903 ---27904 duration_ms: 213.1320027905 ...27906ok 5291 parallel/test-zlib-invalid-input-memory27907 ---27908 duration_ms: 219.6950027909 ...27910ok 5292 parallel/test-zlib-kmaxlength-rangeerror27911 ---27912 duration_ms: 178.8030027913 ...27914ok 5293 parallel/test-zlib-maxOutputLength27915 ---27916 duration_ms: 187.7260027917 ...27918ok 5294 parallel/test-zlib-negative-zero27919 ---27920 duration_ms: 200.0890027921 ...27922ok 5295 parallel/test-zlib-not-string-or-buffer27923 ---27924 duration_ms: 158.4880027925 ...27926ok 5296 parallel/test-zlib-object-write27927 ---27928 duration_ms: 177.2910027929 ...27930ok 5297 parallel/test-zlib-params27931 ---27932 duration_ms: 177.2140027933 ...27934ok 5298 parallel/test-zlib-premature-end27935 ---27936 duration_ms: 189.4380027937 ...27938ok 5299 parallel/test-zlib-reset-before-write27939 ---27940 duration_ms: 181.7340027941 ...27942ok 5300 parallel/test-zlib-random-byte-pipes27943 ---27944 duration_ms: 226.5950027945 ...27946ok 5301 parallel/test-zlib-reset-during-write27947 ---27948 duration_ms: 181.8560027949 ...27950ok 5302 parallel/test-x509-escaping27951 ---27952 duration_ms: 1744.8260027953 ...27954ok 5303 parallel/test-zlib-reject-garbage-after-end27955 ---27956 duration_ms: 275.8660027957 ...27958ok 5304 parallel/test-zlib-sync-no-event27959 ---27960 duration_ms: 172.6510027961 ...27962ok 5305 parallel/test-zlib-truncated27963 ---27964 duration_ms: 219.6610027965 ...27966ok 5306 parallel/test-zlib-unzip-one-byte-chunks27967 ---27968 duration_ms: 176.2320027969 ...27970ok 5307 parallel/test-zlib-write-after-close27971 ---27972 duration_ms: 171.3770027973 ...27974ok 5308 parallel/test-zlib-unused-weak27975 ---27976 duration_ms: 220.1610027977 ...27978ok 5309 parallel/test-zlib-type-error27979 ---27980 duration_ms: 272.0410027981 ...27982ok 5310 parallel/test-zlib-write-after-end27983 ---27984 duration_ms: 235.8230027985 ...27986ok 5311 parallel/test-zlib-zero-byte27987 ---27988 duration_ms: 199.4720027989 ...27990ok 5312 parallel/test-zlib-write-after-flush27991 ---27992 duration_ms: 233.1540027993 ...27994ok 5313 parallel/test-zlib-zero-windowBits27995 ---27996 duration_ms: 219.8160027997 ...27998ok 5314 parallel/test-zlib-zip27999 ---28000 duration_ms: 268.6410028001 ...28002ok 5315 parallel/test-zlib-zip-edgecases28003 ---28004 duration_ms: 276.5400028005 ...28006ok 5316 parallel/test-zlib-zip-encoding28007 ---28008 duration_ms: 272.8010028009 ...28010ok 5317 parallel/test-zlib-zip-file-lifecycle28011 ---28012 duration_ms: 282.3920028013 ...28014ok 5318 parallel/test-zlib-zip-internals28015 ---28016 duration_ms: 247.6570028017 ...28018ok 5319 parallel/test-zlib-zip-files28019 ---28020 duration_ms: 459.9680028021 ...28022ok 5320 parallel/test-zlib-zip-metadata28023 ---28024 duration_ms: 268.8330028025 ...28026ok 5321 parallel/test-zlib-zip-interop28027 ---28028 duration_ms: 382.2210028029 ...28030ok 5322 parallel/test-zlib-zip-hardening28031 ---28032 duration_ms: 524.8870028033 ...28034ok 5323 parallel/test-zlib-zip-experimental-warning28035 ---28036 duration_ms: 730.9580028037 ...28038ok 5324 parallel/test-zlib-zip-property28039 ---28040 duration_ms: 422.9080028041 ...28042ok 5325 parallel/test-zlib-zip-sync28043 ---28044 duration_ms: 280.5240028045 ...28046ok 5326 parallel/test-zlib-zip-security-hardening28047 ---28048 duration_ms: 419.2220028049 ...28050ok 5327 parallel/test-zlib-zip-vfs28051 ---28052 duration_ms: 350.8320028053 ...28054ok 5328 parallel/test-zlib-zstd28055 ---28056 duration_ms: 224.6790028057 ...28058ok 5329 parallel/test-zlib-zstd-dictionary28059 ---28060 duration_ms: 174.7190028061 ...28062ok 5330 parallel/test-zlib-zip-coverage28063 ---28064 duration_ms: 1226.0000028065 ...28066ok 5331 parallel/test-zlib-zstd-flush28067 ---28068 duration_ms: 184.6140028069 ...28070ok 5332 parallel/test-zlib-zstd-from-string28071 ---28072 duration_ms: 220.8130028073 ...28074ok 5333 parallel/test-zlib-zip-writable28075 ---28076 duration_ms: 633.8450028077 ...28078ok 5334 parallel/test-zlib-zstd-from-zstd28079 ---28080 duration_ms: 217.7510028081 ...28082ok 5335 parallel/test-zlib-zstd-kmaxlength-rangeerror28083 ---28084 duration_ms: 219.2920028085 ...28086ok 5336 parallel/test-zlib-zip-security28087 ---28088 duration_ms: 944.0450028089 ...28090ok 5337 parallel/test-zlib-zstd-pledged-src-size28091 ---28092 duration_ms: 219.5190028093 ...28094ok 5338 parallel/test-zlib-zip-fuzz28095 ---28096 duration_ms: 1375.4140028097 ...28098ok 5339 sea/test-build-sea # skip Running the resultant binary fails with `/home/iojs/node-tmp/.tmp.2379/sea: error while loading shared libraries: libicui18n.so.71: cannot open shared object file: No such file or directory`.28099 ---28100 duration_ms: 178.8600028101 ...28102ok 5340 sea/test-build-sea-config-not-found # skip Running the resultant binary fails with `/home/iojs/node-tmp/.tmp.2379/sea: error while loading shared libraries: libicui18n.so.71: cannot open shared object file: No such file or directory`.28103 ---28104 duration_ms: 159.4360028105 ...28106ok 5341 sea/test-build-sea-custom-argv0 # skip Running the resultant binary fails with `/home/iojs/node-tmp/.tmp.2379/sea: error while loading shared libraries: libicui18n.so.71: cannot open shared object file: No such file or directory`.28107 ---28108 duration_ms: 171.1630028109 ...28110ok 5342 sea/test-build-sea-already-exists # skip Running the resultant binary fails with `/home/iojs/node-tmp/.tmp.2379/sea: error while loading shared libraries: libicui18n.so.71: cannot open shared object file: No such file or directory`.28111 ---28112 duration_ms: 181.6090028113 ...28114ok 5343 sea/test-build-sea-elf-segments # skip Running the resultant binary fails with `/home/iojs/node-tmp/.tmp.2379/sea: error while loading shared libraries: libicui18n.so.71: cannot open shared object file: No such file or directory`.28115 ---28116 duration_ms: 174.3160028117 ...28118ok 5344 sea/test-build-sea-executable-field # skip Running the resultant binary fails with `/home/iojs/node-tmp/.tmp.2379/sea: error while loading shared libraries: libicui18n.so.71: cannot open shared object file: No such file or directory`.28119 ---28120 duration_ms: 170.5750028121 ...28122ok 5345 sea/test-build-sea-invalid-assets # skip Running the resultant binary fails with `/home/iojs/node-tmp/.tmp.2379/sea: error while loading shared libraries: libicui18n.so.71: cannot open shared object file: No such file or directory`.28123 ---28124 duration_ms: 179.8760028125 ...28126ok 5346 sea/test-build-sea-invalid-exec-argv # skip Running the resultant binary fails with `/home/iojs/node-tmp/.tmp.2379/sea: error while loading shared libraries: libicui18n.so.71: cannot open shared object file: No such file or directory`.28127 ---28128 duration_ms: 150.7470028129 ...28130ok 5347 sea/test-build-sea-invalid-boolean-fields # skip Running the resultant binary fails with `/home/iojs/node-tmp/.tmp.2379/sea: error while loading shared libraries: libicui18n.so.71: cannot open shared object file: No such file or directory`.28131 ---28132 duration_ms: 185.0210028133 ...28134ok 5348 sea/test-build-sea-invalid-executable # skip Running the resultant binary fails with `/home/iojs/node-tmp/.tmp.2379/sea: error while loading shared libraries: libicui18n.so.71: cannot open shared object file: No such file or directory`.28135 ---28136 duration_ms: 154.9410028137 ...28138ok 5349 sea/test-build-sea-invalid-json # skip Running the resultant binary fails with `/home/iojs/node-tmp/.tmp.2379/sea: error while loading shared libraries: libicui18n.so.71: cannot open shared object file: No such file or directory`.28139 ---28140 duration_ms: 159.7710028141 ...28142ok 5350 sea/test-build-sea-missing-main # skip Running the resultant binary fails with `/home/iojs/node-tmp/.tmp.2379/sea: error while loading shared libraries: libicui18n.so.71: cannot open shared object file: No such file or directory`.28143 ---28144 duration_ms: 151.7190028145 ...28146ok 5351 sea/test-build-sea-missing-output # skip Running the resultant binary fails with `/home/iojs/node-tmp/.tmp.2379/sea: error while loading shared libraries: libicui18n.so.71: cannot open shared object file: No such file or directory`.28147 ---28148 duration_ms: 153.8870028149 ...28150ok 5352 sea/test-build-sea-vfs-incompatible-options # skip Running the resultant binary fails with `/home/iojs/node-tmp/.tmp.2379/sea: error while loading shared libraries: libicui18n.so.71: cannot open shared object file: No such file or directory`.28151 ---28152 duration_ms: 151.0610028153 ...28154ok 5353 sea/test-single-executable-application # skip Running the resultant binary fails with `/home/iojs/node-tmp/.tmp.2379/sea: error while loading shared libraries: libicui18n.so.71: cannot open shared object file: No such file or directory`.28155 ---28156 duration_ms: 154.1480028157 ...28158ok 5354 sea/test-single-executable-application-asset-keys # skip Running the resultant binary fails with `/home/iojs/node-tmp/.tmp.2379/sea: error while loading shared libraries: libicui18n.so.71: cannot open shared object file: No such file or directory`.28159 ---28160 duration_ms: 157.6290028161 ...28162ok 5355 sea/test-single-executable-application-assets # skip Running the resultant binary fails with `/home/iojs/node-tmp/.tmp.2379/sea: error while loading shared libraries: libicui18n.so.71: cannot open shared object file: No such file or directory`.28163 ---28164 duration_ms: 151.9050028165 ...28166ok 5356 sea/test-single-executable-application-asset-keys-empty # skip Running the resultant binary fails with `/home/iojs/node-tmp/.tmp.2379/sea: error while loading shared libraries: libicui18n.so.71: cannot open shared object file: No such file or directory`.28167 ---28168 duration_ms: 163.6840028169 ...28170ok 5357 sea/test-single-executable-application-assets-raw # skip Running the resultant binary fails with `/home/iojs/node-tmp/.tmp.2379/sea: error while loading shared libraries: libicui18n.so.71: cannot open shared object file: No such file or directory`.28171 ---28172 duration_ms: 158.7790028173 ...28174ok 5358 sea/test-single-executable-application-esm-code-cache # skip Running the resultant binary fails with `/home/iojs/node-tmp/.tmp.2379/sea: error while loading shared libraries: libicui18n.so.71: cannot open shared object file: No such file or directory`.28175 ---28176 duration_ms: 138.3520028177 ...28178ok 5359 sea/test-single-executable-application-assets-nonexistent-file28179 ---28180 duration_ms: 235.4620028181 ...28182ok 5360 sea/test-single-executable-application-assets-invalid-type28183 ---28184 duration_ms: 272.1260028185 ...28186ok 5361 sea/test-single-executable-application-disable-experimental-sea-warning # skip Running the resultant binary fails with `/home/iojs/node-tmp/.tmp.2379/sea: error while loading shared libraries: libicui18n.so.71: cannot open shared object file: No such file or directory`.28187 ---28188 duration_ms: 183.8950028189 ...28190ok 5362 sea/test-single-executable-application-esm # skip Running the resultant binary fails with `/home/iojs/node-tmp/.tmp.2379/sea: error while loading shared libraries: libicui18n.so.71: cannot open shared object file: No such file or directory`.28191 ---28192 duration_ms: 179.5310028193 ...28194ok 5363 sea/test-single-executable-application-empty # skip Running the resultant binary fails with `/home/iojs/node-tmp/.tmp.2379/sea: error while loading shared libraries: libicui18n.so.71: cannot open shared object file: No such file or directory`.28195 ---28196 duration_ms: 186.7350028197 ...28198ok 5364 sea/test-single-executable-application-exec-argv # skip Running the resultant binary fails with `/home/iojs/node-tmp/.tmp.2379/sea: error while loading shared libraries: libicui18n.so.71: cannot open shared object file: No such file or directory`.28199 ---28200 duration_ms: 164.5460028201 ...28202ok 5365 sea/test-single-executable-application-exec-argv-extension-none # skip Running the resultant binary fails with `/home/iojs/node-tmp/.tmp.2379/sea: error while loading shared libraries: libicui18n.so.71: cannot open shared object file: No such file or directory`.28203 ---28204 duration_ms: 154.0420028205 ...28206ok 5366 sea/test-single-executable-application-exec-argv-extension-env # skip Running the resultant binary fails with `/home/iojs/node-tmp/.tmp.2379/sea: error while loading shared libraries: libicui18n.so.71: cannot open shared object file: No such file or directory`.28207 ---28208 duration_ms: 155.8510028209 ...28210ok 5367 sea/test-single-executable-application-exec-argv-extension-cli # skip Running the resultant binary fails with `/home/iojs/node-tmp/.tmp.2379/sea: error while loading shared libraries: libicui18n.so.71: cannot open shared object file: No such file or directory`.28211 ---28212 duration_ms: 167.0070028213 ...28214ok 5368 sea/test-single-executable-application-exec-argv-empty # skip Running the resultant binary fails with `/home/iojs/node-tmp/.tmp.2379/sea: error while loading shared libraries: libicui18n.so.71: cannot open shared object file: No such file or directory`.28215 ---28216 duration_ms: 185.8300028217 ...28218ok 5369 sea/test-single-executable-application-inspect-in-sea-flags # skip Running the resultant binary fails with `/home/iojs/node-tmp/.tmp.2379/sea: error while loading shared libraries: libicui18n.so.71: cannot open shared object file: No such file or directory`.28219 ---28220 duration_ms: 162.1490028221 ...28222ok 5370 sea/test-single-executable-application-inspect # skip Running the resultant binary fails with `/home/iojs/node-tmp/.tmp.2379/sea: error while loading shared libraries: libicui18n.so.71: cannot open shared object file: No such file or directory`.28223 ---28224 duration_ms: 169.6170028225 ...28226ok 5371 sea/test-single-executable-application-snapshot # skip Running the resultant binary fails with `/home/iojs/node-tmp/.tmp.2379/sea: error while loading shared libraries: libicui18n.so.71: cannot open shared object file: No such file or directory`.28227 ---28228 duration_ms: 159.7340028229 ...28230ok 5372 sea/test-single-executable-application-snapshot-worker # skip Running the resultant binary fails with `/home/iojs/node-tmp/.tmp.2379/sea: error while loading shared libraries: libicui18n.so.71: cannot open shared object file: No such file or directory`.28231 ---28232 duration_ms: 153.4460028233 ...28234ok 5373 sea/test-single-executable-application-snapshot-and-code-cache # skip Running the resultant binary fails with `/home/iojs/node-tmp/.tmp.2379/sea: error while loading shared libraries: libicui18n.so.71: cannot open shared object file: No such file or directory`.28235 ---28236 duration_ms: 157.2570028237 ...28238ok 5374 sea/test-single-executable-application-vfs # skip Running the resultant binary fails with `/home/iojs/node-tmp/.tmp.2379/sea: error while loading shared libraries: libicui18n.so.71: cannot open shared object file: No such file or directory`.28239 ---28240 duration_ms: 148.4300028241 ...28242ok 5375 sea/test-single-executable-application-use-code-cache # skip Running the resultant binary fails with `/home/iojs/node-tmp/.tmp.2379/sea: error while loading shared libraries: libicui18n.so.71: cannot open shared object file: No such file or directory`.28243 ---28244 duration_ms: 161.2590028245 ...28246ok 5376 sea/test-single-executable-application-vfs-esm # skip Running the resultant binary fails with `/home/iojs/node-tmp/.tmp.2379/sea: error while loading shared libraries: libicui18n.so.71: cannot open shared object file: No such file or directory`.28247 ---28248 duration_ms: 160.2260028249 ...28250ok 5377 pseudo-tty/no_dropped_stdio28251 ---28252 duration_ms: 216.4640028253 ...28254ok 5378 pseudo-tty/no_interleaved_stdio28255 ---28256 duration_ms: 221.8750028257 ...28258ok 5379 pseudo-tty/console-dumb-tty28259 ---28260 duration_ms: 238.3590028261 ...28262ok 5380 pseudo-tty/console_colors28263 ---28264 duration_ms: 238.3450028265 ...28266ok 5381 pseudo-tty/readline-dumb-tty28267 ---28268 duration_ms: 224.3360028269 ...28270ok 5382 sea/test-single-executable-blob-config28271 ---28272 duration_ms: 556.9850028273 ...28274ok 5383 pseudo-tty/ref_keeps_node_running28275 ---28276 duration_ms: 230.6830028277 ...28278ok 5384 pseudo-tty/stdin-setrawmode28279 ---28280 duration_ms: 223.8930028281 ...28282ok 5385 pseudo-tty/test-assert-colors28283 ---28284 duration_ms: 229.1710028285 ...28286ok 5386 pseudo-tty/test-assert-no-color28287 ---28288 duration_ms: 231.4820028289 ...28290ok 5387 pseudo-tty/repl-dumb-tty28291 ---28292 duration_ms: 350.0660028293 ...28294ok 5388 pseudo-tty/test-assert-position-indicator28295 ---28296 duration_ms: 233.4590028297 ...28298ok 5389 pseudo-tty/test-fatal-error28299 ---28300 duration_ms: 222.4790028301 ...28302ok 5390 pseudo-tty/test-async-wrap-getasyncid-tty28303 ---28304 duration_ms: 227.9770028305 ...28306ok 5391 pseudo-tty/test-handle-wrap-hasref-tty28307 ---28308 duration_ms: 225.7600028309 ...28310ok 5392 pseudo-tty/test-readable-tty-keepalive28311 ---28312 duration_ms: 232.5560028313 ...28314ok 5393 sea/test-single-executable-blob-config-errors28315 ---28316 duration_ms: 952.1790028317 ...28318ok 5394 pseudo-tty/test-set-raw-mode-modes28319 ---28320 duration_ms: 270.1940028321 ...28322ok 5395 pseudo-tty/test-repl-external-module28323 ---28324 duration_ms: 369.7750028325 ...28326ok 5396 pseudo-tty/test-set-raw-mode-reset28327 ---28328 duration_ms: 337.6690028329 ...28330ok 5397 pseudo-tty/test-set-raw-mode-reset-process-exit28331 ---28332 duration_ms: 337.5830028333 ...28334ok 5398 pseudo-tty/test-set-raw-mode-reset-signal28335 ---28336 duration_ms: 341.3470028337 ...28338ok 5399 pseudo-tty/test-stderr-stdout-handle-sigwinch28339 ---28340 duration_ms: 218.0780028341 ...28342ok 5400 pseudo-tty/test-stdin-write28343 ---28344 duration_ms: 212.1710028345 ...28346ok 5401 pseudo-tty/test-start-trace-sigint28347 ---28348 duration_ms: 426.7750028349 ...28350ok 5402 pseudo-tty/test-stdout-read28351 ---28352 duration_ms: 224.6260028353 ...28354ok 5403 pseudo-tty/test-testpy-env-var-via-comment28355 ---28356 duration_ms: 219.6350028357 ...28358ok 5404 pseudo-tty/test-tty-color-support28359 ---28360 duration_ms: 235.2050028361 ...28362ok 5405 pseudo-tty/test-tty-color-support-warning28363 ---28364 duration_ms: 224.6540028365 ...28366ok 5406 pseudo-tty/test-stop-trace-sigint28367 ---28368 duration_ms: 423.1450028369 ...28370ok 5407 pseudo-tty/test-tty-color-support-warning-228371 ---28372 duration_ms: 220.6380028373 ...28374ok 5408 pseudo-tty/test-trace-sigint28375 ---28376 duration_ms: 426.9960028377 ...28378ok 5409 pseudo-tty/test-trace-sigint-disabled28379 ---28380 duration_ms: 425.8750028381 ...28382ok 5410 pseudo-tty/test-tty-isatty28383 ---28384 duration_ms: 221.1500028385 ...28386ok 5411 pseudo-tty/test-tty-stdin-call-end28387 ---28388 duration_ms: 214.2240028389 ...28390ok 5412 pseudo-tty/test-tty-stdin-end28391 ---28392 duration_ms: 223.2090028393 ...28394ok 5413 pseudo-tty/test-trace-sigint-on-idle28395 ---28396 duration_ms: 528.8600028397 ...28398ok 5414 pseudo-tty/test-tty-stdout-end28399 ---28400 duration_ms: 221.3880028401 ...28402ok 5415 pseudo-tty/test-tty-stdout-resize28403 ---28404 duration_ms: 273.2360028405 ...28406ok 5416 pseudo-tty/test-tty-stream-constructors28407 ---28408 duration_ms: 225.0390028409 ...28410ok 5417 pseudo-tty/test-tty-window-size28411 ---28412 duration_ms: 219.0300028413 ...28414ok 5418 pseudo-tty/test-tty-wrap28415 ---28416 duration_ms: 222.9060028417 ...28418ok 5419 test-runner/test-output-arbitrary-output-colored # skip Forced colors not supported in this build28419 ---28420 duration_ms: 184.5940028421 ...28422ok 5420 test-runner/test-output-abort-runs-after-hook28423 ---28424 duration_ms: 344.3550028425 ...28426ok 5421 test-runner/test-output-abort-hooks28427 ---28428 duration_ms: 363.3820028429 ...28430ok 5422 test-runner/test-output-arbitrary-output28431 ---28432 duration_ms: 545.2610028433 ...28434ok 5423 test-runner/test-output-async-test-scheduling28435 ---28436 duration_ms: 422.9290028437 ...28438ok 5424 test-runner/test-output-before-and-after-each-too-many-listeners28439 ---28440 duration_ms: 413.5770028441 ...28442ok 5425 test-runner/test-output-before-and-after-each-with-timeout-too-many-listeners28443 ---28444 duration_ms: 420.8080028445 ...28446ok 5426 test-runner/test-output-assertion-color-tty28447 ---28448 duration_ms: 667.4950028449 ...28450ok 5427 test-runner/test-output-coverage-failure28451 ---28452 duration_ms: 413.4350028453 ...28454ok 5428 test-runner/test-output-coverage-short-filename28455 ---28456 duration_ms: 409.3740028457 ...28458ok 5429 test-runner/test-output-coverage-width-10028459 ---28460 duration_ms: 424.3460028461 ...28462ok 5430 test-runner/test-output-coverage-width-100-uncovered-lines28463 ---28464 duration_ms: 429.2980028465 ...28466ok 5431 test-runner/test-output-coverage-width-15028467 ---28468 duration_ms: 479.0500028469 ...28470ok 5432 test-runner/test-output-abort28471 ---28472 duration_ms: 1425.4540028473 ...28474ok 5433 test-runner/test-output-abort-suite28475 ---28476 duration_ms: 1448.3550028477 ...28478ok 5434 test-runner/test-output-coverage-width-150-uncovered-lines28479 ---28480 duration_ms: 520.2160028481 ...28482ok 5435 test-runner/test-output-coverage-width-4028483 ---28484 duration_ms: 422.9230028485 ...28486ok 5436 test-runner/test-output-coverage-width-8028487 ---28488 duration_ms: 420.7100028489 ...28490ok 5437 test-runner/test-output-coverage-width-80-color28491 ---28492 duration_ms: 524.0140028493 ...28494ok 5438 test-runner/test-output-coverage-width-80-uncovered-lines28495 ---28496 duration_ms: 444.5580028497 ...28498ok 5439 parallel/test-zlib-zip-zip6428499 ---28500 duration_ms: 4996.6400028501 ...28502ok 5440 test-runner/test-output-coverage-width-infinity28503 ---28504 duration_ms: 420.1240028505 ...28506ok 5441 test-runner/test-output-coverage-width-80-uncovered-lines-color28507 ---28508 duration_ms: 532.2000028509 ...28510ok 5442 test-runner/test-output-coverage-width-infinity-uncovered-lines28511 ---28512 duration_ms: 523.5350028513 ...28514ok 5443 test-runner/test-output-coverage-with-mock28515 ---28516 duration_ms: 528.2720028517 ...28518ok 5444 test-runner/test-output-coverage-with-mock-cjs28519 ---28520 duration_ms: 517.4000028521 ...28522ok 5445 test-runner/test-output-default-output28523 ---28524 duration_ms: 541.1820028525 ...28526ok 5446 test-runner/test-output-describe-nested28527 ---28528 duration_ms: 428.3880028529 ...28530ok 5447 test-runner/test-output-dot-output-custom-columns28531 ---28532 duration_ms: 521.9650028533 ...28534ok 5448 test-runner/test-output-eval-spec28535 ---28536 duration_ms: 337.6920028537 ...28538ok 5449 test-runner/test-output-eval-dot28539 ---28540 duration_ms: 417.3810028541 ...28542ok 5450 test-runner/test-output-eval-tap28543 ---28544 duration_ms: 335.1380028545 ...28546ok 5451 test-runner/test-output-dot-reporter-coverage-threshold28547 ---28548 duration_ms: 622.6830028549 ...28550ok 5452 test-runner/test-output-filtered-suite-delayed-build28551 ---28552 duration_ms: 430.0680028553 ...28554ok 5453 test-runner/test-output-describe-it28555 ---28556 duration_ms: 1019.4750028557 ...28558ok 5454 test-runner/test-output-filtered-suite-order28559 ---28560 duration_ms: 411.4710028561 ...28562ok 5455 test-runner/test-output-force-exit28563 ---28564 duration_ms: 332.4650028565 ...28566ok 5456 test-runner/test-output-filtered-suite-throws28567 ---28568 duration_ms: 415.6180028569 ...28570ok 5457 test-runner/test-output-global-after-should-fail-the-test28571 ---28572 duration_ms: 340.0040028573 ...28574ok 5458 test-runner/test-output-global-hooks-with-no-tests28575 ---28576 duration_ms: 423.5920028577 ...28578ok 5459 test-runner/test-output-dot-reporter28579 ---28580 duration_ms: 1334.0080028581 ...28582ok 5460 test-runner/test-output-hooks-with-no-global-test28583 ---28584 duration_ms: 431.8140028585 ...28586ok 5461 test-runner/test-output-junit-classname-hierarchy28587 ---28588 duration_ms: 449.1010028589 ...28590ok 5462 test-runner/test-output-hooks28591 ---28592 duration_ms: 619.0120028593 ...28594ok 5463 test-runner/test-output-junit-empty-diagnostic28595 ---28596 duration_ms: 551.3750028597 ...28598ok 5464 test-runner/test-output-hooks-spec-reporter28599 ---28600 duration_ms: 725.2550028601 ...28602ok 5465 test-runner/test-output-name-and-skip-patterns28603 ---28604 duration_ms: 417.7530028605 ...28606ok 5466 test-runner/test-output-name-pattern28607 ---28608 duration_ms: 425.0400028609 ...28610ok 5467 test-runner/test-output-name-pattern-with-only28611 ---28612 duration_ms: 434.4550028613 ...28614ok 5468 test-runner/test-output-non-tty-forced-color-output28615 ---28616 duration_ms: 341.8280028617 ...28618ok 5469 test-runner/test-output-no-tests28619 ---28620 duration_ms: 411.0730028621 ...28622ok 5470 test-runner/test-output-only-tests28623 ---28624 duration_ms: 513.4090028625 ...28626ok 5471 test-runner/test-output-junit-reporter28627 ---28628 duration_ms: 1341.5060028629 ...28630ok 5472 test-runner/test-output-randomize-nested-scenarios-output-cli-none28631 ---28632 duration_ms: 612.3720028633 ...28634ok 5473 test-runner/test-output-lcov-reporter28635 ---28636 duration_ms: 1332.2120028637 ...28638ok 5474 test-runner/test-output-randomize-nested-scenarios-output-cli-process28639 ---28640 duration_ms: 812.2130028641 ...28642ok 5475 test-runner/test-output-no-refs28643 ---28644 duration_ms: 1435.6090028645 ...28646ok 5476 test-runner/test-output-skip-each-hooks28647 ---28648 duration_ms: 329.7230028649 ...28650ok 5477 test-runner/test-output-output28651 ---28652 duration_ms: 1114.9170028653 ...28654ok 5478 test-runner/test-output-skip-pattern28655 ---28656 duration_ms: 409.3680028657 ...28658ok 5479 test-runner/test-output-randomize-output-cli-none28659 ---28660 duration_ms: 623.6410028661 ...28662ok 5480 test-runner/test-output-spec-reporter-watch-restart28663 ---28664 duration_ms: 188.4550028665 ...28666ok 5481 test-runner/test-output-source-mapped-locations28667 ---28668 duration_ms: 429.5110028669 ...28670ok 5482 test-runner/test-output-output-cli28671 ---28672 duration_ms: 1424.0600028673 ...28674ok 5483 test-runner/test-output-spec-reporter-successful28675 ---28676 duration_ms: 429.3220028677 ...28678ok 5484 test-runner/test-output-suite-skip-hooks28679 ---28680 duration_ms: 360.2730028681 ...28682ok 5485 test-runner/test-output-tap-escape28683 ---28684 duration_ms: 424.0410028685 ...28686ok 5486 test-runner/test-output-test-runner-plan28687 ---28688 duration_ms: 415.7240028689 ...28690ok 5487 test-runner/test-output-test-diagnostic-warning-without-test-only-flag28691 ---28692 duration_ms: 524.6260028693 ...28694ok 5488 test-runner/test-output-test-runner-watch-spec28695 ---28696 duration_ms: 647.7820028697 ...28698ok 5489 test-runner/test-output-randomize-output-cli28699 ---28700 duration_ms: 1749.2690028701 ...28702ok 5490 test-runner/test-output-test-timeout-flag28703 ---28704 duration_ms: 515.4670028705 ...28706ok 5491 test-runner/test-output-spec-reporter28707 ---28708 duration_ms: 1327.4530028709 ...28710ok 5492 test-runner/test-output-spec-reporter-cli28711 ---28712 duration_ms: 1421.8120028713 ...28714ok 5493 test-runner/test-output-test-timeout-flag-with-test28715 ---28716 duration_ms: 613.2960028717 ...28718ok 5494 test-runner/test-output-unfinished-suite-async-error28719 ---28720 duration_ms: 330.9950028721 ...28722ok 5495 test-runner/test-output-typescript-coverage28723 ---28724 duration_ms: 511.6860028725 ...28726ok 5496 test-runner/test-run-watch-cwd28727 ---28728 duration_ms: 414.1410028729 ...28730ok 5497 test-runner/test-run-watch-cwd-isolation-none28731 ---28732 duration_ms: 416.4820028733 ...28734ok 5498 test-runner/test-run-watch-cwd-isolation-none-argv28735 ---28736 duration_ms: 422.8150028737 ...28738ok 5499 test-runner/test-run-watch-cwd-isolation-process28739 ---28740 duration_ms: 412.1990028741 ...28742ok 5500 test-runner/test-output-test-runner-plan-timeout28743 ---28744 duration_ms: 1929.8560028745 ...28746ok 5501 test-runner/test-output-timeout-in-before-each28747 ---28748 duration_ms: 1616.1690028749 ...28750ok 5502 test-runner/test-run-watch-create28751 ---28752 duration_ms: 1814.4870028753 ...28754ok 5503 test-runner/test-run-watch-emit-restarted28755 ---28756 duration_ms: 709.9550028757 ...28758ok 5504 test-runner/test-run-watch-dependency-repeatedly28759 ---28760 duration_ms: 1813.1530028761 ...28762ok 5505 test-runner/test-run-watch-no-emit-restarted-disabled28763 ---28764 duration_ms: 409.4460028765 ...28766ok 5506 test-runner/test-run-watch-different-cwd-dependency28767 ---28768 duration_ms: 1814.8870028769 ...28770ok 5507 test-runner/test-run-watch-different-cwd-rename28771 ---28772 duration_ms: 1811.5400028773 ...28774ok 5508 test-runner/test-run-watch-different-runner-cwd28775 ---28776 duration_ms: 1822.2950028777 ...28778ok 5509 test-runner/test-run-watch-delete28779 ---28780 duration_ms: 2516.6220028781 ...28782ok 5510 test-runner/test-run-watch-different-runner-cwd-isolation-process28783 ---28784 duration_ms: 1911.7120028785 ...28786ok 5511 test-runner/test-run-watch-esm-dependency28787 ---28788 duration_ms: 1813.0260028789 ...28790ok 5512 test-runner/test-watch-create-isolation-process28791 ---28792 duration_ms: 1512.6720028793 ...28794ok 5513 test-runner/test-run-watch-rename28795 ---28796 duration_ms: 1814.8950028797 ...28798ok 5514 test-runner/test-run-watch-repeatedly28799 ---28800 duration_ms: 1813.9440028801 ...28802ok 5515 test-runner/test-run-watch-run-duration28803 ---28804 duration_ms: 1814.2720028805 ...28806ok 5516 test-runner/test-run-watch-without-file28807 ---28808 duration_ms: 1916.2140028809 ...28810ok 5517 test-runner/test-watch-dependency-isolation-none28811 ---28812 duration_ms: 1514.2890028813 ...28814ok 5518 test-runner/test-watch-delete-isolation-none28815 ---28816 duration_ms: 2512.2180028817 ...28818ok 5519 test-runner/test-watch-dependency-isolation-process28819 ---28820 duration_ms: 1511.4160028821 ...28822ok 5520 test-runner/test-watch-delete-isolation-process28823 ---28824 duration_ms: 2512.6630028825 ...28826ok 5521 test-runner/test-watch-esm-dependency-isolation-none28827 ---28828 duration_ms: 1514.7230028829 ...28830ok 5522 test-runner/test-watch-esm-dependency-isolation-process28831 ---28832 duration_ms: 1512.0910028833 ...28834ok 5523 test-runner/test-watch-no-file-isolation-none28835 ---28836 duration_ms: 1523.5280028837 ...28838ok 5524 test-runner/test-watch-no-file-isolation-process28839 ---28840 duration_ms: 1514.1540028841 ...28842ok 5525 test-runner/test-watch-rename-isolation-none28843 ---28844 duration_ms: 1511.5670028845 ...28846ok 5526 test-runner/test-watch-rename-isolation-process28847 ---28848 duration_ms: 1511.5870028849 ...28850ok 5527 test-runner/test-watch-run-repeatedly-isolation-none28851 ---28852 duration_ms: 1511.3380028853 ...28854ok 5528 test-runner/test-watch-run-repeatedly-isolation-process28855 ---28856 duration_ms: 1511.9400028857 ...28858ok 5529 pummel/test-array-hash-collision28859 ---28860 duration_ms: 610.5310028861 ...28862ok 5530 pummel/test-blob-slice-with-large-size28863 ---28864 duration_ms: 1411.1070028865 ...28866ok 5531 pummel/test-buffer-large-size-buffer-alloc28867 ---28868 duration_ms: 1511.7680028869 ...28870ok 5532 pummel/test-buffer-large-size-buffer-alloc-unsafe28871 ---28872 duration_ms: 1511.0280028873 ...28874ok 5533 pummel/test-buffer-large-size-buffer-alloc-unsafe-slow28875 ---28876 duration_ms: 1511.4120028877 ...28878ok 5534 pummel/test-buffer-large-size-buffer-write28879 ---28880 duration_ms: 170.1510028881 ...28882ok 5535 pummel/test-buffer-large-size-copy28883 ---28884 duration_ms: 4015.2240028885 ...28886ok 5536 pummel/test-buffer-large-size-slowbuffer28887 ---28888 duration_ms: 1511.7150028889 ...28890ok 5537 pummel/test-child-process-spawn-loop28891 ---28892 duration_ms: 1712.4760028893 ...28894ok 5538 pummel/test-crypto-argon2-nonblocking-constructor28895 ---28896 duration_ms: 2513.3340028897 ...28898ok 5539 pummel/test-crypto-dh-hash28899 ---28900 duration_ms: 509.8970028901 ...28902ok 5540 pummel/test-crypto-dh-keys28903 ---28904 duration_ms: 810.9280028905 ...28906ok 5541 pummel/test-crypto-pqc-sign-verify-slh-dsa28907 ---28908 duration_ms: 14548.5770028909 ...28910ok 5542 pummel/test-dh-regr28911 ---28912 duration_ms: 86755.3390028913 ...28914ok 5543 pummel/test-fs-largefile28915 ---28916 duration_ms: 171.1500028917 ...28918ok 5544 pummel/test-fs-read-file-sync-utf8-memory28919 ---28920 duration_ms: 1110.9760028921 ...28922ok 5545 pummel/test-fs-readfile-tostring-fail28923 ---28924 duration_ms: 1311.3460028925 ...28926ok 5546 pummel/test-heap-profile-and-snapshot-near-heap-limit28927 ---28928 duration_ms: 1411.0800028929 ...28930ok 5547 pummel/test-heap-profile-near-heap-limit28931 ---28932 duration_ms: 1210.9850028933 ...28934ok 5548 pummel/test-heapdump-dns28935 ---28936 duration_ms: 3415.3610028937 ...28938ok 5549 pummel/test-heapdump-env28939 ---28940 duration_ms: 1311.2890028941 ...28942ok 5550 pummel/test-heapdump-fs-promise28943 ---28944 duration_ms: 2513.9580028945 ...28946ok 5551 pummel/test-heapdump-http228947 ---28948 duration_ms: 5016.1440028949 ...28950ok 5552 pummel/test-heapdump-inspector28951 ---28952 duration_ms: 2413.0230028953 ...28954ok 5553 pummel/test-heapdump-shadow-realm28955 ---28956 duration_ms: 7376.5220028957 ...28958ok 5554 pummel/test-heapdump-tls28959 ---28960 duration_ms: 4527.5810028961 ...28962ok 5555 pummel/test-heapdump-urlpattern28963 ---28964 duration_ms: 4019.6250028965 ...28966ok 5556 pummel/test-heapdump-vm-script28967 ---28968 duration_ms: 2528.2850028969 ...28970ok 5557 pummel/test-heapdump-worker28971 ---28972 duration_ms: 3958.8060028973 ...28974ok 5558 pummel/test-heapdump-zlib28975 ---28976 duration_ms: 50865.6170028977 ...28978ok 5559 pummel/test-heapdump-zstd28979 ---28980 duration_ms: 5654.0290028981 ...28982ok 5560 pummel/test-heapsnapshot-near-heap-limit28983 ---28984 duration_ms: 12901.2420028985 ...28986ok 5561 pummel/test-heapsnapshot-near-heap-limit-big28987 ---28988 duration_ms: 10079.3890028989 ...28990ok 5562 pummel/test-heapsnapshot-near-heap-limit-bounded28991 ---28992 duration_ms: 8768.0910028993 ...28994ok 5563 pummel/test-heapsnapshot-near-heap-limit-by-api28995 ---28996 duration_ms: 14774.8910028997 ...28998ok 5564 pummel/test-http-many-keep-alive-connections28999 ---29000 duration_ms: 4282.5530029001 ...29002ok 5565 pummel/test-http-upload-timeout29003 ---29004 duration_ms: 3734.7070029005 ...29006ok 5566 pummel/test-https-large-response29007 ---29008 duration_ms: 1421.2050029009 ...29010ok 5567 pummel/test-https-no-reader29011 ---29012 duration_ms: 2954.4220029013 ...29014ok 5568 pummel/test-keep-alive # skip test requires `wrk` to be installed first29015 ---29016 duration_ms: 333.7090029017 ...29018ok 5569 pummel/test-net-many-clients29019 ---29020 duration_ms: 811.6430029021 ...29022ok 5570 pummel/test-net-pause29023 ---29024 duration_ms: 3046.8290029025 ...29026ok 5571 pummel/test-net-pingpong29027 ---29028 duration_ms: 1738.0410029029 ...29030ok 5572 pummel/test-net-pingpong-delay29031 ---29032 duration_ms: 1312.2610029033 ...29034ok 5573 pummel/test-net-timeout29035 ---29036 duration_ms: 4195.6270029037 ...29038ok 5574 pummel/test-net-timeout229039 ---29040 duration_ms: 5468.0740029041 ...29042ok 5575 pummel/test-net-write-callbacks29043 ---29044 duration_ms: 4172.1680029045 ...29046ok 5576 pummel/test-next-tick-infinite-calls29047 ---29048 duration_ms: 16430.0430029049 ...29050ok 5577 pummel/test-process-cpuUsage29051 ---29052 duration_ms: 1331.5010029053 ...29054ok 5578 pummel/test-process-hrtime29055 ---29056 duration_ms: 2339.3200029057 ...29058ok 5579 pummel/test-regress-GH-89229059 ---29060 duration_ms: 1187.7920029061 ...29062ok 5580 pummel/test-repl-paste-big-data29063 ---29064 duration_ms: 1621.8080029065 ...29066ok 5581 pummel/test-stream-pipe-multi29067 ---29068 duration_ms: 2722.2360029069 ...29070ok 5582 pummel/test-string-decoder-large-buffer29071 ---29072 duration_ms: 171.1800029073 ...29074ok 5583 pummel/test-structuredclone-jstransferable29075 ---29076 duration_ms: 1324.4140029077 ...29078ok 5584 pummel/test-timers29079 ---29080 duration_ms: 3319.0670029081 ...29082ok 5585 pummel/test-tls-server-large-request29083 ---29084 duration_ms: 329.2970029085 ...29086ok 5586 pummel/test-tls-throttle29087 ---29088 duration_ms: 415.5200029089 ...29090ok 5587 pummel/test-vm-memleak29091 ---29092 duration_ms: 5946.3750029093 ...29094ok 5588 pummel/test-vm-race29095 ---29096 duration_ms: 5316.4770029097 ...29098ok 5589 pummel/test-watch-file29099 ---29100 duration_ms: 5260.7890029101 ...29102ok 5590 pummel/test-webcrypto-derivebits-pbkdf229103 ---29104 duration_ms: 5734.1880029105 ...29106ok 5591 pummel/test-webcrypto-kangarootwelve-32bit-overflow # skip only relevant when kMaxLength < 2^3229107 ---29108 duration_ms: 170.3180029109 ...29110ok 5592 pummel/test-worker-take-heapsnapshot29111 ---29112 duration_ms: 910.0640029113 ...29114ok 5593 pummel/test-zlib-zip-slow29115 ---29116 duration_ms: 17443.6400029117 ...29118ok 5594 wpt/test-abort29119 ---29120 duration_ms: 2413.9810029121 ...29122ok 5595 wpt/test-atob29123 ---29124 duration_ms: 412.1730029125 ...29126ok 5596 wpt/test-blob29127 ---29128 duration_ms: 717.4680029129 ...29130ok 5597 wpt/test-broadcastchannel29131 ---29132 duration_ms: 411.7090029133 ...29134ok 5598 wpt/test-compression29135 ---29136 duration_ms: 1939.5190029137 ...29138ok 5599 wpt/test-console29139 ---29140 duration_ms: 718.1840029141 ...29142ok 5600 wpt/test-encoding29143 ---29144 duration_ms: 1953.1190029145 ...29146ok 5601 wpt/test-events29147 ---29148 duration_ms: 716.3810029149 ...29150ok 5602 wpt/test-file29151 ---29152 duration_ms: 410.6460029153 ...29154ok 5603 wpt/test-hr-time29155 ---29156 duration_ms: 2419.0780029157 ...29158ok 5604 wpt/test-microtask-queuing29159 ---29160 duration_ms: 332.8230029161 ...29162ok 5605 wpt/test-performance-timeline29163 ---29164 duration_ms: 2923.0510029165 ...29166ok 5606 wpt/test-resource-timing29167 ---29168 duration_ms: 711.2170029169 ...29170ok 5607 wpt/test-streams29171 ---29172 duration_ms: 5560.5040029173 ...29174ok 5608 wpt/test-structured-clone29175 ---29176 duration_ms: 410.0360029177 ...29178ok 5609 wpt/test-timers29179 ---29180 duration_ms: 1319.6640029181 ...29182ok 5610 wpt/test-url # skip Different versions of Ada affect the WPT tests29183 ---29184 duration_ms: 137.1130029185 ...29186ok 5611 wpt/test-urlpattern29187 ---29188 duration_ms: 616.6240029189 ...29190ok 5612 wpt/test-wasm-jsapi29191 ---29192 duration_ms: 4270.7620029193 ...29194ok 5613 wpt/test-wasm-webapi29195 ---29196 duration_ms: 715.0950029197 ...29198ok 5614 wpt/test-web-locks29199 ---29200 duration_ms: 3314.2310029201 ...29202ok 5615 wpt/test-webcrypto29203 ---29204 duration_ms: 39857.6440029205 ...29206ok 5616 wpt/test-webidl29207 ---29208 duration_ms: 924.7820029209 ...29210ok 5617 wpt/test-webstorage29211 ---29212 duration_ms: 2913.1700029213 ...29214ok 5618 wpt/test-workers29215 ---29216 duration_ms: 1931.6590029217 ...29218ok 5619 sequential/test-async-wrap-getasyncid29219 ---29220 duration_ms: 514.2230029221 ...29222ok 5620 sequential/test-buffer-creation-regression29223 ---29224 duration_ms: 171.2920029225 ...29226ok 5621 sequential/test-child-process-emfile29227 ---29228 duration_ms: 329.8300029229 ...29230ok 5622 sequential/test-child-process-execsync29231 ---29232 duration_ms: 1011.1440029233 ...29234ok 5623 sequential/test-child-process-exit29235 ---29236 duration_ms: 911.3330029237 ...29238ok 5624 sequential/test-child-process-pass-fd29239 ---29240 duration_ms: 1844.2400029241 ...29242ok 5625 sequential/test-cli-syntax-bad29243 ---29244 duration_ms: 1111.7300029245 ...29246ok 5626 sequential/test-cli-syntax-file-not-found29247 ---29248 duration_ms: 263.6490029249 ...29250ok 5627 sequential/test-cli-syntax-good29251 ---29252 duration_ms: 415.4750029253 ...29254ok 5628 sequential/test-cli-syntax-require29255 ---29256 duration_ms: 509.5860029257 ...29258ok 5629 sequential/test-cluster-inspect-brk29259 ---29260 duration_ms: 264.3230029261 ...29262ok 5630 sequential/test-cluster-net-listen-ipv6only-none29263 ---29264 duration_ms: 410.4640029265 ...29266ok 5631 sequential/test-cluster-net-listen-ipv6only-rr29267 ---29268 duration_ms: 409.9550029269 ...29270ok 5632 sequential/test-cluster-port-reuse-between-workers29271 ---29272 duration_ms: 510.1240029273 ...29274ok 5633 sequential/test-cluster-send-handle-large-payload29275 ---29276 duration_ms: 329.0400029277 ...29278ok 5634 sequential/test-cpu-prof-default29279 ---29280 duration_ms: 2012.5990029281 ...29282ok 5635 sequential/test-cpu-prof-dir-absolute29283 ---29284 duration_ms: 2111.9680029285 ...29286ok 5636 sequential/test-cpu-prof-dir-and-name29287 ---29288 duration_ms: 2113.5120029289 ...29290ok 5637 sequential/test-cpu-prof-dir-relative29291 ---29292 duration_ms: 2112.4150029293 ...29294ok 5638 sequential/test-cpu-prof-drained29295 ---29296 duration_ms: 2111.6990029297 ...29298ok 5639 sequential/test-cpu-prof-exit29299 ---29300 duration_ms: 510.1520029301 ...29302ok 5640 sequential/test-cpu-prof-invalid-options29303 ---29304 duration_ms: 409.6800029305 ...29306ok 5641 sequential/test-cpu-prof-kill29307 ---29308 duration_ms: 511.2450029309 ...29310ok 5642 sequential/test-cpu-prof-name29311 ---29312 duration_ms: 4015.0040029313 ...29314ok 5643 sequential/test-cpu-prof-worker-argv29315 ---29316 duration_ms: 2112.1920029317 ...29318ok 5644 sequential/test-crypto-timing-safe-equal29319 ---29320 duration_ms: 170.2210029321 ...29322ok 5645 sequential/test-crypto-timing-safe-equal-fast29323 ---29324 duration_ms: 211.8370029325 ...29326ok 5646 sequential/test-debug-prompt29327 ---29328 duration_ms: 810.4940029329 ...29330ok 5647 sequential/test-debugger-custom-port29331 ---29332 duration_ms: 810.0040029333 ...29334ok 5648 sequential/test-debugger-debug-brk29335 ---29336 duration_ms: 264.1260029337 ...29338ok 5649 sequential/test-debugger-invalid-args29339 ---29340 duration_ms: 5418.0690029341 ...29342ok 5650 sequential/test-debugger-launch29343 ---29344 duration_ms: 909.9950029345 ...29346ok 5651 sequential/test-debugger-pid29347 ---29348 duration_ms: 609.9070029349 ...29350ok 5652 sequential/test-deprecation-flags29351 ---29352 duration_ms: 329.6650029353 ...29354ok 5653 sequential/test-dgram-bind-shared-ports29355 ---29356 duration_ms: 511.8030029357 ...29358ok 5654 sequential/test-dgram-implicit-bind-failure29359 ---29360 duration_ms: 171.6330029361 ...29362ok 5655 sequential/test-dgram-pingpong29363 ---29364 duration_ms: 171.1500029365 ...29366ok 5656 sequential/test-diagnostic-dir-cpu-prof29367 ---29368 duration_ms: 3918.4610029369 ...29370ok 5657 sequential/test-diagnostic-dir-heap-prof29371 ---29372 duration_ms: 2313.4560029373 ...29374ok 5658 sequential/test-dtls-interop-openssl-client # skip DTLS is not enabled29375 ---29376 duration_ms: 170.9820029377 ...29378ok 5659 sequential/test-dtls-interop-openssl-server # skip DTLS is not enabled29379 ---29380 duration_ms: 171.2930029381 ...29382ok 5660 sequential/test-error-serdes29383 ---29384 duration_ms: 171.9420029385 ...29386ok 5661 sequential/test-fs-opendir-recursive29387 ---29388 duration_ms: 329.1790029389 ...29390ok 5662 sequential/test-fs-readdir-recursive29391 ---29392 duration_ms: 264.5480029393 ...29394ok 5663 sequential/test-fs-stat-sync-overflow29395 ---29396 duration_ms: 328.8320029397 ...29398ok 5664 sequential/test-gc-http-client29399 ---29400 duration_ms: 510.0310029401 ...29402ok 5665 sequential/test-gc-http-client-onerror29403 ---29404 duration_ms: 510.2550029405 ...29406ok 5666 sequential/test-gc-http-client-timeout29407 ---29408 duration_ms: 910.4390029409 ...29410ok 5667 sequential/test-get-heapsnapshot-options29411 ---29412 duration_ms: 2713.8440029413 ...29414ok 5668 sequential/test-heapdump29415 ---29416 duration_ms: 1113.0000029417 ...29418ok 5669 sequential/test-heapdump-flag29419 ---29420 duration_ms: 912.3420029421 ...29422ok 5670 sequential/test-heapdump-flag-custom-dir29423 ---29424 duration_ms: 910.3410029425 ...29426ok 5671 sequential/test-http-econnrefused29427 ---29428 duration_ms: 212.2610029429 ...29430ok 5672 sequential/test-http-keep-alive-large-write29431 ---29432 duration_ms: 212.7820029433 ...29434ok 5673 sequential/test-http-keepalive-maxsockets29435 ---29436 duration_ms: 509.8870029437 ...29438ok 5674 sequential/test-http-regr-gh-292829439 ---29440 duration_ms: 211.9280029441 ...29442ok 5675 sequential/test-http-server-keep-alive-timeout-slow-client-headers29443 ---29444 duration_ms: 2012.4840029445 ...29446ok 5676 sequential/test-http-server-keep-alive-timeout-slow-server29447 ---29448 duration_ms: 811.3110029449 ...29450ok 5677 sequential/test-http2-max-session-memory29451 ---29452 duration_ms: 212.1680029453 ...29454ok 5678 sequential/test-http2-ping-flood29455 ---29456 duration_ms: 263.8440029457 ...29458ok 5679 sequential/test-http2-settings-flood29459 ---29460 duration_ms: 263.0780029461 ...29462ok 5680 sequential/test-http2-timeout-large-write29463 ---29464 duration_ms: 2914.0460029465 ...29466ok 5681 sequential/test-http2-timeout-large-write-file29467 ---29468 duration_ms: 2913.0780029469 ...29470ok 5682 sequential/test-https-connect-localport29471 ---29472 duration_ms: 6319.7510029473 ...29474ok 5683 sequential/test-https-server-keep-alive-timeout29475 ---29476 duration_ms: 1912.8060029477 ...29478ok 5684 sequential/test-init29479 ---29480 duration_ms: 328.6940029481 ...29482ok 5685 sequential/test-inspector-network-resource29483 ---29484 duration_ms: 2012.2630029485 ...29486ok 5686 sequential/test-inspector-open-dispose29487 ---29488 duration_ms: 329.1950029489 ...29490ok 5687 sequential/test-inspector-port-cluster29491 ---29492 duration_ms: 1135.1690029493 ...29494ok 5688 sequential/test-module-loading29495 ---29496 duration_ms: 264.0490029497 ...29498ok 5689 sequential/test-net-GH-550429499 ---29500 duration_ms: 509.7270029501 ...29502ok 5690 sequential/test-net-better-error-messages-port29503 ---29504 duration_ms: 172.2160029505 ...29506ok 5691 sequential/test-net-connect-econnrefused29507 ---29508 duration_ms: 328.8420029509 ...29510ok 5692 sequential/test-net-connect-handle-econnrefused29511 ---29512 duration_ms: 170.5440029513 ...29514ok 5693 sequential/test-net-connect-local-error29515 ---29516 duration_ms: 170.8450029517 ...29518ok 5694 sequential/test-net-listen-ipv6only29519 ---29520 duration_ms: 170.7780029521 ...29522ok 5695 sequential/test-net-listen-shared-ports29523 ---29524 duration_ms: 511.1110029525 ...29526ok 5696 sequential/test-net-localport29527 ---29528 duration_ms: 171.7620029529 ...29530ok 5697 sequential/test-net-reconnect-error29531 ---29532 duration_ms: 211.5230029533 ...29534ok 5698 sequential/test-net-response-size29535 ---29536 duration_ms: 1411.1520029537 ...29538ok 5699 sequential/test-net-server-address29539 ---29540 duration_ms: 170.7000029541 ...29542ok 5700 sequential/test-net-server-bind29543 ---29544 duration_ms: 329.4270029545 ...29546ok 5701 sequential/test-net-server-listen-ipv6-link-local29547 ---29548 duration_ms: 212.8350029549 ...29550ok 5702 sequential/test-next-tick-error-spin29551 ---29552 duration_ms: 328.3530029553 ...29554ok 5703 sequential/test-perf-hooks29555 ---29556 duration_ms: 1312.6800029557 ...29558ok 5704 sequential/test-performance-eventloopdelay29559 ---29560 duration_ms: 7323.7970029561 ...29562ok 5705 sequential/test-pipe29563 ---29564 duration_ms: 4517.4340029565 ...29566ok 5706 sequential/test-process-title29567 ---29568 duration_ms: 264.2650029569 ...29570ok 5707 sequential/test-process-warnings29571 ---29572 duration_ms: 265.0350029573 ...29574ok 5708 sequential/test-repl-timeout-throw29575 ---29576 duration_ms: 510.4170029577 ...29578ok 5709 sequential/test-require-cache-without-stat29579 ---29580 duration_ms: 171.3570029581 ...29582ok 5710 sequential/test-resolution-inspect-brk29583 ---29584 duration_ms: 264.0930029585 ...29586ok 5711 sequential/test-stream2-fs29587 ---29588 duration_ms: 170.4870029589 ...29590ok 5712 sequential/test-stream2-stderr-sync29591 ---29592 duration_ms: 329.6480029593 ...29594ok 5713 sequential/test-timers-block-eventloop29595 ---29596 duration_ms: 212.3810029597 ...29598ok 5714 sequential/test-timers-set-interval-excludes-callback-duration29599 ---29600 duration_ms: 610.4410029601 ...29602ok 5715 sequential/test-tls-connect29603 ---29604 duration_ms: 212.3790029605 ...29606ok 5716 sequential/test-tls-lookup29607 ---29608 duration_ms: 170.5430029609 ...29610ok 5717 sequential/test-tls-psk-client # skip missing openssl cli29611 ---29612 duration_ms: 170.5850029613 ...29614ok 5718 sequential/test-tls-session-timeout # skip node compiled without OpenSSL CLI.29615 ---29616 duration_ms: 170.5440029617 ...29618ok 5719 sequential/test-util-debug29619 ---29620 duration_ms: 1025.3840029621 ...29622ok 5720 sequential/test-vm-break-on-sigint29623 ---29624 duration_ms: 411.5790029625 ...29626ok 5721 sequential/test-vm-timeout-escape-promise-module-229627 ---29628 duration_ms: 170.4510029629 ...29630ok 5722 sequential/test-vm-timeout-rethrow29631 ---29632 duration_ms: 328.8490029633 ...29634ok 5723 sequential/test-watch-mode-restart-esm-loading-error29635 ---29636 duration_ms: 2413.0400029637 ...29638ok 5724 sequential/test-watch-mode-watch-flags29639 ---29640 duration_ms: 610.0680029641 ...29642ok 5725 sequential/test-watch-mode-worker29643 ---29644 duration_ms: 3315.1810029645 ...29646ok 5726 sequential/test-without-async-context-frame29647 ---29648 duration_ms: 2419.7110029649 ...29650ok 5727 sequential/test-worker-eventlooputil29651 ---29652 duration_ms: 409.5590029653 ...29654ok 5728 sequential/test-worker-fshandles-error-on-termination29655 ---29656 duration_ms: 615.7440029657 ...29658ok 5729 sequential/test-worker-fshandles-open-close-on-termination29659 ---29660 duration_ms: 611.1970029661 ...29662ok 5730 sequential/test-worker-heapsnapshot-options29663 ---29664 duration_ms: 1311.1980029665 ...29666ok 5731 sequential/test-worker-prof29667 ---29668 duration_ms: 2213.6710029669 ...29670ok 5732 sequential/test-write-heapsnapshot-options29671 ---29672 duration_ms: 2713.2360029673 ...29674ok 5733 sequential/test-zlib-crc32-fast-api29675 ---29676 duration_ms: 212.6040029677 ...29678ok 5734 abort/test-abort-backtrace29679 ---29680 duration_ms: 524.4170029681 ...29682ok 5735 abort/test-abort-fatal-error29683 ---29684 duration_ms: 519.8100029685 ...29686ok 5736 abort/test-abort-uncaught-exception29687 ---29688 duration_ms: 519.0760029689 ...29690ok 5737 abort/test-addon-register-signal-handler # skip binding not built yet29691 ---29692 duration_ms: 145.3340029693 ...29694ok 5738 abort/test-addon-uv-handle-leak # skip binding not built yet29695 ---29696 duration_ms: 144.2020029697 ...29698ok 5739 abort/test-http-parser-consume29699 ---29700 duration_ms: 517.6320029701 ...29702ok 5740 abort/test-process-abort-exitcode29703 ---29704 duration_ms: 418.7690029705 ...29706ok 5741 abort/test-signal-handler29707 ---29708 duration_ms: 415.7770029709 ...29710ok 5742 abort/test-worker-abort-uncaught-exception29711 ---29712 duration_ms: 517.5650029713 ...29714ok 5743 abort/test-zlib-invalid-internals-usage29715 ---29716 duration_ms: 418.0560029717 ...29718ok 5744 wasm-allocation/test-wasm-allocation29719 ---29720 duration_ms: 177.2220029721 ...29722ok 5745 wasm-allocation/test-wasm-allocation-auto-adapt29723 ---29724 duration_ms: 177.4210029725 ...29726ok 5746 wasm-allocation/test-wasm-allocation-disable-trap-handler29727 ---29728 duration_ms: 178.1700029729 ...29730ok 5747 wasm-allocation/test-wasm-allocation-memory6429731 ---29732 duration_ms: 177.4130029733 ...29734ok 5748 known_issues/test-cli-print-var-crypto29735 ---29736 duration_ms: 410.2430029737 ...29738ok 5749 known_issues/test-cwd-enoent-file29739 ---29740 duration_ms: 328.8410029741 ...29742ok 5750 known_issues/test-dgram-bind-shared-ports-after-port-029743 ---29744 duration_ms: 509.5460029745 ...29746ok 5751 known_issues/test-fs-cp-async-buffer29747 ---29748 duration_ms: 170.1670029749 ...29750ok 5752 known_issues/test-fs-cp-filter29751 ---29752 duration_ms: 170.5170029753 ...29754ok 5753 known_issues/test-fs-cp-non-utf829755 ---29756 duration_ms: 170.8760029757 ...29758ok 5754 known_issues/test-fs-writeFileSync-invalid-windows29759 ---29760 duration_ms: 170.0720029761 ...29762ok 5755 known_issues/test-http-clientrequest-end-contentlength29763 ---29764 duration_ms: 211.9350029765 ...29766ok 5756 known_issues/test-http-clientrequest-end-empty-response-body29767 ---29768 duration_ms: 213.5390029769 ...29770ok 5757 known_issues/test-http-clientrequest-write-chunked29771 ---29772 duration_ms: 212.1230029773 ...29774ok 5758 known_issues/test-http-path-contains-unicode29775 ---29776 duration_ms: 137.0650029777 ...29778ok 5759 known_issues/test-inspector-cluster-port-clash29779 ---29780 duration_ms: 328.9870029781 ...29782ok 5760 known_issues/test-inspector-instrumentation-breakpoint29783 ---29784 duration_ms: 15435.8660029785 ...29786ok 5761 known_issues/test-repl-require-context29787 ---29788 duration_ms: 212.3400029789 ...29790ok 5762 known_issues/test-stdin-is-always-net.socket29791 ---29792 duration_ms: 328.8560029793 ...29794ok 5763 known_issues/test-stream-writable-sync-error29795 ---29796 duration_ms: 170.8160029797 ...29798ok 5764 known_issues/test-url-parse-conformance29799 ---29800 duration_ms: 212.3060029801 ...29802ok 5765 known_issues/test-vm-function-declaration-uses-define29803 ---29804 duration_ms: 137.4330029805 ...29806ok 5766 known_issues/test-vm-timeout-escape-nexttick29807 ---29808 duration_ms: 910.3370029809 ...2981029811Failed tests:29812out/Release/node /build/node-v26.9.0/test/parallel/test-fs-cp-async-file-modes.mjs29813make: *** [Makefile:631: test-ci-js] Error 1