nodejs-slim-26.9.0
checks.x86_64-linux.pkgs-hermes-desktop
· build #5016
· raw
1structuredAttrs is enabled
unpackPhase
2unpacking source archive /nix/store/7ajvk1c4mspigbdgf21bn9d7f7p9kmgk-node-v26.9.0.tar.xz3source root is node-v26.9.04setting SOURCE_DATE_EPOCH to timestamp 1789550914 of file "node-v26.9.0/tools/nix/v8.nix"patchPhase
5applying patch /nix/store/j4p9lc7z8hi4g40cpqpj3qxb9a7bvanp-configure-armv6-vfpv2.patch6patching file configure.py7Hunk #1 succeeded at 49 with fuzz 1 (offset -1 lines).8applying patch /nix/store/igz0qnjkvwi4f2mn7i13h3ndxl9n5ryi-node-npm-build-npm-package-logic.patch9patching file deps/npm/node_modules/@npmcli/run-script/lib/set-path.js10Hunk #1 succeeded at 13 with fuzz 2 (offset 1 line).11Hunk #2 succeeded at 37 (offset 8 lines).12patching file deps/npm/node_modules/pacote/lib/git.js13Hunk #1 succeeded at 186 (offset -2 lines).14patching file deps/npm/node_modules/@npmcli/arborist/lib/arborist/build-ideal-tree.js15Hunk #1 succeeded at 802 (offset 62 lines).16patching file deps/npm/node_modules/@npmcli/arborist/lib/arborist/load-actual.js17Hunk #1 succeeded at 121 with fuzz 1 (offset -26 lines).18applying patch /nix/store/57n0csr7hpdd0y91ljxpiwlfw7fsx3kl-use-correct-env-in-tests.patch19patching file test/parallel/test-child-process-default-options.js20patching file test/parallel/test-child-process-env.js21patching file test/parallel/test-child-process-exec-env.js22applying patch /nix/store/p2mhv95s89kaqmdynhz6y6asalf8y4dh-bin-sh-node-run-v22.patch23patching file test/fixtures/run-script/node_modules/.bin/positional-args24Hunk #1 succeeded at 1 with fuzz 1.25applying patch /nix/store/3za8p3x3hjfr1a9b1lc3z4aapp9sm2ja-use-nix-codesign.patch26patching file test/parallel/test-macos-app-sandbox.js27applying patch /nix/store/6whc7i794ygkcwjwrprw7y9aglfl238g-fix-temporal-integration-with-shared-icu.patch28patching file deps/v8/src/objects/js-temporal-zoneinfo64.cc29patching file tools/v8_gypfiles/v8.gyp30Hunk #1 succeeded at 1398 (offset 19 lines).31Hunk #2 succeeded at 2051 (offset 93 lines).updateAutotoolsGnuConfigScriptsPhase
32Updating Autotools / GNU config script to a newer upstream version: ./deps/cares/config/config.sub33Updating Autotools / GNU config script to a newer upstream version: ./deps/libffi/config.sub34Updating Autotools / GNU config script to a newer upstream version: ./deps/ngtcp2/ngtcp2/third-party/libev/config.sub35Updating Autotools / GNU config script to a newer upstream version: ./deps/cares/config/config.guess36Updating Autotools / GNU config script to a newer upstream version: ./deps/libffi/config.guess37Updating Autotools / GNU config script to a newer upstream version: ./deps/ngtcp2/ngtcp2/third-party/libev/config.guessconfigurePhase
38fixing libtool script ./deps/cares/config/ltmain.sh39fixing libtool script ./deps/libffi/ltmain.sh40fixing libtool script ./deps/ngtcp2/ngtcp2/third-party/libev/ltmain.sh41./deps/cares/configure42./deps/libffi/configure43./deps/ngtcp2/ngtcp2/third-party/libev/configure44configure flags: --prefix=/nix/store/mn8r5sjblqmigxv5lg89q4wcj5zqb16n-nodejs-slim-26.9.0 --ninja --with-intl=system-icu --openssl-use-def-ca-store --no-cross-compiling --dest-os=linux --dest-cpu=x64 --v8-enable-temporal-support --use-prefix-to-find-headers --shared-abseil --shared-abseil-libpath=/nix/store/iqvb7h1ykhm12304qwx17xbncrhhy1g4-abseil-cpp-20260107.1/lib --shared-ada --shared-ada-libpath=/nix/store/vk3yq4nzlrdvq1qxgy3764qaycanr0mc-ada-4.0.0/lib --shared-brotli --shared-brotli-libpath=/nix/store/xhgd6rb4h8ssid9yw8nvw74cwq69md5y-brotli-1.2.0-lib/lib --shared-cares --shared-cares-libpath=/nix/store/68syfccdbv3hlz7imlc9xl9fzyz4v8gx-c-ares-1.34.8/lib --shared-ffi --shared-ffi-libpath=/nix/store/3r5wfb1dl3sfknvy1yringvmap0hxj4r-libffi-3.8.0/lib --shared-gtest --shared-gtest-libpath=/nix/store/5sdsmm8s00hck28yp95fk993rg42mqsp-gtest-1.18.0/lib --shared-hdr-histogram --shared-hdr-histogram-libpath=/nix/store/9g532g9jf92xy9xh68p99ml815q11zs0-hdrhistogram_c-0.11.10/lib --shared-highway --shared-highway-libpath=/nix/store/xs1jbkdzxs4ym0rh89nx8xfwj387x3aj-libhwy-1.4.0/lib --shared-http-parser --shared-http-parser-libpath=/nix/store/1lw7d9jsv7qb6nvc4fmvvqsyphaacqcs-llhttp-9.4.3/lib --shared-libuv --shared-libuv-libpath=/nix/store/68b1blnvl4scgdq48d4p7h4lw4pm5w0w-libuv-1.52.1/lib --shared-lief --shared-lief-libpath=/nix/store/nx4g3j20wvgq36b406q6rysvqzzrxaci-lief-0.17.6/lib --shared-merve --shared-merve-libpath=/nix/store/2gj58j8rd88kaan7bsqhl9fjxxp11qqi-merve-1.2.2/lib --shared-nbytes --shared-nbytes-libpath=/nix/store/zf8c839ahp1fn736lih7ai2y14rrx2gn-nbytes-0.1.4/lib --shared-nghttp2 --shared-nghttp2-libpath=/nix/store/6avzrsm02jh7q48ym3hgznj3ypc2shc2-nghttp2-1.70.0-lib/lib --shared-nghttp3 --shared-nghttp3-libpath=/nix/store/dki4fkk75v2x4aqkszmi257wxq6rkkyr-nghttp3-1.16.0/lib --shared-ngtcp2 --shared-ngtcp2-libpath=/nix/store/2hc131frgdz45bjbajmpvlrj185lah7p-ngtcp2-1.23.0/lib --shared-openssl --shared-openssl-libpath=/nix/store/yj34vymbqf7mf4lmffipy8jqc4kwr1mc-openssl-3.6.4/lib --shared-simdjson --shared-simdjson-libpath=/nix/store/129shchmqszagbb0m8kk7ddzb7nnklxv-simdjson-4.6.8/lib --shared-simdutf --shared-simdutf-libpath=/nix/store/dw6xlar7m4qfrhbk63zhcc5pmixa1ga1-simdutf-9.1.0/lib --shared-sqlite --shared-sqlite-libpath=/nix/store/7a0nx1a0rdc5s07vxrsdhplqnzncl5z9-sqlite-3.53.3/lib --shared-temporal_capi --shared-temporal_capi-libpath=/nix/store/7hrx4vyx67h46xxwqj3zw4nafa1m8d04-temporal_capi-0.2.6/lib --shared-uvwasi --shared-uvwasi-libpath=/nix/store/qnbgx63w8yya5330xcxyixja3ah6gfzm-uvwasi-0.0.23/lib --shared-zlib --shared-zlib-libpath=/nix/store/lw86vj9kfwgvlivg3p8qg2nibpmhmsl9-zlib-1.3.2/lib --shared-zstd --shared-zstd-libpath=/nix/store/8ik1d1r4l2jzm9mjh6bc0a13yczx62wg-zstd-1.5.7/lib45INFO: configure completed successfullybuildPhase
46build flags: -j48 SHELL=/nix/store/svx59425zxp552p2b8gm11qj5r09b56i-bash-5.3p15/bin/bash47TERM=dumb ninja -C out/Release -j4848ninja: Entering directory `out/Release'49[1/1871] CXX obj/deps/v8/src/base/v8_libbase.abort-mode.o50[2/1871] CXX obj/deps/v8/src/base/v8_libbase.fpu.o51[3/1871] CXX obj/deps/v8/src/base/v8_libbase.once.o52[4/1871] CXX obj/deps/v8/src/base/v8_libbase.vlq-base64.o53[5/1871] CXX obj/deps/v8/src/base/v8_libbase.sys-info.o54[6/1871] CXX obj/deps/v8/src/base/v8_libbase.bits.o55[7/1871] CXX obj/deps/v8/src/base/v8_libbase.division-by-constant.o56[8/1871] CXX obj/deps/v8/src/base/debug/v8_libbase.stack_trace.o57[9/1871] CXX obj/deps/v8/src/base/numbers/v8_libbase.diy-fp.o58[10/1871] CXX obj/deps/v8/src/base/numbers/v8_libbase.cached-powers.o59[11/1871] CXX obj/deps/v8/src/base/v8_libbase.cpu.o60[12/1871] CXX obj/deps/v8/src/base/platform/v8_libbase.semaphore.o61[13/1871] CXX obj/deps/v8/src/base/platform/v8_libbase.platform-posix-time.o62[14/1871] CXX obj/deps/v8/src/base/platform/v8_libbase.platform.o63[15/1871] CXX obj/deps/v8/src/base/v8_libbase.file-utils.o64[16/1871] CXX obj/deps/v8/src/base/platform/v8_libbase.memory-protection-key.o65[17/1871] CXX obj/deps/v8/src/base/v8_libbase.strings.o66[18/1871] CXX obj/deps/v8/src/base/sanitizer/v8_libbase.lsan-page-allocator.o67[19/1871] CXX obj/deps/v8/src/base/v8_libbase.page-allocator.o68[20/1871] CXX obj/deps/v8/src/base/numbers/v8_libbase.bignum-dtoa.o69[21/1871] CXX obj/deps/v8/src/base/numbers/v8_libbase.dtoa.o70[22/1871] CXX obj/deps/v8/src/base/sanitizer/v8_libbase.lsan-virtual-address-space.o71[23/1871] CXX obj/deps/v8/src/base/v8_libbase.region-allocator.o72[24/1871] CXX obj/deps/v8/src/base/numbers/v8_libbase.strtod.o73[25/1871] ACTION Checking inspector protocol compatibility74[26/1871] CXX obj/deps/v8/src/base/numbers/v8_libbase.bignum.o75[27/1871] ACTION Generating temporal zoneinfo static data76[28/1871] CC obj/deps/v8/third_party/zlib/v8_zlib.compress.o77cc1: warning: command-line option '-fvisibility-inlines-hidden' is valid for C++/ObjC++ but not for C78[29/1871] CC obj/deps/v8/third_party/zlib/v8_zlib.cpu_features.o79cc1: warning: command-line option '-fvisibility-inlines-hidden' is valid for C++/ObjC++ but not for C80[30/1871] CXX obj/deps/v8/src/base/numbers/v8_libbase.fast-dtoa.o81[31/1871] CXX obj/deps/v8/src/base/debug/v8_libbase.stack_trace_posix.o82[32/1871] CXX obj/deps/v8/src/base/platform/v8_libbase.platform-linux.o83[33/1871] CC obj/deps/v8/third_party/zlib/v8_zlib.adler32.o84cc1: warning: command-line option '-fvisibility-inlines-hidden' is valid for C++/ObjC++ but not for C85[34/1871] CC obj/deps/v8/third_party/zlib/v8_zlib.gzclose.o86cc1: warning: command-line option '-fvisibility-inlines-hidden' is valid for C++/ObjC++ but not for C87[35/1871] CXX obj/deps/v8/src/base/numbers/v8_libbase.fixed-dtoa.o88[36/1871] CC obj/deps/v8/third_party/zlib/v8_zlib.gzlib.o89cc1: warning: command-line option '-fvisibility-inlines-hidden' is valid for C++/ObjC++ but not for C90[37/1871] CC obj/deps/v8/third_party/zlib/v8_zlib.crc32.o91cc1: warning: command-line option '-fvisibility-inlines-hidden' is valid for C++/ObjC++ but not for C92[38/1871] CC obj/deps/v8/third_party/zlib/v8_zlib.gzread.o93cc1: warning: command-line option '-fvisibility-inlines-hidden' is valid for C++/ObjC++ but not for C94[39/1871] CC obj/deps/v8/third_party/zlib/v8_zlib.gzwrite.o95cc1: warning: command-line option '-fvisibility-inlines-hidden' is valid for C++/ObjC++ but not for C96[40/1871] CXX obj/deps/v8/src/base/v8_libbase.ieee754.o97[41/1871] CC obj/deps/v8/third_party/zlib/v8_zlib.uncompr.o98cc1: warning: command-line option '-fvisibility-inlines-hidden' is valid for C++/ObjC++ but not for C99[42/1871] ACTION Generating inspector protocol sources from protocol json100[43/1871] STAMP obj/tools/v8_gypfiles/v8_inspector_headers.actions_rules_copies.stamp101[44/1871] CC obj/deps/v8/third_party/zlib/v8_zlib.zutil.o102cc1: warning: command-line option '-fvisibility-inlines-hidden' is valid for C++/ObjC++ but not for C103[45/1871] CC obj/deps/v8/third_party/zlib/v8_zlib.inffast.o104cc1: warning: command-line option '-fvisibility-inlines-hidden' is valid for C++/ObjC++ but not for C105[46/1871] CXX obj/deps/v8/src/base/platform/v8_libbase.condition-variable.o106[47/1871] CC obj/deps/v8/third_party/zlib/v8_zlib.inftrees.o107cc1: warning: command-line option '-fvisibility-inlines-hidden' is valid for C++/ObjC++ but not for C108[48/1871] CC obj/deps/v8/third_party/zlib/v8_zlib.infback.o109cc1: warning: command-line option '-fvisibility-inlines-hidden' is valid for C++/ObjC++ but not for C110[49/1871] CXX obj/deps/v8/third_party/zlib/google/v8_zlib.compression_utils_portable.o111[50/1871] CXX obj/deps/v8/src/base/v8_libbase.logging.o112[51/1871] CXX obj/deps/v8/src/base/platform/v8_libbase.time.o113[52/1871] CXX obj/deps/v8/src/base/platform/v8_libbase.mutex.o114[53/1871] CC obj/deps/v8/third_party/zlib/v8_zlib.trees.o115cc1: warning: command-line option '-fvisibility-inlines-hidden' is valid for C++/ObjC++ but not for C116[54/1871] CXX obj/deps/v8/src/base/v8_libbase.virtual-address-space.o117[55/1871] CXX obj/deps/v8/src/base/utils/v8_libbase.random-number-generator.o118[56/1871] CC obj/deps/v8/third_party/zlib/v8_zlib.deflate.o119cc1: warning: command-line option '-fvisibility-inlines-hidden' is valid for C++/ObjC++ but not for C120[57/1871] CXX obj/deps/v8/src/base/v8_libbase.virtual-address-space-page-allocator.o121[58/1871] CXX obj/deps/v8/src/base/v8_libbase.bounded-page-allocator.o122[59/1871] CXX obj/deps/v8/src/base/platform/v8_libbase.platform-posix.o123[60/1871] CXX obj/deps/v8/src/interpreter/bytecode_builtins_list_generator.bytecode-operands.o124[61/1871] CXX obj/deps/v8/src/base/v8_libbase.emulated-virtual-address-subspace.o125[62/1871] AR obj/tools/v8_gypfiles/libv8_libbase.a126[63/1871] STAMP obj/tools/v8_gypfiles/v8_flags.actions_depends.stamp127[64/1871] CXX obj/deps/v8/src/regexp/gen-regexp-special-case.gen-regexp-special-case.o128[65/1871] CC obj/deps/v8/third_party/zlib/v8_zlib.inflate.o129cc1: warning: command-line option '-fvisibility-inlines-hidden' is valid for C++/ObjC++ but not for C130[66/1871] CXX obj/deps/v8/src/torque/torque_base.cpp-builder.o131[67/1871] AR obj/tools/v8_gypfiles/libv8_zlib.a132[68/1871] CXX obj/deps/v8/src/torque/torque_base.source-positions.o133[69/1871] CXX obj/deps/v8/src/interpreter/bytecode_builtins_list_generator.bytecodes.o134[70/1871] CXX obj/src/node_js2c.embedded_data.o135[71/1871] CXX obj/deps/v8/src/builtins/bytecode_builtins_list_generator.generate-bytecodes-builtins-list.o136[72/1871] CXX obj/deps/v8/src/libplatform/v8_libplatform.default-thread-isolated-allocator.o137[73/1871] LINK gen-regexp-special-case138[74/1871] CXX obj/src/node_js2c.builtin_info.o139[75/1871] ACTION run_gen-regexp-special-case: run_gen-regexp-special-case_action_72d03329d19e24c609ee6e65eeeb110034e9261c37b8a8d83522628d574e9fa7140[76/1871] LINK bytecode_builtins_list_generator141[77/1871] CXX obj/deps/v8/src/libplatform/tracing/v8_libplatform.trace-object.o142[78/1871] CXX obj/deps/v8/src/libplatform/tracing/v8_libplatform.trace-config.o143[79/1871] ACTION generate_bytecode_builtins_list: generate_bytecode_builtins_list_action_73a03d1964edbe79fc19deb968fa21d5c456544c3d095b62158c8959ed2aeed1144[80/1871] CXX obj/deps/inspector_protocol/crdtp/crdtp.error_support.o145[81/1871] CC obj/test/nop/nop.nop.o146[82/1871] CC obj/test/overlapped-checker/overlapped-checker.main_unix.o147[83/1871] CXX obj/deps/ncrypto/ncrypto_engine.engine.o148[84/1871] AR obj/deps/ncrypto/libncrypto_engine.a149[85/1871] CXX obj/deps/inspector_protocol/crdtp/crdtp.json_platform.o150[86/1871] CXX obj/deps/v8/src/libplatform/tracing/v8_libplatform.trace-writer.o151[87/1871] CXX obj/deps/inspector_protocol/crdtp/crdtp.span.o152[88/1871] LINK nop153[89/1871] LINK overlapped-checker154[90/1871] CXX obj/deps/v8/src/torque/torque_base.declarable.o155[91/1871] CXX obj/deps/v8/src/torque/torque_base.type-inference.o156[92/1871] CXX obj/deps/inspector_protocol/crdtp/crdtp.serializable.o157[93/1871] CXX obj/deps/v8/src/torque/torque_base.global-context.o158[94/1871] CXX obj/deps/v8/src/libplatform/v8_libplatform.task-queue.o159[95/1871] CXX obj/deps/inspector_protocol/crdtp/crdtp.status.o160[96/1871] CXX obj/deps/v8/src/torque/torque_base.torque-code-generator.o161[97/1871] CXX obj/deps/v8/src/libplatform/v8_libplatform.worker-thread.o162[98/1871] CXX obj/deps/v8/src/libplatform/v8_libplatform.default-job.o163[99/1871] CXX obj/deps/v8/src/libplatform/v8_libplatform.default-worker-threads-task-runner.o164[100/1871] CXX obj/deps/v8/src/torque/torque_base.type-oracle.o165[101/1871] CXX obj/deps/v8/src/libplatform/v8_libplatform.delayed-task-queue.o166[102/1871] CXX obj/deps/v8/src/libplatform/tracing/v8_libplatform.trace-buffer.o167[103/1871] CXX obj/deps/v8/src/torque/torque_base.earley-parser.o168[104/1871] CXX obj/deps/inspector_protocol/crdtp/crdtp.protocol_core.o169[105/1871] CXX obj/deps/v8/src/torque/torque_base.utils.o170[106/1871] CXX obj/deps/v8/src/libplatform/v8_libplatform.default-foreground-task-runner.o171[107/1871] CXX obj/deps/v8/src/libplatform/v8_libplatform.default-platform.o172[108/1871] CXX obj/deps/v8/src/torque/torque_base.server-data.o173[109/1871] CXX obj/deps/v8/src/libplatform/tracing/v8_libplatform.tracing-controller.o174[110/1871] AR obj/tools/v8_gypfiles/libv8_libplatform.a175[111/1871] CXX obj/deps/v8/src/torque/torque_base.kythe-data.o176[112/1871] CXX obj/deps/inspector_protocol/crdtp/crdtp.cbor.o177[113/1871] CXX obj/deps/v8/src/torque/torque_base.cfg.o178[114/1871] CXX obj/deps/inspector_protocol/crdtp/crdtp.dispatch.o179[115/1871] CXX obj/deps/v8/src/torque/torque_base.class-debug-reader-generator.o180[116/1871] CXX obj/deps/v8/src/torque/torque_base.instance-type-generator.o181[117/1871] CXX obj/deps/v8/src/torque/torque_base.cc-generator.o182[118/1871] CXX obj/deps/v8/src/torque/torque.torque.o183[119/1871] CXX obj/deps/v8/src/torque/torque_base.declaration-visitor.o184[120/1871] CXX obj/tools/node_js2c.js2c.o185[121/1871] LINK node_js2c186[122/1871] STAMP obj/node_base.actions_depends.stamp187[123/1871] CXX obj/deps/v8/src/torque/torque_base.csa-generator.o188[124/1871] ACTION node_base: convert_node_protocol_to_json_f26a10641803f604d1307d23f68bde8b450ad8f073bd43313642df31e7a3478c189[125/1871] ACTION node_base: node_js2c_f26a10641803f604d1307d23f68bde8b450ad8f073bd43313642df31e7a3478c190[126/1871] CXX obj/deps/v8/src/torque/torque_base.declarations.o191[127/1871] ACTION node_base: concatenate_protocols_f26a10641803f604d1307d23f68bde8b450ad8f073bd43313642df31e7a3478c192[128/1871] CXX obj/deps/inspector_protocol/crdtp/crdtp.json.o193[129/1871] AR obj/deps/inspector_protocol/libcrdtp.a194[130/1871] ACTION node_base: v8_inspector_compress_protocol_json_f26a10641803f604d1307d23f68bde8b450ad8f073bd43313642df31e7a3478c195[131/1871] ACTION Generating node protocol sources from protocol json196[132/1871] STAMP obj/node_base.actions_rules_copies.stamp197[133/1871] CXX obj/deps/v8/src/torque/torque_base.torque-compiler.o198[134/1871] CXX obj/deps/v8/src/torque/torque_base.instructions.o199[135/1871] CXX obj/src/node_base.embedded_data.o200[136/1871] CXX obj/deps/v8/src/torque/torque_base.type-visitor.o201[137/1871] CXX obj/src/node_base.builtin_info.o202[138/1871] CXX obj/src/api/node_base.utils.o203[139/1871] CXX obj/src/node_base.json_utils.o204[140/1871] CXX obj/deps/ncrypto/ncrypto.ncrypto.o205[141/1871] CXX obj/src/node_base.internal_only_v8.o206In file included from ../../src/util.h:29,207 from ../../src/util-inl.h:33,208 from ../../src/internal_only_v8.cc:3:209../../deps/v8/include/v8-profiler.h: In constructor 'v8::HeapProfiler::HeapSnapshotOptions::HeapSnapshotOptions()':210../../deps/v8/include/v8-profiler.h:1128:27: warning: 'v8::HeapProfiler::HeapSnapshotOptions::global_object_name_resolver' is deprecated: Use context_name_resolver callback instead. [-Wdeprecated-declarations]211 1128 | HeapSnapshotOptions() {}212 | ^213../../deps/v8/include/v8-profiler.h:1142:25: note: declared here214 1142 | ObjectNameResolver* global_object_name_resolver = nullptr;215 | ^~~~~~~~~~~~~~~~~~~~~~~~~~~216../../deps/v8/include/v8-profiler.h:1128:27: warning: 'v8::HeapProfiler::HeapSnapshotOptions::global_object_name_resolver' is deprecated: Use context_name_resolver callback instead. [-Wdeprecated-declarations]217 1128 | HeapSnapshotOptions() {}218 | ^219../../deps/v8/include/v8-profiler.h:1142:25: note: declared here220 1142 | ObjectNameResolver* global_object_name_resolver = nullptr;221 | ^~~~~~~~~~~~~~~~~~~~~~~~~~~222[142/1871] CXX obj/src/node_base.cleanup_queue.o223In file included from ../../src/memory_tracker.h:6,224 from ../../src/cleanup_queue.h:11,225 from ../../src/cleanup_queue.cc:1:226../../deps/v8/include/v8-profiler.h: In constructor 'v8::HeapProfiler::HeapSnapshotOptions::HeapSnapshotOptions()':227../../deps/v8/include/v8-profiler.h:1128:27: warning: 'v8::HeapProfiler::HeapSnapshotOptions::global_object_name_resolver' is deprecated: Use context_name_resolver callback instead. [-Wdeprecated-declarations]228 1128 | HeapSnapshotOptions() {}229 | ^230../../deps/v8/include/v8-profiler.h:1142:25: note: declared here231 1142 | ObjectNameResolver* global_object_name_resolver = nullptr;232 | ^~~~~~~~~~~~~~~~~~~~~~~~~~~233../../deps/v8/include/v8-profiler.h:1128:27: warning: 'v8::HeapProfiler::HeapSnapshotOptions::global_object_name_resolver' is deprecated: Use context_name_resolver callback instead. [-Wdeprecated-declarations]234 1128 | HeapSnapshotOptions() {}235 | ^236../../deps/v8/include/v8-profiler.h:1142:25: note: declared here237 1142 | ObjectNameResolver* global_object_name_resolver = nullptr;238 | ^~~~~~~~~~~~~~~~~~~~~~~~~~~239[143/1871] CXX obj/gen/src/node/inspector/protocol/node_base.Storage.o240In file included from ../../src/util.h:29,241 from ../../src/inspector/node_string.h:10,242 from gen/src/node/inspector/protocol/Forward.h:19,243 from gen/src/node/inspector/protocol/Protocol.h:18,244 from gen/src/node/inspector/protocol/Storage.h:10,245 from gen/src/node/inspector/protocol/Storage.cpp:7:246../../deps/v8/include/v8-profiler.h: In constructor 'v8::HeapProfiler::HeapSnapshotOptions::HeapSnapshotOptions()':247../../deps/v8/include/v8-profiler.h:1128:27: warning: 'v8::HeapProfiler::HeapSnapshotOptions::global_object_name_resolver' is deprecated: Use context_name_resolver callback instead. [-Wdeprecated-declarations]248 1128 | HeapSnapshotOptions() {}249 | ^250../../deps/v8/include/v8-profiler.h:1142:25: note: declared here251 1142 | ObjectNameResolver* global_object_name_resolver = nullptr;252 | ^~~~~~~~~~~~~~~~~~~~~~~~~~~253../../deps/v8/include/v8-profiler.h:1128:27: warning: 'v8::HeapProfiler::HeapSnapshotOptions::global_object_name_resolver' is deprecated: Use context_name_resolver callback instead. [-Wdeprecated-declarations]254 1128 | HeapSnapshotOptions() {}255 | ^256../../deps/v8/include/v8-profiler.h:1142:25: note: declared here257 1142 | ObjectNameResolver* global_object_name_resolver = nullptr;258 | ^~~~~~~~~~~~~~~~~~~~~~~~~~~259[144/1871] CXX obj/gen/src/node/inspector/protocol/node_base.NodeRuntime.o260In file included from ../../src/util.h:29,261 from ../../src/inspector/node_string.h:10,262 from gen/src/node/inspector/protocol/Forward.h:19,263 from gen/src/node/inspector/protocol/Protocol.h:18,264 from gen/src/node/inspector/protocol/NodeRuntime.h:10,265 from gen/src/node/inspector/protocol/NodeRuntime.cpp:7:266../../deps/v8/include/v8-profiler.h: In constructor 'v8::HeapProfiler::HeapSnapshotOptions::HeapSnapshotOptions()':267../../deps/v8/include/v8-profiler.h:1128:27: warning: 'v8::HeapProfiler::HeapSnapshotOptions::global_object_name_resolver' is deprecated: Use context_name_resolver callback instead. [-Wdeprecated-declarations]268 1128 | HeapSnapshotOptions() {}269 | ^270../../deps/v8/include/v8-profiler.h:1142:25: note: declared here271 1142 | ObjectNameResolver* global_object_name_resolver = nullptr;272 | ^~~~~~~~~~~~~~~~~~~~~~~~~~~273../../deps/v8/include/v8-profiler.h:1128:27: warning: 'v8::HeapProfiler::HeapSnapshotOptions::global_object_name_resolver' is deprecated: Use context_name_resolver callback instead. [-Wdeprecated-declarations]274 1128 | HeapSnapshotOptions() {}275 | ^276../../deps/v8/include/v8-profiler.h:1142:25: note: declared here277 1142 | ObjectNameResolver* global_object_name_resolver = nullptr;278 | ^~~~~~~~~~~~~~~~~~~~~~~~~~~279[145/1871] CXX obj/gen/src/node/inspector/protocol/node_base.IO.o280In file included from ../../src/util.h:29,281 from ../../src/inspector/node_string.h:10,282 from gen/src/node/inspector/protocol/Forward.h:19,283 from gen/src/node/inspector/protocol/Protocol.h:18,284 from gen/src/node/inspector/protocol/IO.h:10,285 from gen/src/node/inspector/protocol/IO.cpp:7:286../../deps/v8/include/v8-profiler.h: In constructor 'v8::HeapProfiler::HeapSnapshotOptions::HeapSnapshotOptions()':287../../deps/v8/include/v8-profiler.h:1128:27: warning: 'v8::HeapProfiler::HeapSnapshotOptions::global_object_name_resolver' is deprecated: Use context_name_resolver callback instead. [-Wdeprecated-declarations]288 1128 | HeapSnapshotOptions() {}289 | ^290../../deps/v8/include/v8-profiler.h:1142:25: note: declared here291 1142 | ObjectNameResolver* global_object_name_resolver = nullptr;292 | ^~~~~~~~~~~~~~~~~~~~~~~~~~~293../../deps/v8/include/v8-profiler.h:1128:27: warning: 'v8::HeapProfiler::HeapSnapshotOptions::global_object_name_resolver' is deprecated: Use context_name_resolver callback instead. [-Wdeprecated-declarations]294 1128 | HeapSnapshotOptions() {}295 | ^296../../deps/v8/include/v8-profiler.h:1142:25: note: declared here297 1142 | ObjectNameResolver* global_object_name_resolver = nullptr;298 | ^~~~~~~~~~~~~~~~~~~~~~~~~~~299[146/1871] CXX obj/gen/src/node/inspector/protocol/node_base.Target.o300In file included from ../../src/util.h:29,301 from ../../src/inspector/node_string.h:10,302 from gen/src/node/inspector/protocol/Forward.h:19,303 from gen/src/node/inspector/protocol/Protocol.h:18,304 from gen/src/node/inspector/protocol/Target.h:10,305 from gen/src/node/inspector/protocol/Target.cpp:7:306../../deps/v8/include/v8-profiler.h: In constructor 'v8::HeapProfiler::HeapSnapshotOptions::HeapSnapshotOptions()':307../../deps/v8/include/v8-profiler.h:1128:27: warning: 'v8::HeapProfiler::HeapSnapshotOptions::global_object_name_resolver' is deprecated: Use context_name_resolver callback instead. [-Wdeprecated-declarations]308 1128 | HeapSnapshotOptions() {}309 | ^310../../deps/v8/include/v8-profiler.h:1142:25: note: declared here311 1142 | ObjectNameResolver* global_object_name_resolver = nullptr;312 | ^~~~~~~~~~~~~~~~~~~~~~~~~~~313../../deps/v8/include/v8-profiler.h:1128:27: warning: 'v8::HeapProfiler::HeapSnapshotOptions::global_object_name_resolver' is deprecated: Use context_name_resolver callback instead. [-Wdeprecated-declarations]314 1128 | HeapSnapshotOptions() {}315 | ^316../../deps/v8/include/v8-profiler.h:1142:25: note: declared here317 1142 | ObjectNameResolver* global_object_name_resolver = nullptr;318 | ^~~~~~~~~~~~~~~~~~~~~~~~~~~319[147/1871] CXX obj/gen/src/node/inspector/protocol/node_base.NodeWorker.o320In file included from ../../src/util.h:29,321 from ../../src/inspector/node_string.h:10,322 from gen/src/node/inspector/protocol/Forward.h:19,323 from gen/src/node/inspector/protocol/Protocol.h:18,324 from gen/src/node/inspector/protocol/NodeWorker.h:10,325 from gen/src/node/inspector/protocol/NodeWorker.cpp:7:326../../deps/v8/include/v8-profiler.h: In constructor 'v8::HeapProfiler::HeapSnapshotOptions::HeapSnapshotOptions()':327../../deps/v8/include/v8-profiler.h:1128:27: warning: 'v8::HeapProfiler::HeapSnapshotOptions::global_object_name_resolver' is deprecated: Use context_name_resolver callback instead. [-Wdeprecated-declarations]328 1128 | HeapSnapshotOptions() {}329 | ^330../../deps/v8/include/v8-profiler.h:1142:25: note: declared here331 1142 | ObjectNameResolver* global_object_name_resolver = nullptr;332 | ^~~~~~~~~~~~~~~~~~~~~~~~~~~333../../deps/v8/include/v8-profiler.h:1128:27: warning: 'v8::HeapProfiler::HeapSnapshotOptions::global_object_name_resolver' is deprecated: Use context_name_resolver callback instead. [-Wdeprecated-declarations]334 1128 | HeapSnapshotOptions() {}335 | ^336../../deps/v8/include/v8-profiler.h:1142:25: note: declared here337 1142 | ObjectNameResolver* global_object_name_resolver = nullptr;338 | ^~~~~~~~~~~~~~~~~~~~~~~~~~~339[148/1871] CXX obj/src/node_base.node_debug.o340[149/1871] CXX obj/gen/src/node/inspector/protocol/node_base.NodeTracing.o341In file included from ../../src/util.h:29,342 from ../../src/inspector/node_string.h:10,343 from gen/src/node/inspector/protocol/Forward.h:19,344 from gen/src/node/inspector/protocol/Protocol.h:18,345 from gen/src/node/inspector/protocol/NodeTracing.h:10,346 from gen/src/node/inspector/protocol/NodeTracing.cpp:7:347../../deps/v8/include/v8-profiler.h: In constructor 'v8::HeapProfiler::HeapSnapshotOptions::HeapSnapshotOptions()':348../../deps/v8/include/v8-profiler.h:1128:27: warning: 'v8::HeapProfiler::HeapSnapshotOptions::global_object_name_resolver' is deprecated: Use context_name_resolver callback instead. [-Wdeprecated-declarations]349 1128 | HeapSnapshotOptions() {}350 | ^351../../deps/v8/include/v8-profiler.h:1142:25: note: declared here352 1142 | ObjectNameResolver* global_object_name_resolver = nullptr;353 | ^~~~~~~~~~~~~~~~~~~~~~~~~~~354../../deps/v8/include/v8-profiler.h:1128:27: warning: 'v8::HeapProfiler::HeapSnapshotOptions::global_object_name_resolver' is deprecated: Use context_name_resolver callback instead. [-Wdeprecated-declarations]355 1128 | HeapSnapshotOptions() {}356 | ^357../../deps/v8/include/v8-profiler.h:1142:25: note: declared here358 1142 | ObjectNameResolver* global_object_name_resolver = nullptr;359 | ^~~~~~~~~~~~~~~~~~~~~~~~~~~360[150/1871] CXX obj/gen/src/node/inspector/protocol/node_base.DOMStorage.o361In file included from ../../src/util.h:29,362 from ../../src/inspector/node_string.h:10,363 from gen/src/node/inspector/protocol/Forward.h:19,364 from gen/src/node/inspector/protocol/Protocol.h:18,365 from gen/src/node/inspector/protocol/DOMStorage.h:10,366 from gen/src/node/inspector/protocol/DOMStorage.cpp:7:367../../deps/v8/include/v8-profiler.h: In constructor 'v8::HeapProfiler::HeapSnapshotOptions::HeapSnapshotOptions()':368../../deps/v8/include/v8-profiler.h:1128:27: warning: 'v8::HeapProfiler::HeapSnapshotOptions::global_object_name_resolver' is deprecated: Use context_name_resolver callback instead. [-Wdeprecated-declarations]369 1128 | HeapSnapshotOptions() {}370 | ^371../../deps/v8/include/v8-profiler.h:1142:25: note: declared here372 1142 | ObjectNameResolver* global_object_name_resolver = nullptr;373 | ^~~~~~~~~~~~~~~~~~~~~~~~~~~374../../deps/v8/include/v8-profiler.h:1128:27: warning: 'v8::HeapProfiler::HeapSnapshotOptions::global_object_name_resolver' is deprecated: Use context_name_resolver callback instead. [-Wdeprecated-declarations]375 1128 | HeapSnapshotOptions() {}376 | ^377../../deps/v8/include/v8-profiler.h:1142:25: note: declared here378 1142 | ObjectNameResolver* global_object_name_resolver = nullptr;379 | ^~~~~~~~~~~~~~~~~~~~~~~~~~~380[151/1871] CXX obj/deps/v8/src/torque/torque_base.types.o381[152/1871] CXX obj/gen/src/node/inspector/protocol/node_base.Network.o382In file included from ../../src/util.h:29,383 from ../../src/inspector/node_string.h:10,384 from gen/src/node/inspector/protocol/Forward.h:19,385 from gen/src/node/inspector/protocol/Protocol.h:18,386 from gen/src/node/inspector/protocol/Network.h:10,387 from gen/src/node/inspector/protocol/Network.cpp:7:388../../deps/v8/include/v8-profiler.h: In constructor 'v8::HeapProfiler::HeapSnapshotOptions::HeapSnapshotOptions()':389../../deps/v8/include/v8-profiler.h:1128:27: warning: 'v8::HeapProfiler::HeapSnapshotOptions::global_object_name_resolver' is deprecated: Use context_name_resolver callback instead. [-Wdeprecated-declarations]390 1128 | HeapSnapshotOptions() {}391 | ^392../../deps/v8/include/v8-profiler.h:1142:25: note: declared here393 1142 | ObjectNameResolver* global_object_name_resolver = nullptr;394 | ^~~~~~~~~~~~~~~~~~~~~~~~~~~395../../deps/v8/include/v8-profiler.h:1128:27: warning: 'v8::HeapProfiler::HeapSnapshotOptions::global_object_name_resolver' is deprecated: Use context_name_resolver callback instead. [-Wdeprecated-declarations]396 1128 | HeapSnapshotOptions() {}397 | ^398../../deps/v8/include/v8-profiler.h:1142:25: note: declared here399 1142 | ObjectNameResolver* global_object_name_resolver = nullptr;400 | ^~~~~~~~~~~~~~~~~~~~~~~~~~~401[153/1871] CXX obj/gen/src/node/inspector/protocol/node_base.Protocol.o402In file included from ../../src/util.h:29,403 from ../../src/inspector/node_string.h:10,404 from gen/src/node/inspector/protocol/Forward.h:19,405 from gen/src/node/inspector/protocol/Protocol.h:18,406 from gen/src/node/inspector/protocol/Protocol.cpp:7:407../../deps/v8/include/v8-profiler.h: In constructor 'v8::HeapProfiler::HeapSnapshotOptions::HeapSnapshotOptions()':408../../deps/v8/include/v8-profiler.h:1128:27: warning: 'v8::HeapProfiler::HeapSnapshotOptions::global_object_name_resolver' is deprecated: Use context_name_resolver callback instead. [-Wdeprecated-declarations]409 1128 | HeapSnapshotOptions() {}410 | ^411../../deps/v8/include/v8-profiler.h:1142:25: note: declared here412 1142 | ObjectNameResolver* global_object_name_resolver = nullptr;413 | ^~~~~~~~~~~~~~~~~~~~~~~~~~~414../../deps/v8/include/v8-profiler.h:1128:27: warning: 'v8::HeapProfiler::HeapSnapshotOptions::global_object_name_resolver' is deprecated: Use context_name_resolver callback instead. [-Wdeprecated-declarations]415 1128 | HeapSnapshotOptions() {}416 | ^417../../deps/v8/include/v8-profiler.h:1142:25: note: declared here418 1142 | ObjectNameResolver* global_object_name_resolver = nullptr;419 | ^~~~~~~~~~~~~~~~~~~~~~~~~~~420[154/1871] CXX obj/src/node_base.debug_utils.o421In file included from ../../src/memory_tracker.h:6,422 from ../../src/base_object.h:29,423 from ../../src/async_wrap.h:27,424 from ../../src/debug_utils.h:6,425 from ../../src/debug_utils-inl.h:6,426 from ../../src/debug_utils.cc:1:427../../deps/v8/include/v8-profiler.h: In constructor 'v8::HeapProfiler::HeapSnapshotOptions::HeapSnapshotOptions()':428../../deps/v8/include/v8-profiler.h:1128:27: warning: 'v8::HeapProfiler::HeapSnapshotOptions::global_object_name_resolver' is deprecated: Use context_name_resolver callback instead. [-Wdeprecated-declarations]429 1128 | HeapSnapshotOptions() {}430 | ^431../../deps/v8/include/v8-profiler.h:1142:25: note: declared here432 1142 | ObjectNameResolver* global_object_name_resolver = nullptr;433 | ^~~~~~~~~~~~~~~~~~~~~~~~~~~434../../deps/v8/include/v8-profiler.h:1128:27: warning: 'v8::HeapProfiler::HeapSnapshotOptions::global_object_name_resolver' is deprecated: Use context_name_resolver callback instead. [-Wdeprecated-declarations]435 1128 | HeapSnapshotOptions() {}436 | ^437../../deps/v8/include/v8-profiler.h:1142:25: note: declared here438 1142 | ObjectNameResolver* global_object_name_resolver = nullptr;439 | ^~~~~~~~~~~~~~~~~~~~~~~~~~~440[155/1871] CXX obj/src/node_base.handle_wrap.o441In file included from ../../src/memory_tracker.h:6,442 from ../../src/base_object.h:29,443 from ../../src/async_wrap.h:27,444 from ../../src/handle_wrap.h:27,445 from ../../src/handle_wrap.cc:22:446../../deps/v8/include/v8-profiler.h: In constructor 'v8::HeapProfiler::HeapSnapshotOptions::HeapSnapshotOptions()':447../../deps/v8/include/v8-profiler.h:1128:27: warning: 'v8::HeapProfiler::HeapSnapshotOptions::global_object_name_resolver' is deprecated: Use context_name_resolver callback instead. [-Wdeprecated-declarations]448 1128 | HeapSnapshotOptions() {}449 | ^450../../deps/v8/include/v8-profiler.h:1142:25: note: declared here451 1142 | ObjectNameResolver* global_object_name_resolver = nullptr;452 | ^~~~~~~~~~~~~~~~~~~~~~~~~~~453../../deps/v8/include/v8-profiler.h:1128:27: warning: 'v8::HeapProfiler::HeapSnapshotOptions::global_object_name_resolver' is deprecated: Use context_name_resolver callback instead. [-Wdeprecated-declarations]454 1128 | HeapSnapshotOptions() {}455 | ^456../../deps/v8/include/v8-profiler.h:1142:25: note: declared here457 1142 | ObjectNameResolver* global_object_name_resolver = nullptr;458 | ^~~~~~~~~~~~~~~~~~~~~~~~~~~459[156/1871] CXX obj/src/node_base.async_context_frame.o460In file included from ../../src/memory_tracker.h:6,461 from ../../src/base_object.h:29,462 from ../../src/async_context_frame.h:6,463 from ../../src/async_context_frame.cc:1:464../../deps/v8/include/v8-profiler.h: In constructor 'v8::HeapProfiler::HeapSnapshotOptions::HeapSnapshotOptions()':465../../deps/v8/include/v8-profiler.h:1128:27: warning: 'v8::HeapProfiler::HeapSnapshotOptions::global_object_name_resolver' is deprecated: Use context_name_resolver callback instead. [-Wdeprecated-declarations]466 1128 | HeapSnapshotOptions() {}467 | ^468../../deps/v8/include/v8-profiler.h:1142:25: note: declared here469 1142 | ObjectNameResolver* global_object_name_resolver = nullptr;470 | ^~~~~~~~~~~~~~~~~~~~~~~~~~~471../../deps/v8/include/v8-profiler.h:1128:27: warning: 'v8::HeapProfiler::HeapSnapshotOptions::global_object_name_resolver' is deprecated: Use context_name_resolver callback instead. [-Wdeprecated-declarations]472 1128 | HeapSnapshotOptions() {}473 | ^474../../deps/v8/include/v8-profiler.h:1142:25: note: declared here475 1142 | ObjectNameResolver* global_object_name_resolver = nullptr;476 | ^~~~~~~~~~~~~~~~~~~~~~~~~~~477[157/1871] CXX obj/src/api/node_base.encoding.o478In file included from ../../src/memory_tracker.h:6,479 from ../../src/aliased_buffer.h:7,480 from ../../src/aliased_buffer-inl.h:6,481 from ../../src/env-inl.h:27,482 from ../../src/string_bytes.h:30,483 from ../../src/api/encoding.cc:2:484../../deps/v8/include/v8-profiler.h: In constructor 'v8::HeapProfiler::HeapSnapshotOptions::HeapSnapshotOptions()':485../../deps/v8/include/v8-profiler.h:1128:27: warning: 'v8::HeapProfiler::HeapSnapshotOptions::global_object_name_resolver' is deprecated: Use context_name_resolver callback instead. [-Wdeprecated-declarations]486 1128 | HeapSnapshotOptions() {}487 | ^488../../deps/v8/include/v8-profiler.h:1142:25: note: declared here489 1142 | ObjectNameResolver* global_object_name_resolver = nullptr;490 | ^~~~~~~~~~~~~~~~~~~~~~~~~~~491../../deps/v8/include/v8-profiler.h:1128:27: warning: 'v8::HeapProfiler::HeapSnapshotOptions::global_object_name_resolver' is deprecated: Use context_name_resolver callback instead. [-Wdeprecated-declarations]492 1128 | HeapSnapshotOptions() {}493 | ^494../../deps/v8/include/v8-profiler.h:1142:25: note: declared here495 1142 | ObjectNameResolver* global_object_name_resolver = nullptr;496 | ^~~~~~~~~~~~~~~~~~~~~~~~~~~497[158/1871] CXX obj/src/api/node_base.embed_helpers.o498In file included from ../../src/memory_tracker.h:6,499 from ../../src/base_object.h:29,500 from ../../src/async_wrap.h:27,501 from ../../src/debug_utils.h:6,502 from ../../src/debug_utils-inl.h:6,503 from ../../src/api/embed_helpers.cc:1:504../../deps/v8/include/v8-profiler.h: In constructor 'v8::HeapProfiler::HeapSnapshotOptions::HeapSnapshotOptions()':505../../deps/v8/include/v8-profiler.h:1128:27: warning: 'v8::HeapProfiler::HeapSnapshotOptions::global_object_name_resolver' is deprecated: Use context_name_resolver callback instead. [-Wdeprecated-declarations]506 1128 | HeapSnapshotOptions() {}507 | ^508../../deps/v8/include/v8-profiler.h:1142:25: note: declared here509 1142 | ObjectNameResolver* global_object_name_resolver = nullptr;510 | ^~~~~~~~~~~~~~~~~~~~~~~~~~~511../../deps/v8/include/v8-profiler.h:1128:27: warning: 'v8::HeapProfiler::HeapSnapshotOptions::global_object_name_resolver' is deprecated: Use context_name_resolver callback instead. [-Wdeprecated-declarations]512 1128 | HeapSnapshotOptions() {}513 | ^514../../deps/v8/include/v8-profiler.h:1142:25: note: declared here515 1142 | ObjectNameResolver* global_object_name_resolver = nullptr;516 | ^~~~~~~~~~~~~~~~~~~~~~~~~~~517[159/1871] CXX obj/src/node_base.connection_wrap.o518In file included from ../../src/memory_tracker.h:6,519 from ../../src/aliased_buffer.h:7,520 from ../../src/env.h:27,521 from ../../src/stream_base.h:6,522 from ../../src/stream_wrap.h:27,523 from ../../src/connection_wrap.h:6,524 from ../../src/connection_wrap.cc:1:525../../deps/v8/include/v8-profiler.h: In constructor 'v8::HeapProfiler::HeapSnapshotOptions::HeapSnapshotOptions()':526../../deps/v8/include/v8-profiler.h:1128:27: warning: 'v8::HeapProfiler::HeapSnapshotOptions::global_object_name_resolver' is deprecated: Use context_name_resolver callback instead. [-Wdeprecated-declarations]527 1128 | HeapSnapshotOptions() {}528 | ^529../../deps/v8/include/v8-profiler.h:1142:25: note: declared here530 1142 | ObjectNameResolver* global_object_name_resolver = nullptr;531 | ^~~~~~~~~~~~~~~~~~~~~~~~~~~532../../deps/v8/include/v8-profiler.h:1128:27: warning: 'v8::HeapProfiler::HeapSnapshotOptions::global_object_name_resolver' is deprecated: Use context_name_resolver callback instead. [-Wdeprecated-declarations]533 1128 | HeapSnapshotOptions() {}534 | ^535../../deps/v8/include/v8-profiler.h:1142:25: note: declared here536 1142 | ObjectNameResolver* global_object_name_resolver = nullptr;537 | ^~~~~~~~~~~~~~~~~~~~~~~~~~~538[160/1871] CXX obj/src/api/node_base.callback.o539In file included from ../../src/memory_tracker.h:6,540 from ../../src/base_object.h:29,541 from ../../src/async_context_frame.h:6,542 from ../../src/api/callback.cc:1:543../../deps/v8/include/v8-profiler.h: In constructor 'v8::HeapProfiler::HeapSnapshotOptions::HeapSnapshotOptions()':544../../deps/v8/include/v8-profiler.h:1128:27: warning: 'v8::HeapProfiler::HeapSnapshotOptions::global_object_name_resolver' is deprecated: Use context_name_resolver callback instead. [-Wdeprecated-declarations]545 1128 | HeapSnapshotOptions() {}546 | ^547../../deps/v8/include/v8-profiler.h:1142:25: note: declared here548 1142 | ObjectNameResolver* global_object_name_resolver = nullptr;549 | ^~~~~~~~~~~~~~~~~~~~~~~~~~~550../../deps/v8/include/v8-profiler.h:1128:27: warning: 'v8::HeapProfiler::HeapSnapshotOptions::global_object_name_resolver' is deprecated: Use context_name_resolver callback instead. [-Wdeprecated-declarations]551 1128 | HeapSnapshotOptions() {}552 | ^553../../deps/v8/include/v8-profiler.h:1142:25: note: declared here554 1142 | ObjectNameResolver* global_object_name_resolver = nullptr;555 | ^~~~~~~~~~~~~~~~~~~~~~~~~~~556[161/1871] CXX obj/src/api/node_base.async_resource.o557In file included from ../../src/memory_tracker.h:6,558 from ../../src/base_object.h:29,559 from ../../src/async_context_frame.h:6,560 from ../../src/api/async_resource.cc:1:561../../deps/v8/include/v8-profiler.h: In constructor 'v8::HeapProfiler::HeapSnapshotOptions::HeapSnapshotOptions()':562../../deps/v8/include/v8-profiler.h:1128:27: warning: 'v8::HeapProfiler::HeapSnapshotOptions::global_object_name_resolver' is deprecated: Use context_name_resolver callback instead. [-Wdeprecated-declarations]563 1128 | HeapSnapshotOptions() {}564 | ^565../../deps/v8/include/v8-profiler.h:1142:25: note: declared here566 1142 | ObjectNameResolver* global_object_name_resolver = nullptr;567 | ^~~~~~~~~~~~~~~~~~~~~~~~~~~568../../deps/v8/include/v8-profiler.h:1128:27: warning: 'v8::HeapProfiler::HeapSnapshotOptions::global_object_name_resolver' is deprecated: Use context_name_resolver callback instead. [-Wdeprecated-declarations]569 1128 | HeapSnapshotOptions() {}570 | ^571../../deps/v8/include/v8-profiler.h:1142:25: note: declared here572 1142 | ObjectNameResolver* global_object_name_resolver = nullptr;573 | ^~~~~~~~~~~~~~~~~~~~~~~~~~~574[162/1871] CXX obj/src/api/node_base.hooks.o575In file included from ../../src/memory_tracker.h:6,576 from ../../src/aliased_buffer.h:7,577 from ../../src/aliased_buffer-inl.h:6,578 from ../../src/env-inl.h:27,579 from ../../src/api/hooks.cc:1:580../../deps/v8/include/v8-profiler.h: In constructor 'v8::HeapProfiler::HeapSnapshotOptions::HeapSnapshotOptions()':581../../deps/v8/include/v8-profiler.h:1128:27: warning: 'v8::HeapProfiler::HeapSnapshotOptions::global_object_name_resolver' is deprecated: Use context_name_resolver callback instead. [-Wdeprecated-declarations]582 1128 | HeapSnapshotOptions() {}583 | ^584../../deps/v8/include/v8-profiler.h:1142:25: note: declared here585 1142 | ObjectNameResolver* global_object_name_resolver = nullptr;586 | ^~~~~~~~~~~~~~~~~~~~~~~~~~~587../../deps/v8/include/v8-profiler.h:1128:27: warning: 'v8::HeapProfiler::HeapSnapshotOptions::global_object_name_resolver' is deprecated: Use context_name_resolver callback instead. [-Wdeprecated-declarations]588 1128 | HeapSnapshotOptions() {}589 | ^590../../deps/v8/include/v8-profiler.h:1142:25: note: declared here591 1142 | ObjectNameResolver* global_object_name_resolver = nullptr;592 | ^~~~~~~~~~~~~~~~~~~~~~~~~~~593[163/1871] CXX obj/src/node_base.connect_wrap.o594In file included from ../../src/memory_tracker.h:6,595 from ../../src/base_object.h:29,596 from ../../src/async_wrap.h:27,597 from ../../src/req_wrap.h:6,598 from ../../src/req_wrap-inl.h:6,599 from ../../src/connect_wrap.h:6,600 from ../../src/connect_wrap.cc:1:601../../deps/v8/include/v8-profiler.h: In constructor 'v8::HeapProfiler::HeapSnapshotOptions::HeapSnapshotOptions()':602../../deps/v8/include/v8-profiler.h:1128:27: warning: 'v8::HeapProfiler::HeapSnapshotOptions::global_object_name_resolver' is deprecated: Use context_name_resolver callback instead. [-Wdeprecated-declarations]603 1128 | HeapSnapshotOptions() {}604 | ^605../../deps/v8/include/v8-profiler.h:1142:25: note: declared here606 1142 | ObjectNameResolver* global_object_name_resolver = nullptr;607 | ^~~~~~~~~~~~~~~~~~~~~~~~~~~608../../deps/v8/include/v8-profiler.h:1128:27: warning: 'v8::HeapProfiler::HeapSnapshotOptions::global_object_name_resolver' is deprecated: Use context_name_resolver callback instead. [-Wdeprecated-declarations]609 1128 | HeapSnapshotOptions() {}610 | ^611../../deps/v8/include/v8-profiler.h:1142:25: note: declared here612 1142 | ObjectNameResolver* global_object_name_resolver = nullptr;613 | ^~~~~~~~~~~~~~~~~~~~~~~~~~~614[164/1871] CXX obj/src/node_base.base_object.o615In file included from ../../src/memory_tracker.h:6,616 from ../../src/base_object.h:29,617 from ../../src/base_object.cc:1:618../../deps/v8/include/v8-profiler.h: In constructor 'v8::HeapProfiler::HeapSnapshotOptions::HeapSnapshotOptions()':619../../deps/v8/include/v8-profiler.h:1128:27: warning: 'v8::HeapProfiler::HeapSnapshotOptions::global_object_name_resolver' is deprecated: Use context_name_resolver callback instead. [-Wdeprecated-declarations]620 1128 | HeapSnapshotOptions() {}621 | ^622../../deps/v8/include/v8-profiler.h:1142:25: note: declared here623 1142 | ObjectNameResolver* global_object_name_resolver = nullptr;624 | ^~~~~~~~~~~~~~~~~~~~~~~~~~~625../../deps/v8/include/v8-profiler.h:1128:27: warning: 'v8::HeapProfiler::HeapSnapshotOptions::global_object_name_resolver' is deprecated: Use context_name_resolver callback instead. [-Wdeprecated-declarations]626 1128 | HeapSnapshotOptions() {}627 | ^628../../deps/v8/include/v8-profiler.h:1142:25: note: declared here629 1142 | ObjectNameResolver* global_object_name_resolver = nullptr;630 | ^~~~~~~~~~~~~~~~~~~~~~~~~~~631[165/1871] CXX obj/src/api/node_base.exceptions.o632In file included from ../../src/memory_tracker.h:6,633 from ../../src/aliased_buffer.h:7,634 from ../../src/aliased_buffer-inl.h:6,635 from ../../src/env-inl.h:27,636 from ../../src/api/exceptions.cc:3:637../../deps/v8/include/v8-profiler.h: In constructor 'v8::HeapProfiler::HeapSnapshotOptions::HeapSnapshotOptions()':638../../deps/v8/include/v8-profiler.h:1128:27: warning: 'v8::HeapProfiler::HeapSnapshotOptions::global_object_name_resolver' is deprecated: Use context_name_resolver callback instead. [-Wdeprecated-declarations]639 1128 | HeapSnapshotOptions() {}640 | ^641../../deps/v8/include/v8-profiler.h:1142:25: note: declared here642 1142 | ObjectNameResolver* global_object_name_resolver = nullptr;643 | ^~~~~~~~~~~~~~~~~~~~~~~~~~~644../../deps/v8/include/v8-profiler.h:1128:27: warning: 'v8::HeapProfiler::HeapSnapshotOptions::global_object_name_resolver' is deprecated: Use context_name_resolver callback instead. [-Wdeprecated-declarations]645 1128 | HeapSnapshotOptions() {}646 | ^647../../deps/v8/include/v8-profiler.h:1142:25: note: declared here648 1142 | ObjectNameResolver* global_object_name_resolver = nullptr;649 | ^~~~~~~~~~~~~~~~~~~~~~~~~~~650[166/1871] CXX obj/src/node_base.fs_event_wrap.o651In file included from ../../src/memory_tracker.h:6,652 from ../../src/base_object.h:29,653 from ../../src/async_wrap.h:27,654 from ../../src/async_wrap-inl.h:27,655 from ../../src/fs_event_wrap.cc:22:656../../deps/v8/include/v8-profiler.h: In constructor 'v8::HeapProfiler::HeapSnapshotOptions::HeapSnapshotOptions()':657../../deps/v8/include/v8-profiler.h:1128:27: warning: 'v8::HeapProfiler::HeapSnapshotOptions::global_object_name_resolver' is deprecated: Use context_name_resolver callback instead. [-Wdeprecated-declarations]658 1128 | HeapSnapshotOptions() {}659 | ^660../../deps/v8/include/v8-profiler.h:1142:25: note: declared here661 1142 | ObjectNameResolver* global_object_name_resolver = nullptr;662 | ^~~~~~~~~~~~~~~~~~~~~~~~~~~663../../deps/v8/include/v8-profiler.h:1128:27: warning: 'v8::HeapProfiler::HeapSnapshotOptions::global_object_name_resolver' is deprecated: Use context_name_resolver callback instead. [-Wdeprecated-declarations]664 1128 | HeapSnapshotOptions() {}665 | ^666../../deps/v8/include/v8-profiler.h:1142:25: note: declared here667 1142 | ObjectNameResolver* global_object_name_resolver = nullptr;668 | ^~~~~~~~~~~~~~~~~~~~~~~~~~~669[167/1871] CXX obj/src/node_base.js_stream.o670In file included from ../../src/memory_tracker.h:6,671 from ../../src/base_object.h:29,672 from ../../src/async_wrap.h:27,673 from ../../src/js_stream.h:6,674 from ../../src/js_stream.cc:1:675../../deps/v8/include/v8-profiler.h: In constructor 'v8::HeapProfiler::HeapSnapshotOptions::HeapSnapshotOptions()':676../../deps/v8/include/v8-profiler.h:1128:27: warning: 'v8::HeapProfiler::HeapSnapshotOptions::global_object_name_resolver' is deprecated: Use context_name_resolver callback instead. [-Wdeprecated-declarations]677 1128 | HeapSnapshotOptions() {}678 | ^679../../deps/v8/include/v8-profiler.h:1142:25: note: declared here680 1142 | ObjectNameResolver* global_object_name_resolver = nullptr;681 | ^~~~~~~~~~~~~~~~~~~~~~~~~~~682../../deps/v8/include/v8-profiler.h:1128:27: warning: 'v8::HeapProfiler::HeapSnapshotOptions::global_object_name_resolver' is deprecated: Use context_name_resolver callback instead. [-Wdeprecated-declarations]683 1128 | HeapSnapshotOptions() {}684 | ^685../../deps/v8/include/v8-profiler.h:1142:25: note: declared here686 1142 | ObjectNameResolver* global_object_name_resolver = nullptr;687 | ^~~~~~~~~~~~~~~~~~~~~~~~~~~688[168/1871] CXX obj/src/node_base.heap_utils.o689In file included from ../../src/memory_tracker.h:6,690 from ../../src/aliased_buffer.h:7,691 from ../../src/env.h:27,692 from ../../src/node_internals.h:27,693 from ../../src/diagnosticfilename-inl.h:6,694 from ../../src/heap_utils.cc:1:695../../deps/v8/include/v8-profiler.h: In constructor 'v8::HeapProfiler::HeapSnapshotOptions::HeapSnapshotOptions()':696../../deps/v8/include/v8-profiler.h:1128:27: warning: 'v8::HeapProfiler::HeapSnapshotOptions::global_object_name_resolver' is deprecated: Use context_name_resolver callback instead. [-Wdeprecated-declarations]697 1128 | HeapSnapshotOptions() {}698 | ^699../../deps/v8/include/v8-profiler.h:1142:25: note: declared here700 1142 | ObjectNameResolver* global_object_name_resolver = nullptr;701 | ^~~~~~~~~~~~~~~~~~~~~~~~~~~702../../deps/v8/include/v8-profiler.h:1128:27: warning: 'v8::HeapProfiler::HeapSnapshotOptions::global_object_name_resolver' is deprecated: Use context_name_resolver callback instead. [-Wdeprecated-declarations]703 1128 | HeapSnapshotOptions() {}704 | ^705../../deps/v8/include/v8-profiler.h:1142:25: note: declared here706 1142 | ObjectNameResolver* global_object_name_resolver = nullptr;707 | ^~~~~~~~~~~~~~~~~~~~~~~~~~~708[169/1871] CXX obj/src/node_base.js_udp_wrap.o709In file included from ../../src/memory_tracker.h:6,710 from ../../src/base_object.h:29,711 from ../../src/async_wrap.h:27,712 from ../../src/handle_wrap.h:27,713 from ../../src/udp_wrap.h:27,714 from ../../src/js_udp_wrap.cc:1:715../../deps/v8/include/v8-profiler.h: In constructor 'v8::HeapProfiler::HeapSnapshotOptions::HeapSnapshotOptions()':716../../deps/v8/include/v8-profiler.h:1128:27: warning: 'v8::HeapProfiler::HeapSnapshotOptions::global_object_name_resolver' is deprecated: Use context_name_resolver callback instead. [-Wdeprecated-declarations]717 1128 | HeapSnapshotOptions() {}718 | ^719../../deps/v8/include/v8-profiler.h:1142:25: note: declared here720 1142 | ObjectNameResolver* global_object_name_resolver = nullptr;721 | ^~~~~~~~~~~~~~~~~~~~~~~~~~~722../../deps/v8/include/v8-profiler.h:1128:27: warning: 'v8::HeapProfiler::HeapSnapshotOptions::global_object_name_resolver' is deprecated: Use context_name_resolver callback instead. [-Wdeprecated-declarations]723 1128 | HeapSnapshotOptions() {}724 | ^725../../deps/v8/include/v8-profiler.h:1142:25: note: declared here726 1142 | ObjectNameResolver* global_object_name_resolver = nullptr;727 | ^~~~~~~~~~~~~~~~~~~~~~~~~~~728[170/1871] CXX obj/src/api/node_base.environment.o729In file included from ../../src/memory_tracker.h:6,730 from ../../src/base_object.h:29,731 from ../../src/async_wrap.h:27,732 from ../../src/crypto/crypto_util.h:6,733 from ../../src/api/environment.cc:3:734../../deps/v8/include/v8-profiler.h: In constructor 'v8::HeapProfiler::HeapSnapshotOptions::HeapSnapshotOptions()':735../../deps/v8/include/v8-profiler.h:1128:27: warning: 'v8::HeapProfiler::HeapSnapshotOptions::global_object_name_resolver' is deprecated: Use context_name_resolver callback instead. [-Wdeprecated-declarations]736 1128 | HeapSnapshotOptions() {}737 | ^738../../deps/v8/include/v8-profiler.h:1142:25: note: declared here739 1142 | ObjectNameResolver* global_object_name_resolver = nullptr;740 | ^~~~~~~~~~~~~~~~~~~~~~~~~~~741../../deps/v8/include/v8-profiler.h:1128:27: warning: 'v8::HeapProfiler::HeapSnapshotOptions::global_object_name_resolver' is deprecated: Use context_name_resolver callback instead. [-Wdeprecated-declarations]742 1128 | HeapSnapshotOptions() {}743 | ^744../../deps/v8/include/v8-profiler.h:1142:25: note: declared here745 1142 | ObjectNameResolver* global_object_name_resolver = nullptr;746 | ^~~~~~~~~~~~~~~~~~~~~~~~~~~747[171/1871] CXX obj/src/node_base.compile_cache.o748In file included from ../../src/memory_tracker.h:6,749 from ../../src/base_object.h:29,750 from ../../src/async_wrap.h:27,751 from ../../src/debug_utils.h:6,752 from ../../src/debug_utils-inl.h:6,753 from ../../src/compile_cache.cc:3:754../../deps/v8/include/v8-profiler.h: In constructor 'v8::HeapProfiler::HeapSnapshotOptions::HeapSnapshotOptions()':755../../deps/v8/include/v8-profiler.h:1128:27: warning: 'v8::HeapProfiler::HeapSnapshotOptions::global_object_name_resolver' is deprecated: Use context_name_resolver callback instead. [-Wdeprecated-declarations]756 1128 | HeapSnapshotOptions() {}757 | ^758../../deps/v8/include/v8-profiler.h:1142:25: note: declared here759 1142 | ObjectNameResolver* global_object_name_resolver = nullptr;760 | ^~~~~~~~~~~~~~~~~~~~~~~~~~~761../../deps/v8/include/v8-profiler.h:1128:27: warning: 'v8::HeapProfiler::HeapSnapshotOptions::global_object_name_resolver' is deprecated: Use context_name_resolver callback instead. [-Wdeprecated-declarations]762 1128 | HeapSnapshotOptions() {}763 | ^764../../deps/v8/include/v8-profiler.h:1142:25: note: declared here765 1142 | ObjectNameResolver* global_object_name_resolver = nullptr;766 | ^~~~~~~~~~~~~~~~~~~~~~~~~~~767[172/1871] CXX obj/src/node_base.encoding_binding.o768In file included from ../../src/memory_tracker.h:6,769 from ../../src/aliased_buffer.h:7,770 from ../../src/encoding_binding.h:7,771 from ../../src/encoding_binding.cc:1:772../../deps/v8/include/v8-profiler.h: In constructor 'v8::HeapProfiler::HeapSnapshotOptions::HeapSnapshotOptions()':773../../deps/v8/include/v8-profiler.h:1128:27: warning: 'v8::HeapProfiler::HeapSnapshotOptions::global_object_name_resolver' is deprecated: Use context_name_resolver callback instead. [-Wdeprecated-declarations]774 1128 | HeapSnapshotOptions() {}775 | ^776../../deps/v8/include/v8-profiler.h:1142:25: note: declared here777 1142 | ObjectNameResolver* global_object_name_resolver = nullptr;778 | ^~~~~~~~~~~~~~~~~~~~~~~~~~~779../../deps/v8/include/v8-profiler.h:1128:27: warning: 'v8::HeapProfiler::HeapSnapshotOptions::global_object_name_resolver' is deprecated: Use context_name_resolver callback instead. [-Wdeprecated-declarations]780 1128 | HeapSnapshotOptions() {}781 | ^782../../deps/v8/include/v8-profiler.h:1142:25: note: declared here783 1142 | ObjectNameResolver* global_object_name_resolver = nullptr;784 | ^~~~~~~~~~~~~~~~~~~~~~~~~~~785[173/1871] CXX obj/src/node_base.async_wrap.o786In file included from ../../src/memory_tracker.h:6,787 from ../../src/base_object.h:29,788 from ../../src/async_wrap.h:27,789 from ../../src/async_wrap.cc:22:790../../deps/v8/include/v8-profiler.h: In constructor 'v8::HeapProfiler::HeapSnapshotOptions::HeapSnapshotOptions()':791../../deps/v8/include/v8-profiler.h:1128:27: warning: 'v8::HeapProfiler::HeapSnapshotOptions::global_object_name_resolver' is deprecated: Use context_name_resolver callback instead. [-Wdeprecated-declarations]792 1128 | HeapSnapshotOptions() {}793 | ^794../../deps/v8/include/v8-profiler.h:1142:25: note: declared here795 1142 | ObjectNameResolver* global_object_name_resolver = nullptr;796 | ^~~~~~~~~~~~~~~~~~~~~~~~~~~797../../deps/v8/include/v8-profiler.h:1128:27: warning: 'v8::HeapProfiler::HeapSnapshotOptions::global_object_name_resolver' is deprecated: Use context_name_resolver callback instead. [-Wdeprecated-declarations]798 1128 | HeapSnapshotOptions() {}799 | ^800../../deps/v8/include/v8-profiler.h:1142:25: note: declared here801 1142 | ObjectNameResolver* global_object_name_resolver = nullptr;802 | ^~~~~~~~~~~~~~~~~~~~~~~~~~~803[174/1871] CXX obj/src/node_base.node_file_utils.o804In file included from ../../src/util.h:29,805 from ../../src/util-inl.h:33,806 from ../../src/node_file_utils.cc:10:807../../deps/v8/include/v8-profiler.h: In constructor 'v8::HeapProfiler::HeapSnapshotOptions::HeapSnapshotOptions()':808../../deps/v8/include/v8-profiler.h:1128:27: warning: 'v8::HeapProfiler::HeapSnapshotOptions::global_object_name_resolver' is deprecated: Use context_name_resolver callback instead. [-Wdeprecated-declarations]809 1128 | HeapSnapshotOptions() {}810 | ^811../../deps/v8/include/v8-profiler.h:1142:25: note: declared here812 1142 | ObjectNameResolver* global_object_name_resolver = nullptr;813 | ^~~~~~~~~~~~~~~~~~~~~~~~~~~814../../deps/v8/include/v8-profiler.h:1128:27: warning: 'v8::HeapProfiler::HeapSnapshotOptions::global_object_name_resolver' is deprecated: Use context_name_resolver callback instead. [-Wdeprecated-declarations]815 1128 | HeapSnapshotOptions() {}816 | ^817../../deps/v8/include/v8-profiler.h:1142:25: note: declared here818 1142 | ObjectNameResolver* global_object_name_resolver = nullptr;819 | ^~~~~~~~~~~~~~~~~~~~~~~~~~~820../../src/node_file_utils.cc: In function 'int node::WriteFileSync(const char*, uv_buf_t*, size_t)':821../../src/node_file_utils.cc:62:32: warning: enumerated and non-enumerated type in conditional expression [-Wextra]822 62 | int err = req.result < 0 ? req.result : UV_EIO;823 | ~~~~~~~~~~~~~~~^~~~~~~~~~~~~~~~~~~~~824[175/1871] CXX obj/src/dataqueue/node_base.queue.o825In file included from ../../src/memory_tracker.h:6,826 from ../../src/base_object.h:29,827 from ../../src/dataqueue/queue.h:5,828 from ../../src/dataqueue/queue.cc:1:829../../deps/v8/include/v8-profiler.h: In constructor 'v8::HeapProfiler::HeapSnapshotOptions::HeapSnapshotOptions()':830../../deps/v8/include/v8-profiler.h:1128:27: warning: 'v8::HeapProfiler::HeapSnapshotOptions::global_object_name_resolver' is deprecated: Use context_name_resolver callback instead. [-Wdeprecated-declarations]831 1128 | HeapSnapshotOptions() {}832 | ^833../../deps/v8/include/v8-profiler.h:1142:25: note: declared here834 1142 | ObjectNameResolver* global_object_name_resolver = nullptr;835 | ^~~~~~~~~~~~~~~~~~~~~~~~~~~836../../deps/v8/include/v8-profiler.h:1128:27: warning: 'v8::HeapProfiler::HeapSnapshotOptions::global_object_name_resolver' is deprecated: Use context_name_resolver callback instead. [-Wdeprecated-declarations]837 1128 | HeapSnapshotOptions() {}838 | ^839../../deps/v8/include/v8-profiler.h:1142:25: note: declared here840 1142 | ObjectNameResolver* global_object_name_resolver = nullptr;841 | ^~~~~~~~~~~~~~~~~~~~~~~~~~~842[176/1871] CXX obj/src/node_base.histogram.o843In file included from ../../src/memory_tracker.h:6,844 from ../../src/base_object.h:29,845 from ../../src/histogram.h:7,846 from ../../src/histogram.cc:1:847../../deps/v8/include/v8-profiler.h: In constructor 'v8::HeapProfiler::HeapSnapshotOptions::HeapSnapshotOptions()':848../../deps/v8/include/v8-profiler.h:1128:27: warning: 'v8::HeapProfiler::HeapSnapshotOptions::global_object_name_resolver' is deprecated: Use context_name_resolver callback instead. [-Wdeprecated-declarations]849 1128 | HeapSnapshotOptions() {}850 | ^851../../deps/v8/include/v8-profiler.h:1142:25: note: declared here852 1142 | ObjectNameResolver* global_object_name_resolver = nullptr;853 | ^~~~~~~~~~~~~~~~~~~~~~~~~~~854../../deps/v8/include/v8-profiler.h:1128:27: warning: 'v8::HeapProfiler::HeapSnapshotOptions::global_object_name_resolver' is deprecated: Use context_name_resolver callback instead. [-Wdeprecated-declarations]855 1128 | HeapSnapshotOptions() {}856 | ^857../../deps/v8/include/v8-profiler.h:1142:25: note: declared here858 1142 | ObjectNameResolver* global_object_name_resolver = nullptr;859 | ^~~~~~~~~~~~~~~~~~~~~~~~~~~860[177/1871] CXX obj/src/node_base.node_api.o861In file included from ../../src/memory_tracker.h:6,862 from ../../src/base_object.h:29,863 from ../../src/async_context_frame.h:6,864 from ../../src/node_api.cc:1:865../../deps/v8/include/v8-profiler.h: In constructor 'v8::HeapProfiler::HeapSnapshotOptions::HeapSnapshotOptions()':866../../deps/v8/include/v8-profiler.h:1128:27: warning: 'v8::HeapProfiler::HeapSnapshotOptions::global_object_name_resolver' is deprecated: Use context_name_resolver callback instead. [-Wdeprecated-declarations]867 1128 | HeapSnapshotOptions() {}868 | ^869../../deps/v8/include/v8-profiler.h:1142:25: note: declared here870 1142 | ObjectNameResolver* global_object_name_resolver = nullptr;871 | ^~~~~~~~~~~~~~~~~~~~~~~~~~~872../../deps/v8/include/v8-profiler.h:1128:27: warning: 'v8::HeapProfiler::HeapSnapshotOptions::global_object_name_resolver' is deprecated: Use context_name_resolver callback instead. [-Wdeprecated-declarations]873 1128 | HeapSnapshotOptions() {}874 | ^875../../deps/v8/include/v8-profiler.h:1142:25: note: declared here876 1142 | ObjectNameResolver* global_object_name_resolver = nullptr;877 | ^~~~~~~~~~~~~~~~~~~~~~~~~~~878[178/1871] CXX obj/src/node_base.node_config.o879In file included from ../../src/memory_tracker.h:6,880 from ../../src/aliased_buffer.h:7,881 from ../../src/aliased_buffer-inl.h:6,882 from ../../src/env-inl.h:27,883 from ../../src/node_config.cc:1:884../../deps/v8/include/v8-profiler.h: In constructor 'v8::HeapProfiler::HeapSnapshotOptions::HeapSnapshotOptions()':885../../deps/v8/include/v8-profiler.h:1128:27: warning: 'v8::HeapProfiler::HeapSnapshotOptions::global_object_name_resolver' is deprecated: Use context_name_resolver callback instead. [-Wdeprecated-declarations]886 1128 | HeapSnapshotOptions() {}887 | ^888../../deps/v8/include/v8-profiler.h:1142:25: note: declared here889 1142 | ObjectNameResolver* global_object_name_resolver = nullptr;890 | ^~~~~~~~~~~~~~~~~~~~~~~~~~~891../../deps/v8/include/v8-profiler.h:1128:27: warning: 'v8::HeapProfiler::HeapSnapshotOptions::global_object_name_resolver' is deprecated: Use context_name_resolver callback instead. [-Wdeprecated-declarations]892 1128 | HeapSnapshotOptions() {}893 | ^894../../deps/v8/include/v8-profiler.h:1142:25: note: declared here895 1142 | ObjectNameResolver* global_object_name_resolver = nullptr;896 | ^~~~~~~~~~~~~~~~~~~~~~~~~~~897[179/1871] CXX obj/src/node_base.node_constants.o898In file included from ../../src/memory_tracker.h:6,899 from ../../src/aliased_buffer.h:7,900 from ../../src/aliased_buffer-inl.h:6,901 from ../../src/env-inl.h:27,902 from ../../src/node_constants.cc:22:903../../deps/v8/include/v8-profiler.h: In constructor 'v8::HeapProfiler::HeapSnapshotOptions::HeapSnapshotOptions()':904../../deps/v8/include/v8-profiler.h:1128:27: warning: 'v8::HeapProfiler::HeapSnapshotOptions::global_object_name_resolver' is deprecated: Use context_name_resolver callback instead. [-Wdeprecated-declarations]905 1128 | HeapSnapshotOptions() {}906 | ^907../../deps/v8/include/v8-profiler.h:1142:25: note: declared here908 1142 | ObjectNameResolver* global_object_name_resolver = nullptr;909 | ^~~~~~~~~~~~~~~~~~~~~~~~~~~910../../deps/v8/include/v8-profiler.h:1128:27: warning: 'v8::HeapProfiler::HeapSnapshotOptions::global_object_name_resolver' is deprecated: Use context_name_resolver callback instead. [-Wdeprecated-declarations]911 1128 | HeapSnapshotOptions() {}912 | ^913../../deps/v8/include/v8-profiler.h:1142:25: note: declared here914 1142 | ObjectNameResolver* global_object_name_resolver = nullptr;915 | ^~~~~~~~~~~~~~~~~~~~~~~~~~~916[180/1871] CXX obj/src/node_base.node_credentials.o917In file included from ../../src/memory_tracker.h:6,918 from ../../src/aliased_buffer.h:7,919 from ../../src/aliased_buffer-inl.h:6,920 from ../../src/env-inl.h:27,921 from ../../src/node_credentials.cc:1:922../../deps/v8/include/v8-profiler.h: In constructor 'v8::HeapProfiler::HeapSnapshotOptions::HeapSnapshotOptions()':923../../deps/v8/include/v8-profiler.h:1128:27: warning: 'v8::HeapProfiler::HeapSnapshotOptions::global_object_name_resolver' is deprecated: Use context_name_resolver callback instead. [-Wdeprecated-declarations]924 1128 | HeapSnapshotOptions() {}925 | ^926../../deps/v8/include/v8-profiler.h:1142:25: note: declared here927 1142 | ObjectNameResolver* global_object_name_resolver = nullptr;928 | ^~~~~~~~~~~~~~~~~~~~~~~~~~~929../../deps/v8/include/v8-profiler.h:1128:27: warning: 'v8::HeapProfiler::HeapSnapshotOptions::global_object_name_resolver' is deprecated: Use context_name_resolver callback instead. [-Wdeprecated-declarations]930 1128 | HeapSnapshotOptions() {}931 | ^932../../deps/v8/include/v8-profiler.h:1142:25: note: declared here933 1142 | ObjectNameResolver* global_object_name_resolver = nullptr;934 | ^~~~~~~~~~~~~~~~~~~~~~~~~~~935[181/1871] CXX obj/src/node_base.node_binding.o936In file included from ../../src/memory_tracker.h:6,937 from ../../src/aliased_buffer.h:7,938 from ../../src/aliased_buffer-inl.h:6,939 from ../../src/env-inl.h:27,940 from ../../src/node_binding.cc:3:941../../deps/v8/include/v8-profiler.h: In constructor 'v8::HeapProfiler::HeapSnapshotOptions::HeapSnapshotOptions()':942../../deps/v8/include/v8-profiler.h:1128:27: warning: 'v8::HeapProfiler::HeapSnapshotOptions::global_object_name_resolver' is deprecated: Use context_name_resolver callback instead. [-Wdeprecated-declarations]943 1128 | HeapSnapshotOptions() {}944 | ^945../../deps/v8/include/v8-profiler.h:1142:25: note: declared here946 1142 | ObjectNameResolver* global_object_name_resolver = nullptr;947 | ^~~~~~~~~~~~~~~~~~~~~~~~~~~948../../deps/v8/include/v8-profiler.h:1128:27: warning: 'v8::HeapProfiler::HeapSnapshotOptions::global_object_name_resolver' is deprecated: Use context_name_resolver callback instead. [-Wdeprecated-declarations]949 1128 | HeapSnapshotOptions() {}950 | ^951../../deps/v8/include/v8-profiler.h:1142:25: note: declared here952 1142 | ObjectNameResolver* global_object_name_resolver = nullptr;953 | ^~~~~~~~~~~~~~~~~~~~~~~~~~~954[182/1871] CXX obj/src/node_base.node_cjs_lexer.o955In file included from ../../src/memory_tracker.h:6,956 from ../../src/aliased_buffer.h:7,957 from ../../src/aliased_buffer-inl.h:6,958 from ../../src/env-inl.h:27,959 from ../../src/node_cjs_lexer.cc:1:960../../deps/v8/include/v8-profiler.h: In constructor 'v8::HeapProfiler::HeapSnapshotOptions::HeapSnapshotOptions()':961../../deps/v8/include/v8-profiler.h:1128:27: warning: 'v8::HeapProfiler::HeapSnapshotOptions::global_object_name_resolver' is deprecated: Use context_name_resolver callback instead. [-Wdeprecated-declarations]962 1128 | HeapSnapshotOptions() {}963 | ^964../../deps/v8/include/v8-profiler.h:1142:25: note: declared here965 1142 | ObjectNameResolver* global_object_name_resolver = nullptr;966 | ^~~~~~~~~~~~~~~~~~~~~~~~~~~967../../deps/v8/include/v8-profiler.h:1128:27: warning: 'v8::HeapProfiler::HeapSnapshotOptions::global_object_name_resolver' is deprecated: Use context_name_resolver callback instead. [-Wdeprecated-declarations]968 1128 | HeapSnapshotOptions() {}969 | ^970../../deps/v8/include/v8-profiler.h:1142:25: note: declared here971 1142 | ObjectNameResolver* global_object_name_resolver = nullptr;972 | ^~~~~~~~~~~~~~~~~~~~~~~~~~~973[183/1871] CXX obj/src/node_base.node_profiling.o974In file included from ../../src/node_profiling.h:6,975 from ../../src/node_profiling.cc:1:976../../deps/v8/include/v8-profiler.h: In constructor 'v8::HeapProfiler::HeapSnapshotOptions::HeapSnapshotOptions()':977../../deps/v8/include/v8-profiler.h:1128:27: warning: 'v8::HeapProfiler::HeapSnapshotOptions::global_object_name_resolver' is deprecated: Use context_name_resolver callback instead. [-Wdeprecated-declarations]978 1128 | HeapSnapshotOptions() {}979 | ^980../../deps/v8/include/v8-profiler.h:1142:25: note: declared here981 1142 | ObjectNameResolver* global_object_name_resolver = nullptr;982 | ^~~~~~~~~~~~~~~~~~~~~~~~~~~983../../deps/v8/include/v8-profiler.h:1128:27: warning: 'v8::HeapProfiler::HeapSnapshotOptions::global_object_name_resolver' is deprecated: Use context_name_resolver callback instead. [-Wdeprecated-declarations]984 1128 | HeapSnapshotOptions() {}985 | ^986../../deps/v8/include/v8-profiler.h:1142:25: note: declared here987 1142 | ObjectNameResolver* global_object_name_resolver = nullptr;988 | ^~~~~~~~~~~~~~~~~~~~~~~~~~~989[184/1871] CXX obj/src/node_base.node_env_var.o990In file included from ../../src/memory_tracker.h:6,991 from ../../src/base_object.h:29,992 from ../../src/async_wrap.h:27,993 from ../../src/debug_utils.h:6,994 from ../../src/debug_utils-inl.h:6,995 from ../../src/node_env_var.cc:1:996../../deps/v8/include/v8-profiler.h: In constructor 'v8::HeapProfiler::HeapSnapshotOptions::HeapSnapshotOptions()':997../../deps/v8/include/v8-profiler.h:1128:27: warning: 'v8::HeapProfiler::HeapSnapshotOptions::global_object_name_resolver' is deprecated: Use context_name_resolver callback instead. [-Wdeprecated-declarations]998 1128 | HeapSnapshotOptions() {}999 | ^1000../../deps/v8/include/v8-profiler.h:1142:25: note: declared here1001 1142 | ObjectNameResolver* global_object_name_resolver = nullptr;1002 | ^~~~~~~~~~~~~~~~~~~~~~~~~~~1003../../deps/v8/include/v8-profiler.h:1128:27: warning: 'v8::HeapProfiler::HeapSnapshotOptions::global_object_name_resolver' is deprecated: Use context_name_resolver callback instead. [-Wdeprecated-declarations]1004 1128 | HeapSnapshotOptions() {}1005 | ^1006../../deps/v8/include/v8-profiler.h:1142:25: note: declared here1007 1142 | ObjectNameResolver* global_object_name_resolver = nullptr;1008 | ^~~~~~~~~~~~~~~~~~~~~~~~~~~1009[185/1871] CXX obj/src/node_base.node_dotenv.o1010In file included from ../../src/util.h:29,1011 from ../../src/util-inl.h:33,1012 from ../../src/node_dotenv.h:6,1013 from ../../src/node_dotenv.cc:1:1014../../deps/v8/include/v8-profiler.h: In constructor 'v8::HeapProfiler::HeapSnapshotOptions::HeapSnapshotOptions()':1015../../deps/v8/include/v8-profiler.h:1128:27: warning: 'v8::HeapProfiler::HeapSnapshotOptions::global_object_name_resolver' is deprecated: Use context_name_resolver callback instead. [-Wdeprecated-declarations]1016 1128 | HeapSnapshotOptions() {}1017 | ^1018../../deps/v8/include/v8-profiler.h:1142:25: note: declared here1019 1142 | ObjectNameResolver* global_object_name_resolver = nullptr;1020 | ^~~~~~~~~~~~~~~~~~~~~~~~~~~1021../../deps/v8/include/v8-profiler.h:1128:27: warning: 'v8::HeapProfiler::HeapSnapshotOptions::global_object_name_resolver' is deprecated: Use context_name_resolver callback instead. [-Wdeprecated-declarations]1022 1128 | HeapSnapshotOptions() {}1023 | ^1024../../deps/v8/include/v8-profiler.h:1142:25: note: declared here1025 1142 | ObjectNameResolver* global_object_name_resolver = nullptr;1026 | ^~~~~~~~~~~~~~~~~~~~~~~~~~~1027[186/1871] CXX obj/src/node_base.node_config_file.o1028In file included from ../../src/memory_tracker.h:6,1029 from ../../src/aliased_buffer.h:7,1030 from ../../src/env.h:27,1031 from ../../src/node_internals.h:27,1032 from ../../src/node_config_file.h:12,1033 from ../../src/node_config_file.cc:1:1034../../deps/v8/include/v8-profiler.h: In constructor 'v8::HeapProfiler::HeapSnapshotOptions::HeapSnapshotOptions()':1035../../deps/v8/include/v8-profiler.h:1128:27: warning: 'v8::HeapProfiler::HeapSnapshotOptions::global_object_name_resolver' is deprecated: Use context_name_resolver callback instead. [-Wdeprecated-declarations]1036 1128 | HeapSnapshotOptions() {}1037 | ^1038../../deps/v8/include/v8-profiler.h:1142:25: note: declared here1039 1142 | ObjectNameResolver* global_object_name_resolver = nullptr;1040 | ^~~~~~~~~~~~~~~~~~~~~~~~~~~1041../../deps/v8/include/v8-profiler.h:1128:27: warning: 'v8::HeapProfiler::HeapSnapshotOptions::global_object_name_resolver' is deprecated: Use context_name_resolver callback instead. [-Wdeprecated-declarations]1042 1128 | HeapSnapshotOptions() {}1043 | ^1044../../deps/v8/include/v8-profiler.h:1142:25: note: declared here1045 1142 | ObjectNameResolver* global_object_name_resolver = nullptr;1046 | ^~~~~~~~~~~~~~~~~~~~~~~~~~~1047[187/1871] CXX obj/src/node_base.js_native_api_v8.o1048In file included from ../../src/memory_tracker.h:6,1049 from ../../src/aliased_buffer.h:7,1050 from ../../src/aliased_buffer-inl.h:6,1051 from ../../src/env-inl.h:27,1052 from ../../src/js_native_api_v8.cc:7:1053../../deps/v8/include/v8-profiler.h: In constructor 'v8::HeapProfiler::HeapSnapshotOptions::HeapSnapshotOptions()':1054../../deps/v8/include/v8-profiler.h:1128:27: warning: 'v8::HeapProfiler::HeapSnapshotOptions::global_object_name_resolver' is deprecated: Use context_name_resolver callback instead. [-Wdeprecated-declarations]1055 1128 | HeapSnapshotOptions() {}1056 | ^1057../../deps/v8/include/v8-profiler.h:1142:25: note: declared here1058 1142 | ObjectNameResolver* global_object_name_resolver = nullptr;1059 | ^~~~~~~~~~~~~~~~~~~~~~~~~~~1060../../deps/v8/include/v8-profiler.h:1128:27: warning: 'v8::HeapProfiler::HeapSnapshotOptions::global_object_name_resolver' is deprecated: Use context_name_resolver callback instead. [-Wdeprecated-declarations]1061 1128 | HeapSnapshotOptions() {}1062 | ^1063../../deps/v8/include/v8-profiler.h:1142:25: note: declared here1064 1142 | ObjectNameResolver* global_object_name_resolver = nullptr;1065 | ^~~~~~~~~~~~~~~~~~~~~~~~~~~1066[188/1871] CXX obj/src/node_base.node_external_reference.o1067In file included from ../../src/memory_tracker.h:6,1068 from ../../src/base_object.h:29,1069 from ../../src/base_object-inl.h:27,1070 from ../../src/node_external_reference.cc:4:1071../../deps/v8/include/v8-profiler.h: In constructor 'v8::HeapProfiler::HeapSnapshotOptions::HeapSnapshotOptions()':1072../../deps/v8/include/v8-profiler.h:1128:27: warning: 'v8::HeapProfiler::HeapSnapshotOptions::global_object_name_resolver' is deprecated: Use context_name_resolver callback instead. [-Wdeprecated-declarations]1073 1128 | HeapSnapshotOptions() {}1074 | ^1075../../deps/v8/include/v8-profiler.h:1142:25: note: declared here1076 1142 | ObjectNameResolver* global_object_name_resolver = nullptr;1077 | ^~~~~~~~~~~~~~~~~~~~~~~~~~~1078../../deps/v8/include/v8-profiler.h:1128:27: warning: 'v8::HeapProfiler::HeapSnapshotOptions::global_object_name_resolver' is deprecated: Use context_name_resolver callback instead. [-Wdeprecated-declarations]1079 1128 | HeapSnapshotOptions() {}1080 | ^1081../../deps/v8/include/v8-profiler.h:1142:25: note: declared here1082 1142 | ObjectNameResolver* global_object_name_resolver = nullptr;1083 | ^~~~~~~~~~~~~~~~~~~~~~~~~~~1084[189/1871] CXX obj/src/node_base.node_dir.o1085In file included from ../../src/memory_tracker.h:6,1086 from ../../src/aliased_buffer.h:7,1087 from ../../src/node_file.h:7,1088 from ../../src/node_dir.h:6,1089 from ../../src/node_dir.cc:1:1090../../deps/v8/include/v8-profiler.h: In constructor 'v8::HeapProfiler::HeapSnapshotOptions::HeapSnapshotOptions()':1091../../deps/v8/include/v8-profiler.h:1128:27: warning: 'v8::HeapProfiler::HeapSnapshotOptions::global_object_name_resolver' is deprecated: Use context_name_resolver callback instead. [-Wdeprecated-declarations]1092 1128 | HeapSnapshotOptions() {}1093 | ^1094../../deps/v8/include/v8-profiler.h:1142:25: note: declared here1095 1142 | ObjectNameResolver* global_object_name_resolver = nullptr;1096 | ^~~~~~~~~~~~~~~~~~~~~~~~~~~1097../../deps/v8/include/v8-profiler.h:1128:27: warning: 'v8::HeapProfiler::HeapSnapshotOptions::global_object_name_resolver' is deprecated: Use context_name_resolver callback instead. [-Wdeprecated-declarations]1098 1128 | HeapSnapshotOptions() {}1099 | ^1100../../deps/v8/include/v8-profiler.h:1142:25: note: declared here1101 1142 | ObjectNameResolver* global_object_name_resolver = nullptr;1102 | ^~~~~~~~~~~~~~~~~~~~~~~~~~~1103[190/1871] CXX obj/src/node_base.node_blob.o1104In file included from ../../src/memory_tracker.h:6,1105 from ../../src/base_object.h:29,1106 from ../../src/async_wrap.h:27,1107 from ../../src/node_blob.h:8,1108 from ../../src/node_blob.cc:1:1109../../deps/v8/include/v8-profiler.h: In constructor 'v8::HeapProfiler::HeapSnapshotOptions::HeapSnapshotOptions()':1110../../deps/v8/include/v8-profiler.h:1128:27: warning: 'v8::HeapProfiler::HeapSnapshotOptions::global_object_name_resolver' is deprecated: Use context_name_resolver callback instead. [-Wdeprecated-declarations]1111 1128 | HeapSnapshotOptions() {}1112 | ^1113../../deps/v8/include/v8-profiler.h:1142:25: note: declared here1114 1142 | ObjectNameResolver* global_object_name_resolver = nullptr;1115 | ^~~~~~~~~~~~~~~~~~~~~~~~~~~1116../../deps/v8/include/v8-profiler.h:1128:27: warning: 'v8::HeapProfiler::HeapSnapshotOptions::global_object_name_resolver' is deprecated: Use context_name_resolver callback instead. [-Wdeprecated-declarations]1117 1128 | HeapSnapshotOptions() {}1118 | ^1119../../deps/v8/include/v8-profiler.h:1142:25: note: declared here1120 1142 | ObjectNameResolver* global_object_name_resolver = nullptr;1121 | ^~~~~~~~~~~~~~~~~~~~~~~~~~~1122[191/1871] CXX obj/src/node_base.module_wrap.o1123In file included from ../../src/memory_tracker.h:6,1124 from ../../src/base_object.h:29,1125 from ../../src/module_wrap.h:10,1126 from ../../src/module_wrap.cc:1:1127../../deps/v8/include/v8-profiler.h: In constructor 'v8::HeapProfiler::HeapSnapshotOptions::HeapSnapshotOptions()':1128../../deps/v8/include/v8-profiler.h:1128:27: warning: 'v8::HeapProfiler::HeapSnapshotOptions::global_object_name_resolver' is deprecated: Use context_name_resolver callback instead. [-Wdeprecated-declarations]1129 1128 | HeapSnapshotOptions() {}1130 | ^1131../../deps/v8/include/v8-profiler.h:1142:25: note: declared here1132 1142 | ObjectNameResolver* global_object_name_resolver = nullptr;1133 | ^~~~~~~~~~~~~~~~~~~~~~~~~~~1134../../deps/v8/include/v8-profiler.h:1128:27: warning: 'v8::HeapProfiler::HeapSnapshotOptions::global_object_name_resolver' is deprecated: Use context_name_resolver callback instead. [-Wdeprecated-declarations]1135 1128 | HeapSnapshotOptions() {}1136 | ^1137../../deps/v8/include/v8-profiler.h:1142:25: note: declared here1138 1142 | ObjectNameResolver* global_object_name_resolver = nullptr;1139 | ^~~~~~~~~~~~~~~~~~~~~~~~~~~1140[192/1871] CXX obj/src/node_base.node_errors.o1141In file included from ../../src/memory_tracker.h:6,1142 from ../../src/base_object.h:29,1143 from ../../src/async_wrap.h:27,1144 from ../../src/debug_utils.h:6,1145 from ../../src/debug_utils-inl.h:6,1146 from ../../src/node_errors.cc:6:1147../../deps/v8/include/v8-profiler.h: In constructor 'v8::HeapProfiler::HeapSnapshotOptions::HeapSnapshotOptions()':1148../../deps/v8/include/v8-profiler.h:1128:27: warning: 'v8::HeapProfiler::HeapSnapshotOptions::global_object_name_resolver' is deprecated: Use context_name_resolver callback instead. [-Wdeprecated-declarations]1149 1128 | HeapSnapshotOptions() {}1150 | ^1151../../deps/v8/include/v8-profiler.h:1142:25: note: declared here1152 1142 | ObjectNameResolver* global_object_name_resolver = nullptr;1153 | ^~~~~~~~~~~~~~~~~~~~~~~~~~~1154../../deps/v8/include/v8-profiler.h:1128:27: warning: 'v8::HeapProfiler::HeapSnapshotOptions::global_object_name_resolver' is deprecated: Use context_name_resolver callback instead. [-Wdeprecated-declarations]1155 1128 | HeapSnapshotOptions() {}1156 | ^1157../../deps/v8/include/v8-profiler.h:1142:25: note: declared here1158 1142 | ObjectNameResolver* global_object_name_resolver = nullptr;1159 | ^~~~~~~~~~~~~~~~~~~~~~~~~~~1160[193/1871] CXX obj/src/node_base.node.o1161In file included from ../../src/memory_tracker.h:6,1162 from ../../src/aliased_buffer.h:7,1163 from ../../src/env.h:27,1164 from ../../src/node_internals.h:27,1165 from ../../src/node_config_file.h:12,1166 from ../../src/node.cc:23:1167../../deps/v8/include/v8-profiler.h: In constructor 'v8::HeapProfiler::HeapSnapshotOptions::HeapSnapshotOptions()':1168../../deps/v8/include/v8-profiler.h:1128:27: warning: 'v8::HeapProfiler::HeapSnapshotOptions::global_object_name_resolver' is deprecated: Use context_name_resolver callback instead. [-Wdeprecated-declarations]1169 1128 | HeapSnapshotOptions() {}1170 | ^1171../../deps/v8/include/v8-profiler.h:1142:25: note: declared here1172 1142 | ObjectNameResolver* global_object_name_resolver = nullptr;1173 | ^~~~~~~~~~~~~~~~~~~~~~~~~~~1174../../deps/v8/include/v8-profiler.h:1128:27: warning: 'v8::HeapProfiler::HeapSnapshotOptions::global_object_name_resolver' is deprecated: Use context_name_resolver callback instead. [-Wdeprecated-declarations]1175 1128 | HeapSnapshotOptions() {}1176 | ^1177../../deps/v8/include/v8-profiler.h:1142:25: note: declared here1178 1142 | ObjectNameResolver* global_object_name_resolver = nullptr;1179 | ^~~~~~~~~~~~~~~~~~~~~~~~~~~1180[194/1871] CXX obj/src/node_base.node_buffer.o1181In file included from ../../src/memory_tracker.h:6,1182 from ../../src/base_object.h:29,1183 from ../../src/async_wrap.h:27,1184 from ../../src/node_blob.h:8,1185 from ../../src/node_buffer.cc:24:1186../../deps/v8/include/v8-profiler.h: In constructor 'v8::HeapProfiler::HeapSnapshotOptions::HeapSnapshotOptions()':1187../../deps/v8/include/v8-profiler.h:1128:27: warning: 'v8::HeapProfiler::HeapSnapshotOptions::global_object_name_resolver' is deprecated: Use context_name_resolver callback instead. [-Wdeprecated-declarations]1188 1128 | HeapSnapshotOptions() {}1189 | ^1190../../deps/v8/include/v8-profiler.h:1142:25: note: declared here1191 1142 | ObjectNameResolver* global_object_name_resolver = nullptr;1192 | ^~~~~~~~~~~~~~~~~~~~~~~~~~~1193../../deps/v8/include/v8-profiler.h:1128:27: warning: 'v8::HeapProfiler::HeapSnapshotOptions::global_object_name_resolver' is deprecated: Use context_name_resolver callback instead. [-Wdeprecated-declarations]1194 1128 | HeapSnapshotOptions() {}1195 | ^1196../../deps/v8/include/v8-profiler.h:1142:25: note: declared here1197 1142 | ObjectNameResolver* global_object_name_resolver = nullptr;1198 | ^~~~~~~~~~~~~~~~~~~~~~~~~~~1199[195/1871] CXX obj/src/node_base.node_builtins.o1200In file included from ../../src/util.h:29,1201 from ../../src/node_mutex.h:6,1202 from ../../src/node_builtins.h:16,1203 from ../../src/node_builtins.cc:1:1204../../deps/v8/include/v8-profiler.h: In constructor 'v8::HeapProfiler::HeapSnapshotOptions::HeapSnapshotOptions()':1205../../deps/v8/include/v8-profiler.h:1128:27: warning: 'v8::HeapProfiler::HeapSnapshotOptions::global_object_name_resolver' is deprecated: Use context_name_resolver callback instead. [-Wdeprecated-declarations]1206 1128 | HeapSnapshotOptions() {}1207 | ^1208../../deps/v8/include/v8-profiler.h:1142:25: note: declared here1209 1142 | ObjectNameResolver* global_object_name_resolver = nullptr;1210 | ^~~~~~~~~~~~~~~~~~~~~~~~~~~1211../../deps/v8/include/v8-profiler.h:1128:27: warning: 'v8::HeapProfiler::HeapSnapshotOptions::global_object_name_resolver' is deprecated: Use context_name_resolver callback instead. [-Wdeprecated-declarations]1212 1128 | HeapSnapshotOptions() {}1213 | ^1214../../deps/v8/include/v8-profiler.h:1142:25: note: declared here1215 1142 | ObjectNameResolver* global_object_name_resolver = nullptr;1216 | ^~~~~~~~~~~~~~~~~~~~~~~~~~~1217[196/1871] CXX obj/src/node_base.node_contextify.o1218In file included from ../../src/memory_tracker.h:6,1219 from ../../src/base_object.h:29,1220 from ../../src/base_object-inl.h:27,1221 from ../../src/node_contextify.h:6,1222 from ../../src/node_contextify.cc:22:1223../../deps/v8/include/v8-profiler.h: In constructor 'v8::HeapProfiler::HeapSnapshotOptions::HeapSnapshotOptions()':1224../../deps/v8/include/v8-profiler.h:1128:27: warning: 'v8::HeapProfiler::HeapSnapshotOptions::global_object_name_resolver' is deprecated: Use context_name_resolver callback instead. [-Wdeprecated-declarations]1225 1128 | HeapSnapshotOptions() {}1226 | ^1227../../deps/v8/include/v8-profiler.h:1142:25: note: declared here1228 1142 | ObjectNameResolver* global_object_name_resolver = nullptr;1229 | ^~~~~~~~~~~~~~~~~~~~~~~~~~~1230../../deps/v8/include/v8-profiler.h:1128:27: warning: 'v8::HeapProfiler::HeapSnapshotOptions::global_object_name_resolver' is deprecated: Use context_name_resolver callback instead. [-Wdeprecated-declarations]1231 1128 | HeapSnapshotOptions() {}1232 | ^1233../../deps/v8/include/v8-profiler.h:1142:25: note: declared here1234 1142 | ObjectNameResolver* global_object_name_resolver = nullptr;1235 | ^~~~~~~~~~~~~~~~~~~~~~~~~~~1236[197/1871] CXX obj/gen/node_base.node_javascript.o1237In file included from ../../src/memory_tracker.h:6,1238 from ../../src/aliased_buffer.h:7,1239 from ../../src/aliased_buffer-inl.h:6,1240 from ../../src/env-inl.h:27,1241 from gen/node_javascript.cc:2:1242../../deps/v8/include/v8-profiler.h: In constructor 'v8::HeapProfiler::HeapSnapshotOptions::HeapSnapshotOptions()':1243../../deps/v8/include/v8-profiler.h:1128:27: warning: 'v8::HeapProfiler::HeapSnapshotOptions::global_object_name_resolver' is deprecated: Use context_name_resolver callback instead. [-Wdeprecated-declarations]1244 1128 | HeapSnapshotOptions() {}1245 | ^1246../../deps/v8/include/v8-profiler.h:1142:25: note: declared here1247 1142 | ObjectNameResolver* global_object_name_resolver = nullptr;1248 | ^~~~~~~~~~~~~~~~~~~~~~~~~~~1249../../deps/v8/include/v8-profiler.h:1128:27: warning: 'v8::HeapProfiler::HeapSnapshotOptions::global_object_name_resolver' is deprecated: Use context_name_resolver callback instead. [-Wdeprecated-declarations]1250 1128 | HeapSnapshotOptions() {}1251 | ^1252../../deps/v8/include/v8-profiler.h:1142:25: note: declared here1253 1142 | ObjectNameResolver* global_object_name_resolver = nullptr;1254 | ^~~~~~~~~~~~~~~~~~~~~~~~~~~1255[198/1871] CXX obj/src/node_base.node_ipc_serdes.o1256In file included from ../../src/memory_tracker.h:6,1257 from ../../src/aliased_buffer.h:7,1258 from ../../src/aliased_buffer-inl.h:6,1259 from ../../src/env-inl.h:27,1260 from ../../src/node_ipc_serdes.cc:1:1261../../deps/v8/include/v8-profiler.h: In constructor 'v8::HeapProfiler::HeapSnapshotOptions::HeapSnapshotOptions()':1262../../deps/v8/include/v8-profiler.h:1128:27: warning: 'v8::HeapProfiler::HeapSnapshotOptions::global_object_name_resolver' is deprecated: Use context_name_resolver callback instead. [-Wdeprecated-declarations]1263 1128 | HeapSnapshotOptions() {}1264 | ^1265../../deps/v8/include/v8-profiler.h:1142:25: note: declared here1266 1142 | ObjectNameResolver* global_object_name_resolver = nullptr;1267 | ^~~~~~~~~~~~~~~~~~~~~~~~~~~1268../../deps/v8/include/v8-profiler.h:1128:27: warning: 'v8::HeapProfiler::HeapSnapshotOptions::global_object_name_resolver' is deprecated: Use context_name_resolver callback instead. [-Wdeprecated-declarations]1269 1128 | HeapSnapshotOptions() {}1270 | ^1271../../deps/v8/include/v8-profiler.h:1142:25: note: declared here1272 1142 | ObjectNameResolver* global_object_name_resolver = nullptr;1273 | ^~~~~~~~~~~~~~~~~~~~~~~~~~~1274[199/1871] CXX obj/src/node_base.node_http_parser.o1275In file included from ../../src/util.h:29,1276 from ../../src/node_http_parser.cc:24:1277../../deps/v8/include/v8-profiler.h: In constructor 'v8::HeapProfiler::HeapSnapshotOptions::HeapSnapshotOptions()':1278../../deps/v8/include/v8-profiler.h:1128:27: warning: 'v8::HeapProfiler::HeapSnapshotOptions::global_object_name_resolver' is deprecated: Use context_name_resolver callback instead. [-Wdeprecated-declarations]1279 1128 | HeapSnapshotOptions() {}1280 | ^1281../../deps/v8/include/v8-profiler.h:1142:25: note: declared here1282 1142 | ObjectNameResolver* global_object_name_resolver = nullptr;1283 | ^~~~~~~~~~~~~~~~~~~~~~~~~~~1284../../deps/v8/include/v8-profiler.h:1128:27: warning: 'v8::HeapProfiler::HeapSnapshotOptions::global_object_name_resolver' is deprecated: Use context_name_resolver callback instead. [-Wdeprecated-declarations]1285 1128 | HeapSnapshotOptions() {}1286 | ^1287../../deps/v8/include/v8-profiler.h:1142:25: note: declared here1288 1142 | ObjectNameResolver* global_object_name_resolver = nullptr;1289 | ^~~~~~~~~~~~~~~~~~~~~~~~~~~1290[200/1871] CXX obj/src/node_base.cares_wrap.o1291In file included from ../../src/memory_tracker.h:6,1292 from ../../src/base_object.h:29,1293 from ../../src/async_wrap.h:27,1294 from ../../src/cares_wrap.h:8,1295 from ../../src/cares_wrap.cc:22:1296../../deps/v8/include/v8-profiler.h: In constructor 'v8::HeapProfiler::HeapSnapshotOptions::HeapSnapshotOptions()':1297../../deps/v8/include/v8-profiler.h:1128:27: warning: 'v8::HeapProfiler::HeapSnapshotOptions::global_object_name_resolver' is deprecated: Use context_name_resolver callback instead. [-Wdeprecated-declarations]1298 1128 | HeapSnapshotOptions() {}1299 | ^1300../../deps/v8/include/v8-profiler.h:1142:25: note: declared here1301 1142 | ObjectNameResolver* global_object_name_resolver = nullptr;1302 | ^~~~~~~~~~~~~~~~~~~~~~~~~~~1303../../deps/v8/include/v8-profiler.h:1128:27: warning: 'v8::HeapProfiler::HeapSnapshotOptions::global_object_name_resolver' is deprecated: Use context_name_resolver callback instead. [-Wdeprecated-declarations]1304 1128 | HeapSnapshotOptions() {}1305 | ^1306../../deps/v8/include/v8-profiler.h:1142:25: note: declared here1307 1142 | ObjectNameResolver* global_object_name_resolver = nullptr;1308 | ^~~~~~~~~~~~~~~~~~~~~~~~~~~1309../../src/cares_wrap.cc: In function 'v8::Maybe<int> node::cares_wrap::{anonymous}::ParseGeneralReply(node::Environment*, const unsigned char*, int, int*, v8::Local<v8::Array>, void*, int*)':1310../../src/cares_wrap.cc:244:34: warning: 'int ares_parse_a_reply(const unsigned char*, int, hostent**, ares_addrttl*, int*)' is deprecated: Use ares_dns_parse instead [-Wdeprecated-declarations]1311 244 | status = ares_parse_a_reply(buf,1312 | ~~~~~~~~~~~~~~~~~~^~~~~1313 245 | len,1314 | ~~~~1315 246 | &host,1316 | ~~~~~~1317 247 | static_cast<ares_addrttl*>(addrttls),1318 | ~~~~~~~~~~~~~~~~~~~~~~~~~~~~~~~~~~~~~1319 248 | naddrttls);1320 | ~~~~~~~~~~1321In file included from ../../src/cares_wrap.h:17:1322/nix/store/j239p458yixap89j6wpfib9yjypd3ii5-c-ares-1.34.8-dev/include/ares.h:1106:55: note: declared here1323 1106 | CARES_EXTERN CARES_DEPRECATED_FOR(ares_dns_parse) int ares_parse_a_reply(1324 | ^~~~~~~~~~~~~~~~~~1325../../src/cares_wrap.cc:251:37: warning: 'int ares_parse_aaaa_reply(const unsigned char*, int, hostent**, ares_addr6ttl*, int*)' is deprecated: Use ares_dns_parse instead [-Wdeprecated-declarations]1326 251 | status = ares_parse_aaaa_reply(buf,1327 | ~~~~~~~~~~~~~~~~~~~~~^~~~~1328 252 | len,1329 | ~~~~1330 253 | &host,1331 | ~~~~~~1332 254 | static_cast<ares_addr6ttl*>(addrttls),1333 | ~~~~~~~~~~~~~~~~~~~~~~~~~~~~~~~~~~~~~~1334 255 | naddrttls);1335 | ~~~~~~~~~~1336/nix/store/j239p458yixap89j6wpfib9yjypd3ii5-c-ares-1.34.8-dev/include/ares.h:1110:55: note: declared here1337 1110 | CARES_EXTERN CARES_DEPRECATED_FOR(ares_dns_parse) int ares_parse_aaaa_reply(1338 | ^~~~~~~~~~~~~~~~~~~~~1339../../src/cares_wrap.cc:258:35: warning: 'int ares_parse_ns_reply(const unsigned char*, int, hostent**)' is deprecated: Use ares_dns_parse instead [-Wdeprecated-declarations]1340 258 | status = ares_parse_ns_reply(buf, len, &host);1341 | ~~~~~~~~~~~~~~~~~~~^~~~~~~~~~~~~~~~~1342/nix/store/j239p458yixap89j6wpfib9yjypd3ii5-c-ares-1.34.8-dev/include/ares.h:1121:55: note: declared here1343 1121 | CARES_EXTERN CARES_DEPRECATED_FOR(ares_dns_parse) int ares_parse_ns_reply(1344 | ^~~~~~~~~~~~~~~~~~~1345../../src/cares_wrap.cc:261:36: warning: 'int ares_parse_ptr_reply(const unsigned char*, int, const void*, int, int, hostent**)' is deprecated: Use ares_dns_parse instead [-Wdeprecated-declarations]1346 261 | status = ares_parse_ptr_reply(buf, len, nullptr, 0, AF_INET, &host);1347 | ~~~~~~~~~~~~~~~~~~~~^~~~~~~~~~~~~~~~~~~~~~~~~~~~~~~~~~~~~~1348/nix/store/j239p458yixap89j6wpfib9yjypd3ii5-c-ares-1.34.8-dev/include/ares.h:1117:55: note: declared here1349 1117 | CARES_EXTERN CARES_DEPRECATED_FOR(ares_dns_parse) int ares_parse_ptr_reply(1350 | ^~~~~~~~~~~~~~~~~~~~1351../../src/cares_wrap.cc: In function 'v8::Maybe<int> node::cares_wrap::{anonymous}::ParseMxReply(node::Environment*, const unsigned char*, int, v8::Local<v8::Array>, bool)':1352../../src/cares_wrap.cc:337:35: warning: 'int ares_parse_mx_reply(const unsigned char*, int, ares_mx_reply**)' is deprecated: Use ares_dns_parse instead [-Wdeprecated-declarations]1353 337 | int status = ares_parse_mx_reply(buf, len, &mx_start);1354 | ~~~~~~~~~~~~~~~~~~~^~~~~~~~~~~~~~~~~~~~~1355/nix/store/j239p458yixap89j6wpfib9yjypd3ii5-c-ares-1.34.8-dev/include/ares.h:1127:55: note: declared here1356 1127 | CARES_EXTERN CARES_DEPRECATED_FOR(ares_dns_parse) int ares_parse_mx_reply(1357 | ^~~~~~~~~~~~~~~~~~~1358../../src/cares_wrap.cc: In function 'v8::Maybe<int> node::cares_wrap::{anonymous}::ParseCaaReply(node::Environment*, const unsigned char*, int, v8::Local<v8::Array>, bool)':1359../../src/cares_wrap.cc:383:36: warning: 'int ares_parse_caa_reply(const unsigned char*, int, ares_caa_reply**)' is deprecated: Use ares_dns_parse instead [-Wdeprecated-declarations]1360 383 | int status = ares_parse_caa_reply(buf, len, &caa_start);1361 | ~~~~~~~~~~~~~~~~~~~~^~~~~~~~~~~~~~~~~~~~~~1362/nix/store/j239p458yixap89j6wpfib9yjypd3ii5-c-ares-1.34.8-dev/include/ares.h:1114:55: note: declared here1363 1114 | CARES_EXTERN CARES_DEPRECATED_FOR(ares_dns_parse) int ares_parse_caa_reply(1364 | ^~~~~~~~~~~~~~~~~~~~1365../../src/cares_wrap.cc: In function 'v8::Maybe<int> node::cares_wrap::{anonymous}::ParseTxtReply(node::Environment*, const unsigned char*, int, v8::Local<v8::Array>, bool)':1366../../src/cares_wrap.cc:511:40: warning: 'int ares_parse_txt_reply_ext(const unsigned char*, int, ares_txt_ext**)' is deprecated: Use ares_dns_parse instead [-Wdeprecated-declarations]1367 511 | int status = ares_parse_txt_reply_ext(buf, len, &txt_out);1368 | ~~~~~~~~~~~~~~~~~~~~~~~~^~~~~~~~~~~~~~~~~~~~1369/nix/store/j239p458yixap89j6wpfib9yjypd3ii5-c-ares-1.34.8-dev/include/ares.h:1133:55: note: declared here1370 1133 | CARES_EXTERN CARES_DEPRECATED_FOR(ares_dns_parse) int ares_parse_txt_reply_ext(1371 | ^~~~~~~~~~~~~~~~~~~~~~~~1372../../src/cares_wrap.cc: In function 'v8::Maybe<int> node::cares_wrap::{anonymous}::ParseSrvReply(node::Environment*, const unsigned char*, int, v8::Local<v8::Array>, bool)':1373../../src/cares_wrap.cc:598:36: warning: 'int ares_parse_srv_reply(const unsigned char*, int, ares_srv_reply**)' is deprecated: Use ares_dns_parse instead [-Wdeprecated-declarations]1374 598 | int status = ares_parse_srv_reply(buf, len, &srv_start);1375 | ~~~~~~~~~~~~~~~~~~~~^~~~~~~~~~~~~~~~~~~~~~1376/nix/store/j239p458yixap89j6wpfib9yjypd3ii5-c-ares-1.34.8-dev/include/ares.h:1124:55: note: declared here1377 1124 | CARES_EXTERN CARES_DEPRECATED_FOR(ares_dns_parse) int ares_parse_srv_reply(1378 | ^~~~~~~~~~~~~~~~~~~~1379../../src/cares_wrap.cc: In function 'v8::Maybe<int> node::cares_wrap::{anonymous}::ParseNaptrReply(node::Environment*, const unsigned char*, int, v8::Local<v8::Array>, bool)':1380../../src/cares_wrap.cc:653:38: warning: 'int ares_parse_naptr_reply(const unsigned char*, int, ares_naptr_reply**)' is deprecated: Use ares_dns_parse instead [-Wdeprecated-declarations]1381 653 | int status = ares_parse_naptr_reply(buf, len, &naptr_start);1382 | ~~~~~~~~~~~~~~~~~~~~~~^~~~~~~~~~~~~~~~~~~~~~~~1383/nix/store/j239p458yixap89j6wpfib9yjypd3ii5-c-ares-1.34.8-dev/include/ares.h:1136:55: note: declared here1384 1136 | CARES_EXTERN CARES_DEPRECATED_FOR(ares_dns_parse) int ares_parse_naptr_reply(1385 | ^~~~~~~~~~~~~~~~~~~~~~1386../../src/cares_wrap.cc: In member function 'void node::cares_wrap::ChannelWrap::EnsureServers()':1387../../src/cares_wrap.cc:1000:25: warning: 'int ares_get_servers_ports(const ares_channel_t*, ares_addr_port_node**)' is deprecated: Use ares_get_servers_csv instead [-Wdeprecated-declarations]1388 1000 | ares_get_servers_ports(channel_, &servers);1389 | ~~~~~~~~~~~~~~~~~~~~~~^~~~~~~~~~~~~~~~~~~~1390/nix/store/j239p458yixap89j6wpfib9yjypd3ii5-c-ares-1.34.8-dev/include/ares.h:1196:28: note: declared here1391 1196 | int ares_get_servers_ports(const ares_channel_t *channel,1392 | ^~~~~~~~~~~~~~~~~~~~~~1393../../src/cares_wrap.cc: In static member function 'static v8::Maybe<int> node::cares_wrap::SoaTraits::Parse(node::cares_wrap::QuerySoaWrap*, const std::unique_ptr<node::cares_wrap::ResponseData>&)':1394../../src/cares_wrap.cc:1711:36: warning: 'int ares_parse_soa_reply(const unsigned char*, int, ares_soa_reply**)' is deprecated: Use ares_dns_parse instead [-Wdeprecated-declarations]1395 1711 | int status = ares_parse_soa_reply(buf, len, &soa_out);1396 | ~~~~~~~~~~~~~~~~~~~~^~~~~~~~~~~~~~~~~~~~1397/nix/store/j239p458yixap89j6wpfib9yjypd3ii5-c-ares-1.34.8-dev/include/ares.h:1139:55: note: declared here1398 1139 | CARES_EXTERN CARES_DEPRECATED_FOR(ares_dns_parse) int ares_parse_soa_reply(1399 | ^~~~~~~~~~~~~~~~~~~~1400../../src/cares_wrap.cc: In function 'void node::cares_wrap::{anonymous}::GetServers(const v8::FunctionCallbackInfo<v8::Value>&)':1401../../src/cares_wrap.cc:2092:33: warning: 'int ares_get_servers_ports(const ares_channel_t*, ares_addr_port_node**)' is deprecated: Use ares_get_servers_csv instead [-Wdeprecated-declarations]1402 2092 | int r = ares_get_servers_ports(channel->cares_channel(), &servers);1403 | ~~~~~~~~~~~~~~~~~~~~~~^~~~~~~~~~~~~~~~~~~~~~~~~~~~~~~~~~~~1404/nix/store/j239p458yixap89j6wpfib9yjypd3ii5-c-ares-1.34.8-dev/include/ares.h:1196:28: note: declared here1405 1196 | int ares_get_servers_ports(const ares_channel_t *channel,1406 | ^~~~~~~~~~~~~~~~~~~~~~1407../../src/cares_wrap.cc: In function 'void node::cares_wrap::{anonymous}::SetServers(const v8::FunctionCallbackInfo<v8::Value>&)':1408../../src/cares_wrap.cc:2137:30: warning: 'int ares_set_servers(ares_channel_t*, const ares_addr_node*)' is deprecated: Use ares_set_servers_csv instead [-Wdeprecated-declarations]1409 2137 | int rv = ares_set_servers(channel->cares_channel(), nullptr);1410 | ~~~~~~~~~~~~~~~~^~~~~~~~~~~~~~~~~~~~~~~~~~~~~~~~~~~1411/nix/store/j239p458yixap89j6wpfib9yjypd3ii5-c-ares-1.34.8-dev/include/ares.h:1176:61: note: declared here1412 1176 | CARES_EXTERN CARES_DEPRECATED_FOR(ares_set_servers_csv) int ares_set_servers(1413 | ^~~~~~~~~~~~~~~~1414../../src/cares_wrap.cc:2197:33: warning: 'int ares_set_servers_ports(ares_channel_t*, const ares_addr_port_node*)' is deprecated: Use ares_set_servers_ports_csv instead [-Wdeprecated-declarations]1415 2197 | err = ares_set_servers_ports(channel->cares_channel(), servers.data());1416 | ~~~~~~~~~~~~~~~~~~~~~~^~~~~~~~~~~~~~~~~~~~~~~~~~~~~~~~~~~~~~~~~~1417/nix/store/j239p458yixap89j6wpfib9yjypd3ii5-c-ares-1.34.8-dev/include/ares.h:1181:20: note: declared here1418 1181 | int ares_set_servers_ports(ares_channel_t *channel,1419 | ^~~~~~~~~~~~~~~~~~~~~~1420[201/1871] CXX obj/src/node_base.node_os.o1421In file included from ../../src/memory_tracker.h:6,1422 from ../../src/aliased_buffer.h:7,1423 from ../../src/aliased_buffer-inl.h:6,1424 from ../../src/env-inl.h:27,1425 from ../../src/node_os.cc:22:1426../../deps/v8/include/v8-profiler.h: In constructor 'v8::HeapProfiler::HeapSnapshotOptions::HeapSnapshotOptions()':1427../../deps/v8/include/v8-profiler.h:1128:27: warning: 'v8::HeapProfiler::HeapSnapshotOptions::global_object_name_resolver' is deprecated: Use context_name_resolver callback instead. [-Wdeprecated-declarations]1428 1128 | HeapSnapshotOptions() {}1429 | ^1430../../deps/v8/include/v8-profiler.h:1142:25: note: declared here1431 1142 | ObjectNameResolver* global_object_name_resolver = nullptr;1432 | ^~~~~~~~~~~~~~~~~~~~~~~~~~~1433../../deps/v8/include/v8-profiler.h:1128:27: warning: 'v8::HeapProfiler::HeapSnapshotOptions::global_object_name_resolver' is deprecated: Use context_name_resolver callback instead. [-Wdeprecated-declarations]1434 1128 | HeapSnapshotOptions() {}1435 | ^1436../../deps/v8/include/v8-profiler.h:1142:25: note: declared here1437 1142 | ObjectNameResolver* global_object_name_resolver = nullptr;1438 | ^~~~~~~~~~~~~~~~~~~~~~~~~~~1439[202/1871] CXX obj/src/node_base.node_perf.o1440In file included from ../../src/memory_tracker.h:6,1441 from ../../src/base_object.h:29,1442 from ../../src/base_object-inl.h:27,1443 from ../../src/node_perf.h:6,1444 from ../../src/node_perf.cc:1:1445../../deps/v8/include/v8-profiler.h: In constructor 'v8::HeapProfiler::HeapSnapshotOptions::HeapSnapshotOptions()':1446../../deps/v8/include/v8-profiler.h:1128:27: warning: 'v8::HeapProfiler::HeapSnapshotOptions::global_object_name_resolver' is deprecated: Use context_name_resolver callback instead. [-Wdeprecated-declarations]1447 1128 | HeapSnapshotOptions() {}1448 | ^1449../../deps/v8/include/v8-profiler.h:1142:25: note: declared here1450 1142 | ObjectNameResolver* global_object_name_resolver = nullptr;1451 | ^~~~~~~~~~~~~~~~~~~~~~~~~~~1452../../deps/v8/include/v8-profiler.h:1128:27: warning: 'v8::HeapProfiler::HeapSnapshotOptions::global_object_name_resolver' is deprecated: Use context_name_resolver callback instead. [-Wdeprecated-declarations]1453 1128 | HeapSnapshotOptions() {}1454 | ^1455../../deps/v8/include/v8-profiler.h:1142:25: note: declared here1456 1142 | ObjectNameResolver* global_object_name_resolver = nullptr;1457 | ^~~~~~~~~~~~~~~~~~~~~~~~~~~1458[203/1871] CXX obj/src/node_base.node_metadata.o1459In file included from ../../src/util.h:29,1460 from ../../src/node_metadata.cc:22:1461../../deps/v8/include/v8-profiler.h: In constructor 'v8::HeapProfiler::HeapSnapshotOptions::HeapSnapshotOptions()':1462../../deps/v8/include/v8-profiler.h:1128:27: warning: 'v8::HeapProfiler::HeapSnapshotOptions::global_object_name_resolver' is deprecated: Use context_name_resolver callback instead. [-Wdeprecated-declarations]1463 1128 | HeapSnapshotOptions() {}1464 | ^1465../../deps/v8/include/v8-profiler.h:1142:25: note: declared here1466 1142 | ObjectNameResolver* global_object_name_resolver = nullptr;1467 | ^~~~~~~~~~~~~~~~~~~~~~~~~~~1468../../deps/v8/include/v8-profiler.h:1128:27: warning: 'v8::HeapProfiler::HeapSnapshotOptions::global_object_name_resolver' is deprecated: Use context_name_resolver callback instead. [-Wdeprecated-declarations]1469 1128 | HeapSnapshotOptions() {}1470 | ^1471../../deps/v8/include/v8-profiler.h:1142:25: note: declared here1472 1142 | ObjectNameResolver* global_object_name_resolver = nullptr;1473 | ^~~~~~~~~~~~~~~~~~~~~~~~~~~1474[204/1871] CXX obj/src/node_base.node_i18n.o1475In file included from ../../src/memory_tracker.h:6,1476 from ../../src/base_object.h:29,1477 from ../../src/node_i18n.h:29,1478 from ../../src/node_i18n.cc:43:1479../../deps/v8/include/v8-profiler.h: In constructor 'v8::HeapProfiler::HeapSnapshotOptions::HeapSnapshotOptions()':1480../../deps/v8/include/v8-profiler.h:1128:27: warning: 'v8::HeapProfiler::HeapSnapshotOptions::global_object_name_resolver' is deprecated: Use context_name_resolver callback instead. [-Wdeprecated-declarations]1481 1128 | HeapSnapshotOptions() {}1482 | ^1483../../deps/v8/include/v8-profiler.h:1142:25: note: declared here1484 1142 | ObjectNameResolver* global_object_name_resolver = nullptr;1485 | ^~~~~~~~~~~~~~~~~~~~~~~~~~~1486../../deps/v8/include/v8-profiler.h:1128:27: warning: 'v8::HeapProfiler::HeapSnapshotOptions::global_object_name_resolver' is deprecated: Use context_name_resolver callback instead. [-Wdeprecated-declarations]1487 1128 | HeapSnapshotOptions() {}1488 | ^1489../../deps/v8/include/v8-profiler.h:1142:25: note: declared here1490 1142 | ObjectNameResolver* global_object_name_resolver = nullptr;1491 | ^~~~~~~~~~~~~~~~~~~~~~~~~~~1492[205/1871] CXX obj/src/node_base.node_diagnostics_channel.o1493In file included from ../../src/memory_tracker.h:6,1494 from ../../src/aliased_buffer.h:7,1495 from ../../src/node_diagnostics_channel.h:11,1496 from ../../src/node_diagnostics_channel.cc:1:1497../../deps/v8/include/v8-profiler.h: In constructor 'v8::HeapProfiler::HeapSnapshotOptions::HeapSnapshotOptions()':1498../../deps/v8/include/v8-profiler.h:1128:27: warning: 'v8::HeapProfiler::HeapSnapshotOptions::global_object_name_resolver' is deprecated: Use context_name_resolver callback instead. [-Wdeprecated-declarations]1499 1128 | HeapSnapshotOptions() {}1500 | ^1501../../deps/v8/include/v8-profiler.h:1142:25: note: declared here1502 1142 | ObjectNameResolver* global_object_name_resolver = nullptr;1503 | ^~~~~~~~~~~~~~~~~~~~~~~~~~~1504../../deps/v8/include/v8-profiler.h:1128:27: warning: 'v8::HeapProfiler::HeapSnapshotOptions::global_object_name_resolver' is deprecated: Use context_name_resolver callback instead. [-Wdeprecated-declarations]1505 1128 | HeapSnapshotOptions() {}1506 | ^1507../../deps/v8/include/v8-profiler.h:1142:25: note: declared here1508 1142 | ObjectNameResolver* global_object_name_resolver = nullptr;1509 | ^~~~~~~~~~~~~~~~~~~~~~~~~~~1510[206/1871] CXX obj/src/node_base.node_main_instance.o1511In file included from ../../src/util.h:29,1512 from ../../src/node_main_instance.h:11,1513 from ../../src/node_main_instance.cc:1:1514../../deps/v8/include/v8-profiler.h: In constructor 'v8::HeapProfiler::HeapSnapshotOptions::HeapSnapshotOptions()':1515../../deps/v8/include/v8-profiler.h:1128:27: warning: 'v8::HeapProfiler::HeapSnapshotOptions::global_object_name_resolver' is deprecated: Use context_name_resolver callback instead. [-Wdeprecated-declarations]1516 1128 | HeapSnapshotOptions() {}1517 | ^1518../../deps/v8/include/v8-profiler.h:1142:25: note: declared here1519 1142 | ObjectNameResolver* global_object_name_resolver = nullptr;1520 | ^~~~~~~~~~~~~~~~~~~~~~~~~~~1521../../deps/v8/include/v8-profiler.h:1128:27: warning: 'v8::HeapProfiler::HeapSnapshotOptions::global_object_name_resolver' is deprecated: Use context_name_resolver callback instead. [-Wdeprecated-declarations]1522 1128 | HeapSnapshotOptions() {}1523 | ^1524../../deps/v8/include/v8-profiler.h:1142:25: note: declared here1525 1142 | ObjectNameResolver* global_object_name_resolver = nullptr;1526 | ^~~~~~~~~~~~~~~~~~~~~~~~~~~1527[207/1871] CXX obj/src/node_base.node_postmortem_metadata.o1528In file included from ../../src/memory_tracker.h:6,1529 from ../../src/base_object.h:29,1530 from ../../src/base_object-inl.h:27,1531 from ../../src/node_postmortem_metadata.cc:1:1532../../deps/v8/include/v8-profiler.h: In constructor 'v8::HeapProfiler::HeapSnapshotOptions::HeapSnapshotOptions()':1533../../deps/v8/include/v8-profiler.h:1128:27: warning: 'v8::HeapProfiler::HeapSnapshotOptions::global_object_name_resolver' is deprecated: Use context_name_resolver callback instead. [-Wdeprecated-declarations]1534 1128 | HeapSnapshotOptions() {}1535 | ^1536../../deps/v8/include/v8-profiler.h:1142:25: note: declared here1537 1142 | ObjectNameResolver* global_object_name_resolver = nullptr;1538 | ^~~~~~~~~~~~~~~~~~~~~~~~~~~1539../../deps/v8/include/v8-profiler.h:1128:27: warning: 'v8::HeapProfiler::HeapSnapshotOptions::global_object_name_resolver' is deprecated: Use context_name_resolver callback instead. [-Wdeprecated-declarations]1540 1128 | HeapSnapshotOptions() {}1541 | ^1542../../deps/v8/include/v8-profiler.h:1142:25: note: declared here1543 1142 | ObjectNameResolver* global_object_name_resolver = nullptr;1544 | ^~~~~~~~~~~~~~~~~~~~~~~~~~~1545[208/1871] CXX obj/src/node_base.node_process_events.o1546In file included from ../../src/memory_tracker.h:6,1547 from ../../src/aliased_buffer.h:7,1548 from ../../src/aliased_buffer-inl.h:6,1549 from ../../src/env-inl.h:27,1550 from ../../src/node_process_events.cc:3:1551../../deps/v8/include/v8-profiler.h: In constructor 'v8::HeapProfiler::HeapSnapshotOptions::HeapSnapshotOptions()':1552../../deps/v8/include/v8-profiler.h:1128:27: warning: 'v8::HeapProfiler::HeapSnapshotOptions::global_object_name_resolver' is deprecated: Use context_name_resolver callback instead. [-Wdeprecated-declarations]1553 1128 | HeapSnapshotOptions() {}1554 | ^1555../../deps/v8/include/v8-profiler.h:1142:25: note: declared here1556 1142 | ObjectNameResolver* global_object_name_resolver = nullptr;1557 | ^~~~~~~~~~~~~~~~~~~~~~~~~~~1558../../deps/v8/include/v8-profiler.h:1128:27: warning: 'v8::HeapProfiler::HeapSnapshotOptions::global_object_name_resolver' is deprecated: Use context_name_resolver callback instead. [-Wdeprecated-declarations]1559 1128 | HeapSnapshotOptions() {}1560 | ^1561../../deps/v8/include/v8-profiler.h:1142:25: note: declared here1562 1142 | ObjectNameResolver* global_object_name_resolver = nullptr;1563 | ^~~~~~~~~~~~~~~~~~~~~~~~~~~1564[209/1871] CXX obj/src/node_base.node_process_object.o1565In file included from ../../src/memory_tracker.h:6,1566 from ../../src/aliased_buffer.h:7,1567 from ../../src/aliased_buffer-inl.h:6,1568 from ../../src/env-inl.h:27,1569 from ../../src/node_process_object.cc:1:1570../../deps/v8/include/v8-profiler.h: In constructor 'v8::HeapProfiler::HeapSnapshotOptions::HeapSnapshotOptions()':1571../../deps/v8/include/v8-profiler.h:1128:27: warning: 'v8::HeapProfiler::HeapSnapshotOptions::global_object_name_resolver' is deprecated: Use context_name_resolver callback instead. [-Wdeprecated-declarations]1572 1128 | HeapSnapshotOptions() {}1573 | ^1574../../deps/v8/include/v8-profiler.h:1142:25: note: declared here1575 1142 | ObjectNameResolver* global_object_name_resolver = nullptr;1576 | ^~~~~~~~~~~~~~~~~~~~~~~~~~~1577../../deps/v8/include/v8-profiler.h:1128:27: warning: 'v8::HeapProfiler::HeapSnapshotOptions::global_object_name_resolver' is deprecated: Use context_name_resolver callback instead. [-Wdeprecated-declarations]1578 1128 | HeapSnapshotOptions() {}1579 | ^1580../../deps/v8/include/v8-profiler.h:1142:25: note: declared here1581 1142 | ObjectNameResolver* global_object_name_resolver = nullptr;1582 | ^~~~~~~~~~~~~~~~~~~~~~~~~~~1583[210/1871] CXX obj/src/node_base.node_report_module.o1584In file included from ../../src/memory_tracker.h:6,1585 from ../../src/aliased_buffer.h:7,1586 from ../../src/env.h:27,1587 from ../../src/node_report_module.cc:1:1588../../deps/v8/include/v8-profiler.h: In constructor 'v8::HeapProfiler::HeapSnapshotOptions::HeapSnapshotOptions()':1589../../deps/v8/include/v8-profiler.h:1128:27: warning: 'v8::HeapProfiler::HeapSnapshotOptions::global_object_name_resolver' is deprecated: Use context_name_resolver callback instead. [-Wdeprecated-declarations]1590 1128 | HeapSnapshotOptions() {}1591 | ^1592../../deps/v8/include/v8-profiler.h:1142:25: note: declared here1593 1142 | ObjectNameResolver* global_object_name_resolver = nullptr;1594 | ^~~~~~~~~~~~~~~~~~~~~~~~~~~1595../../deps/v8/include/v8-profiler.h:1128:27: warning: 'v8::HeapProfiler::HeapSnapshotOptions::global_object_name_resolver' is deprecated: Use context_name_resolver callback instead. [-Wdeprecated-declarations]1596 1128 | HeapSnapshotOptions() {}1597 | ^1598../../deps/v8/include/v8-profiler.h:1142:25: note: declared here1599 1142 | ObjectNameResolver* global_object_name_resolver = nullptr;1600 | ^~~~~~~~~~~~~~~~~~~~~~~~~~~1601[211/1871] CXX obj/src/node_base.node_platform.o1602In file included from ../../src/util.h:29,1603 from ../../src/node_mutex.h:6,1604 from ../../src/node_platform.h:15,1605 from ../../src/node_platform.cc:1:1606../../deps/v8/include/v8-profiler.h: In constructor 'v8::HeapProfiler::HeapSnapshotOptions::HeapSnapshotOptions()':1607../../deps/v8/include/v8-profiler.h:1128:27: warning: 'v8::HeapProfiler::HeapSnapshotOptions::global_object_name_resolver' is deprecated: Use context_name_resolver callback instead. [-Wdeprecated-declarations]1608 1128 | HeapSnapshotOptions() {}1609 | ^1610../../deps/v8/include/v8-profiler.h:1142:25: note: declared here1611 1142 | ObjectNameResolver* global_object_name_resolver = nullptr;1612 | ^~~~~~~~~~~~~~~~~~~~~~~~~~~1613../../deps/v8/include/v8-profiler.h:1128:27: warning: 'v8::HeapProfiler::HeapSnapshotOptions::global_object_name_resolver' is deprecated: Use context_name_resolver callback instead. [-Wdeprecated-declarations]1614 1128 | HeapSnapshotOptions() {}1615 | ^1616../../deps/v8/include/v8-profiler.h:1142:25: note: declared here1617 1142 | ObjectNameResolver* global_object_name_resolver = nullptr;1618 | ^~~~~~~~~~~~~~~~~~~~~~~~~~~1619[212/1871] CXX obj/src/node_base.node_report_utils.o1620In file included from ../../src/memory_tracker.h:6,1621 from ../../src/aliased_buffer.h:7,1622 from ../../src/env.h:27,1623 from ../../src/node_internals.h:27,1624 from ../../src/node_report_utils.cc:2:1625../../deps/v8/include/v8-profiler.h: In constructor 'v8::HeapProfiler::HeapSnapshotOptions::HeapSnapshotOptions()':1626../../deps/v8/include/v8-profiler.h:1128:27: warning: 'v8::HeapProfiler::HeapSnapshotOptions::global_object_name_resolver' is deprecated: Use context_name_resolver callback instead. [-Wdeprecated-declarations]1627 1128 | HeapSnapshotOptions() {}1628 | ^1629../../deps/v8/include/v8-profiler.h:1142:25: note: declared here1630 1142 | ObjectNameResolver* global_object_name_resolver = nullptr;1631 | ^~~~~~~~~~~~~~~~~~~~~~~~~~~1632../../deps/v8/include/v8-profiler.h:1128:27: warning: 'v8::HeapProfiler::HeapSnapshotOptions::global_object_name_resolver' is deprecated: Use context_name_resolver callback instead. [-Wdeprecated-declarations]1633 1128 | HeapSnapshotOptions() {}1634 | ^1635../../deps/v8/include/v8-profiler.h:1142:25: note: declared here1636 1142 | ObjectNameResolver* global_object_name_resolver = nullptr;1637 | ^~~~~~~~~~~~~~~~~~~~~~~~~~~1638[213/1871] CXX obj/src/node_base.node_locks.o1639In file included from ../../src/memory_tracker.h:6,1640 from ../../src/base_object.h:29,1641 from ../../src/node_locks.h:11,1642 from ../../src/node_locks.cc:1:1643../../deps/v8/include/v8-profiler.h: In constructor 'v8::HeapProfiler::HeapSnapshotOptions::HeapSnapshotOptions()':1644../../deps/v8/include/v8-profiler.h:1128:27: warning: 'v8::HeapProfiler::HeapSnapshotOptions::global_object_name_resolver' is deprecated: Use context_name_resolver callback instead. [-Wdeprecated-declarations]1645 1128 | HeapSnapshotOptions() {}1646 | ^1647../../deps/v8/include/v8-profiler.h:1142:25: note: declared here1648 1142 | ObjectNameResolver* global_object_name_resolver = nullptr;1649 | ^~~~~~~~~~~~~~~~~~~~~~~~~~~1650../../deps/v8/include/v8-profiler.h:1128:27: warning: 'v8::HeapProfiler::HeapSnapshotOptions::global_object_name_resolver' is deprecated: Use context_name_resolver callback instead. [-Wdeprecated-declarations]1651 1128 | HeapSnapshotOptions() {}1652 | ^1653../../deps/v8/include/v8-profiler.h:1142:25: note: declared here1654 1142 | ObjectNameResolver* global_object_name_resolver = nullptr;1655 | ^~~~~~~~~~~~~~~~~~~~~~~~~~~1656[214/1871] CXX obj/src/node_base.node_serdes.o1657In file included from ../../src/memory_tracker.h:6,1658 from ../../src/base_object.h:29,1659 from ../../src/base_object-inl.h:27,1660 from ../../src/node_serdes.cc:1:1661../../deps/v8/include/v8-profiler.h: In constructor 'v8::HeapProfiler::HeapSnapshotOptions::HeapSnapshotOptions()':1662../../deps/v8/include/v8-profiler.h:1128:27: warning: 'v8::HeapProfiler::HeapSnapshotOptions::global_object_name_resolver' is deprecated: Use context_name_resolver callback instead. [-Wdeprecated-declarations]1663 1128 | HeapSnapshotOptions() {}1664 | ^1665../../deps/v8/include/v8-profiler.h:1142:25: note: declared here1666 1142 | ObjectNameResolver* global_object_name_resolver = nullptr;1667 | ^~~~~~~~~~~~~~~~~~~~~~~~~~~1668../../deps/v8/include/v8-profiler.h:1128:27: warning: 'v8::HeapProfiler::HeapSnapshotOptions::global_object_name_resolver' is deprecated: Use context_name_resolver callback instead. [-Wdeprecated-declarations]1669 1128 | HeapSnapshotOptions() {}1670 | ^1671../../deps/v8/include/v8-profiler.h:1142:25: note: declared here1672 1142 | ObjectNameResolver* global_object_name_resolver = nullptr;1673 | ^~~~~~~~~~~~~~~~~~~~~~~~~~~1674[215/1871] CXX obj/src/node_base.node_process_methods.o1675In file included from ../../src/memory_tracker.h:6,1676 from ../../src/base_object.h:29,1677 from ../../src/async_wrap.h:27,1678 from ../../src/async_wrap-inl.h:27,1679 from ../../src/node_process_methods.cc:1:1680../../deps/v8/include/v8-profiler.h: In constructor 'v8::HeapProfiler::HeapSnapshotOptions::HeapSnapshotOptions()':1681../../deps/v8/include/v8-profiler.h:1128:27: warning: 'v8::HeapProfiler::HeapSnapshotOptions::global_object_name_resolver' is deprecated: Use context_name_resolver callback instead. [-Wdeprecated-declarations]1682 1128 | HeapSnapshotOptions() {}1683 | ^1684../../deps/v8/include/v8-profiler.h:1142:25: note: declared here1685 1142 | ObjectNameResolver* global_object_name_resolver = nullptr;1686 | ^~~~~~~~~~~~~~~~~~~~~~~~~~~1687../../deps/v8/include/v8-profiler.h:1128:27: warning: 'v8::HeapProfiler::HeapSnapshotOptions::global_object_name_resolver' is deprecated: Use context_name_resolver callback instead. [-Wdeprecated-declarations]1688 1128 | HeapSnapshotOptions() {}1689 | ^1690../../deps/v8/include/v8-profiler.h:1142:25: note: declared here1691 1142 | ObjectNameResolver* global_object_name_resolver = nullptr;1692 | ^~~~~~~~~~~~~~~~~~~~~~~~~~~1693[216/1871] CXX obj/src/node_base.node_report.o1694In file included from ../../src/util.h:29,1695 from ../../src/node_report.h:9,1696 from ../../src/node_report.cc:1:1697../../deps/v8/include/v8-profiler.h: In constructor 'v8::HeapProfiler::HeapSnapshotOptions::HeapSnapshotOptions()':1698../../deps/v8/include/v8-profiler.h:1128:27: warning: 'v8::HeapProfiler::HeapSnapshotOptions::global_object_name_resolver' is deprecated: Use context_name_resolver callback instead. [-Wdeprecated-declarations]1699 1128 | HeapSnapshotOptions() {}1700 | ^1701../../deps/v8/include/v8-profiler.h:1142:25: note: declared here1702 1142 | ObjectNameResolver* global_object_name_resolver = nullptr;1703 | ^~~~~~~~~~~~~~~~~~~~~~~~~~~1704../../deps/v8/include/v8-profiler.h:1128:27: warning: 'v8::HeapProfiler::HeapSnapshotOptions::global_object_name_resolver' is deprecated: Use context_name_resolver callback instead. [-Wdeprecated-declarations]1705 1128 | HeapSnapshotOptions() {}1706 | ^1707../../deps/v8/include/v8-profiler.h:1142:25: note: declared here1708 1142 | ObjectNameResolver* global_object_name_resolver = nullptr;1709 | ^~~~~~~~~~~~~~~~~~~~~~~~~~~1710[217/1871] CXX obj/src/node_base.node_symbols.o1711In file included from ../../src/memory_tracker.h:6,1712 from ../../src/aliased_buffer.h:7,1713 from ../../src/aliased_buffer-inl.h:6,1714 from ../../src/env-inl.h:27,1715 from ../../src/node_symbols.cc:1:1716../../deps/v8/include/v8-profiler.h: In constructor 'v8::HeapProfiler::HeapSnapshotOptions::HeapSnapshotOptions()':1717../../deps/v8/include/v8-profiler.h:1128:27: warning: 'v8::HeapProfiler::HeapSnapshotOptions::global_object_name_resolver' is deprecated: Use context_name_resolver callback instead. [-Wdeprecated-declarations]1718 1128 | HeapSnapshotOptions() {}1719 | ^1720../../deps/v8/include/v8-profiler.h:1142:25: note: declared here1721 1142 | ObjectNameResolver* global_object_name_resolver = nullptr;1722 | ^~~~~~~~~~~~~~~~~~~~~~~~~~~1723../../deps/v8/include/v8-profiler.h:1128:27: warning: 'v8::HeapProfiler::HeapSnapshotOptions::global_object_name_resolver' is deprecated: Use context_name_resolver callback instead. [-Wdeprecated-declarations]1724 1128 | HeapSnapshotOptions() {}1725 | ^1726../../deps/v8/include/v8-profiler.h:1142:25: note: declared here1727 1142 | ObjectNameResolver* global_object_name_resolver = nullptr;1728 | ^~~~~~~~~~~~~~~~~~~~~~~~~~~1729[218/1871] CXX obj/src/node_base.node_stat_watcher.o1730In file included from ../../src/memory_tracker.h:6,1731 from ../../src/base_object.h:29,1732 from ../../src/async_wrap.h:27,1733 from ../../src/handle_wrap.h:27,1734 from ../../src/node_stat_watcher.h:28,1735 from ../../src/node_stat_watcher.cc:22:1736../../deps/v8/include/v8-profiler.h: In constructor 'v8::HeapProfiler::HeapSnapshotOptions::HeapSnapshotOptions()':1737../../deps/v8/include/v8-profiler.h:1128:27: warning: 'v8::HeapProfiler::HeapSnapshotOptions::global_object_name_resolver' is deprecated: Use context_name_resolver callback instead. [-Wdeprecated-declarations]1738 1128 | HeapSnapshotOptions() {}1739 | ^1740../../deps/v8/include/v8-profiler.h:1142:25: note: declared here1741 1142 | ObjectNameResolver* global_object_name_resolver = nullptr;1742 | ^~~~~~~~~~~~~~~~~~~~~~~~~~~1743../../deps/v8/include/v8-profiler.h:1128:27: warning: 'v8::HeapProfiler::HeapSnapshotOptions::global_object_name_resolver' is deprecated: Use context_name_resolver callback instead. [-Wdeprecated-declarations]1744 1128 | HeapSnapshotOptions() {}1745 | ^1746../../deps/v8/include/v8-profiler.h:1142:25: note: declared here1747 1142 | ObjectNameResolver* global_object_name_resolver = nullptr;1748 | ^~~~~~~~~~~~~~~~~~~~~~~~~~~1749[219/1871] CXX obj/src/node_base.node_shadow_realm.o1750In file included from ../../src/memory_tracker.h:6,1751 from ../../src/cleanup_queue.h:11,1752 from ../../src/node_realm.h:8,1753 from ../../src/node_shadow_realm.h:6,1754 from ../../src/node_shadow_realm.cc:1:1755../../deps/v8/include/v8-profiler.h: In constructor 'v8::HeapProfiler::HeapSnapshotOptions::HeapSnapshotOptions()':1756../../deps/v8/include/v8-profiler.h:1128:27: warning: 'v8::HeapProfiler::HeapSnapshotOptions::global_object_name_resolver' is deprecated: Use context_name_resolver callback instead. [-Wdeprecated-declarations]1757 1128 | HeapSnapshotOptions() {}1758 | ^1759../../deps/v8/include/v8-profiler.h:1142:25: note: declared here1760 1142 | ObjectNameResolver* global_object_name_resolver = nullptr;1761 | ^~~~~~~~~~~~~~~~~~~~~~~~~~~1762../../deps/v8/include/v8-profiler.h:1128:27: warning: 'v8::HeapProfiler::HeapSnapshotOptions::global_object_name_resolver' is deprecated: Use context_name_resolver callback instead. [-Wdeprecated-declarations]1763 1128 | HeapSnapshotOptions() {}1764 | ^1765../../deps/v8/include/v8-profiler.h:1142:25: note: declared here1766 1142 | ObjectNameResolver* global_object_name_resolver = nullptr;1767 | ^~~~~~~~~~~~~~~~~~~~~~~~~~~1768[220/1871] CXX obj/src/node_base.node_task_queue.o1769In file included from ../../src/memory_tracker.h:6,1770 from ../../src/base_object.h:29,1771 from ../../src/async_wrap.h:27,1772 from ../../src/node_task_queue.cc:1:1773../../deps/v8/include/v8-profiler.h: In constructor 'v8::HeapProfiler::HeapSnapshotOptions::HeapSnapshotOptions()':1774../../deps/v8/include/v8-profiler.h:1128:27: warning: 'v8::HeapProfiler::HeapSnapshotOptions::global_object_name_resolver' is deprecated: Use context_name_resolver callback instead. [-Wdeprecated-declarations]1775 1128 | HeapSnapshotOptions() {}1776 | ^1777../../deps/v8/include/v8-profiler.h:1142:25: note: declared here1778 1142 | ObjectNameResolver* global_object_name_resolver = nullptr;1779 | ^~~~~~~~~~~~~~~~~~~~~~~~~~~1780../../deps/v8/include/v8-profiler.h:1128:27: warning: 'v8::HeapProfiler::HeapSnapshotOptions::global_object_name_resolver' is deprecated: Use context_name_resolver callback instead. [-Wdeprecated-declarations]1781 1128 | HeapSnapshotOptions() {}1782 | ^1783../../deps/v8/include/v8-profiler.h:1142:25: note: declared here1784 1142 | ObjectNameResolver* global_object_name_resolver = nullptr;1785 | ^~~~~~~~~~~~~~~~~~~~~~~~~~~1786[221/1871] CXX obj/src/node_base.node_modules.o1787In file included from ../../src/memory_tracker.h:6,1788 from ../../src/aliased_buffer.h:7,1789 from ../../src/node_snapshotable.h:7,1790 from ../../src/node_modules.h:7,1791 from ../../src/node_modules.cc:1:1792../../deps/v8/include/v8-profiler.h: In constructor 'v8::HeapProfiler::HeapSnapshotOptions::HeapSnapshotOptions()':1793../../deps/v8/include/v8-profiler.h:1128:27: warning: 'v8::HeapProfiler::HeapSnapshotOptions::global_object_name_resolver' is deprecated: Use context_name_resolver callback instead. [-Wdeprecated-declarations]1794 1128 | HeapSnapshotOptions() {}1795 | ^1796../../deps/v8/include/v8-profiler.h:1142:25: note: declared here1797 1142 | ObjectNameResolver* global_object_name_resolver = nullptr;1798 | ^~~~~~~~~~~~~~~~~~~~~~~~~~~1799../../deps/v8/include/v8-profiler.h:1128:27: warning: 'v8::HeapProfiler::HeapSnapshotOptions::global_object_name_resolver' is deprecated: Use context_name_resolver callback instead. [-Wdeprecated-declarations]1800 1128 | HeapSnapshotOptions() {}1801 | ^1802../../deps/v8/include/v8-profiler.h:1142:25: note: declared here1803 1142 | ObjectNameResolver* global_object_name_resolver = nullptr;1804 | ^~~~~~~~~~~~~~~~~~~~~~~~~~~1805[222/1871] CXX obj/src/node_base.node_types.o1806In file included from ../../src/memory_tracker.h:6,1807 from ../../src/aliased_buffer.h:7,1808 from ../../src/aliased_buffer-inl.h:6,1809 from ../../src/env-inl.h:27,1810 from ../../src/node_types.cc:1:1811../../deps/v8/include/v8-profiler.h: In constructor 'v8::HeapProfiler::HeapSnapshotOptions::HeapSnapshotOptions()':1812../../deps/v8/include/v8-profiler.h:1128:27: warning: 'v8::HeapProfiler::HeapSnapshotOptions::global_object_name_resolver' is deprecated: Use context_name_resolver callback instead. [-Wdeprecated-declarations]1813 1128 | HeapSnapshotOptions() {}1814 | ^1815../../deps/v8/include/v8-profiler.h:1142:25: note: declared here1816 1142 | ObjectNameResolver* global_object_name_resolver = nullptr;1817 | ^~~~~~~~~~~~~~~~~~~~~~~~~~~1818../../deps/v8/include/v8-profiler.h:1128:27: warning: 'v8::HeapProfiler::HeapSnapshotOptions::global_object_name_resolver' is deprecated: Use context_name_resolver callback instead. [-Wdeprecated-declarations]1819 1128 | HeapSnapshotOptions() {}1820 | ^1821../../deps/v8/include/v8-profiler.h:1142:25: note: declared here1822 1142 | ObjectNameResolver* global_object_name_resolver = nullptr;1823 | ^~~~~~~~~~~~~~~~~~~~~~~~~~~1824[223/1871] CXX obj/src/node_base.node_trace_events.o1825In file included from ../../src/memory_tracker.h:6,1826 from ../../src/base_object.h:29,1827 from ../../src/base_object-inl.h:27,1828 from ../../src/node_trace_events.cc:1:1829../../deps/v8/include/v8-profiler.h: In constructor 'v8::HeapProfiler::HeapSnapshotOptions::HeapSnapshotOptions()':1830../../deps/v8/include/v8-profiler.h:1128:27: warning: 'v8::HeapProfiler::HeapSnapshotOptions::global_object_name_resolver' is deprecated: Use context_name_resolver callback instead. [-Wdeprecated-declarations]1831 1128 | HeapSnapshotOptions() {}1832 | ^1833../../deps/v8/include/v8-profiler.h:1142:25: note: declared here1834 1142 | ObjectNameResolver* global_object_name_resolver = nullptr;1835 | ^~~~~~~~~~~~~~~~~~~~~~~~~~~1836../../deps/v8/include/v8-profiler.h:1128:27: warning: 'v8::HeapProfiler::HeapSnapshotOptions::global_object_name_resolver' is deprecated: Use context_name_resolver callback instead. [-Wdeprecated-declarations]1837 1128 | HeapSnapshotOptions() {}1838 | ^1839../../deps/v8/include/v8-profiler.h:1142:25: note: declared here1840 1142 | ObjectNameResolver* global_object_name_resolver = nullptr;1841 | ^~~~~~~~~~~~~~~~~~~~~~~~~~~1842[224/1871] CXX obj/src/node_base.node_util.o1843In file included from ../../src/memory_tracker.h:6,1844 from ../../src/base_object.h:29,1845 from ../../src/base_object-inl.h:27,1846 from ../../src/node_util.cc:1:1847../../deps/v8/include/v8-profiler.h: In constructor 'v8::HeapProfiler::HeapSnapshotOptions::HeapSnapshotOptions()':1848../../deps/v8/include/v8-profiler.h:1128:27: warning: 'v8::HeapProfiler::HeapSnapshotOptions::global_object_name_resolver' is deprecated: Use context_name_resolver callback instead. [-Wdeprecated-declarations]1849 1128 | HeapSnapshotOptions() {}1850 | ^1851../../deps/v8/include/v8-profiler.h:1142:25: note: declared here1852 1142 | ObjectNameResolver* global_object_name_resolver = nullptr;1853 | ^~~~~~~~~~~~~~~~~~~~~~~~~~~1854../../deps/v8/include/v8-profiler.h:1128:27: warning: 'v8::HeapProfiler::HeapSnapshotOptions::global_object_name_resolver' is deprecated: Use context_name_resolver callback instead. [-Wdeprecated-declarations]1855 1128 | HeapSnapshotOptions() {}1856 | ^1857../../deps/v8/include/v8-profiler.h:1142:25: note: declared here1858 1142 | ObjectNameResolver* global_object_name_resolver = nullptr;1859 | ^~~~~~~~~~~~~~~~~~~~~~~~~~~1860[225/1871] CXX obj/src/tracing/node_base.trace_event_helper.o1861[226/1871] CXX obj/src/node_base.node_messaging.o1862In file included from ../../src/memory_tracker.h:6,1863 from ../../src/aliased_buffer.h:7,1864 from ../../src/env.h:27,1865 from ../../src/node_messaging.h:6,1866 from ../../src/node_messaging.cc:1:1867../../deps/v8/include/v8-profiler.h: In constructor 'v8::HeapProfiler::HeapSnapshotOptions::HeapSnapshotOptions()':1868../../deps/v8/include/v8-profiler.h:1128:27: warning: 'v8::HeapProfiler::HeapSnapshotOptions::global_object_name_resolver' is deprecated: Use context_name_resolver callback instead. [-Wdeprecated-declarations]1869 1128 | HeapSnapshotOptions() {}1870 | ^1871../../deps/v8/include/v8-profiler.h:1142:25: note: declared here1872 1142 | ObjectNameResolver* global_object_name_resolver = nullptr;1873 | ^~~~~~~~~~~~~~~~~~~~~~~~~~~1874../../deps/v8/include/v8-profiler.h:1128:27: warning: 'v8::HeapProfiler::HeapSnapshotOptions::global_object_name_resolver' is deprecated: Use context_name_resolver callback instead. [-Wdeprecated-declarations]1875 1128 | HeapSnapshotOptions() {}1876 | ^1877../../deps/v8/include/v8-profiler.h:1142:25: note: declared here1878 1142 | ObjectNameResolver* global_object_name_resolver = nullptr;1879 | ^~~~~~~~~~~~~~~~~~~~~~~~~~~1880[227/1871] CXX obj/src/node_base.node_realm.o1881In file included from ../../src/memory_tracker.h:6,1882 from ../../src/cleanup_queue.h:11,1883 from ../../src/node_realm.h:8,1884 from ../../src/node_realm.cc:1:1885../../deps/v8/include/v8-profiler.h: In constructor 'v8::HeapProfiler::HeapSnapshotOptions::HeapSnapshotOptions()':1886../../deps/v8/include/v8-profiler.h:1128:27: warning: 'v8::HeapProfiler::HeapSnapshotOptions::global_object_name_resolver' is deprecated: Use context_name_resolver callback instead. [-Wdeprecated-declarations]1887 1128 | HeapSnapshotOptions() {}1888 | ^1889../../deps/v8/include/v8-profiler.h:1142:25: note: declared here1890 1142 | ObjectNameResolver* global_object_name_resolver = nullptr;1891 | ^~~~~~~~~~~~~~~~~~~~~~~~~~~1892../../deps/v8/include/v8-profiler.h:1128:27: warning: 'v8::HeapProfiler::HeapSnapshotOptions::global_object_name_resolver' is deprecated: Use context_name_resolver callback instead. [-Wdeprecated-declarations]1893 1128 | HeapSnapshotOptions() {}1894 | ^1895../../deps/v8/include/v8-profiler.h:1142:25: note: declared here1896 1142 | ObjectNameResolver* global_object_name_resolver = nullptr;1897 | ^~~~~~~~~~~~~~~~~~~~~~~~~~~1898[228/1871] CXX obj/deps/v8/src/torque/torque_base.torque-parser.o1899[229/1871] CXX obj/src/tracing/node_base.agent.o1900In file included from ../../src/util.h:29,1901 from ../../src/node_mutex.h:6,1902 from ../../src/tracing/agent_legacy.h:14,1903 from ../../src/tracing/agent.cc:6:1904../../deps/v8/include/v8-profiler.h: In constructor 'v8::HeapProfiler::HeapSnapshotOptions::HeapSnapshotOptions()':1905../../deps/v8/include/v8-profiler.h:1128:27: warning: 'v8::HeapProfiler::HeapSnapshotOptions::global_object_name_resolver' is deprecated: Use context_name_resolver callback instead. [-Wdeprecated-declarations]1906 1128 | HeapSnapshotOptions() {}1907 | ^1908../../deps/v8/include/v8-profiler.h:1142:25: note: declared here1909 1142 | ObjectNameResolver* global_object_name_resolver = nullptr;1910 | ^~~~~~~~~~~~~~~~~~~~~~~~~~~1911../../deps/v8/include/v8-profiler.h:1128:27: warning: 'v8::HeapProfiler::HeapSnapshotOptions::global_object_name_resolver' is deprecated: Use context_name_resolver callback instead. [-Wdeprecated-declarations]1912 1128 | HeapSnapshotOptions() {}1913 | ^1914../../deps/v8/include/v8-profiler.h:1142:25: note: declared here1915 1142 | ObjectNameResolver* global_object_name_resolver = nullptr;1916 | ^~~~~~~~~~~~~~~~~~~~~~~~~~~1917[230/1871] CXX obj/src/node_base.node_sockaddr.o1918In file included from ../../src/memory_tracker.h:6,1919 from ../../src/base_object.h:29,1920 from ../../src/node_sockaddr.h:6,1921 from ../../src/node_sockaddr.cc:1:1922../../deps/v8/include/v8-profiler.h: In constructor 'v8::HeapProfiler::HeapSnapshotOptions::HeapSnapshotOptions()':1923../../deps/v8/include/v8-profiler.h:1128:27: warning: 'v8::HeapProfiler::HeapSnapshotOptions::global_object_name_resolver' is deprecated: Use context_name_resolver callback instead. [-Wdeprecated-declarations]1924 1128 | HeapSnapshotOptions() {}1925 | ^1926../../deps/v8/include/v8-profiler.h:1142:25: note: declared here1927 1142 | ObjectNameResolver* global_object_name_resolver = nullptr;1928 | ^~~~~~~~~~~~~~~~~~~~~~~~~~~1929../../deps/v8/include/v8-profiler.h:1128:27: warning: 'v8::HeapProfiler::HeapSnapshotOptions::global_object_name_resolver' is deprecated: Use context_name_resolver callback instead. [-Wdeprecated-declarations]1930 1128 | HeapSnapshotOptions() {}1931 | ^1932../../deps/v8/include/v8-profiler.h:1142:25: note: declared here1933 1142 | ObjectNameResolver* global_object_name_resolver = nullptr;1934 | ^~~~~~~~~~~~~~~~~~~~~~~~~~~1935[231/1871] CXX obj/src/ffi/platforms/node_base.arm64.o1936[232/1871] CXX obj/src/node_base.node_v8.o1937In file included from ../../src/memory_tracker.h:6,1938 from ../../src/aliased_buffer.h:7,1939 from ../../src/node_v8.h:7,1940 from ../../src/node_v8.cc:22:1941../../deps/v8/include/v8-profiler.h: In constructor 'v8::HeapProfiler::HeapSnapshotOptions::HeapSnapshotOptions()':1942../../deps/v8/include/v8-profiler.h:1128:27: warning: 'v8::HeapProfiler::HeapSnapshotOptions::global_object_name_resolver' is deprecated: Use context_name_resolver callback instead. [-Wdeprecated-declarations]1943 1128 | HeapSnapshotOptions() {}1944 | ^1945../../deps/v8/include/v8-profiler.h:1142:25: note: declared here1946 1142 | ObjectNameResolver* global_object_name_resolver = nullptr;1947 | ^~~~~~~~~~~~~~~~~~~~~~~~~~~1948../../deps/v8/include/v8-profiler.h:1128:27: warning: 'v8::HeapProfiler::HeapSnapshotOptions::global_object_name_resolver' is deprecated: Use context_name_resolver callback instead. [-Wdeprecated-declarations]1949 1128 | HeapSnapshotOptions() {}1950 | ^1951../../deps/v8/include/v8-profiler.h:1142:25: note: declared here1952 1142 | ObjectNameResolver* global_object_name_resolver = nullptr;1953 | ^~~~~~~~~~~~~~~~~~~~~~~~~~~1954[233/1871] CXX obj/src/node_base.node_wasm_web_api.o1955In file included from ../../src/memory_tracker.h:6,1956 from ../../src/base_object.h:29,1957 from ../../src/base_object-inl.h:27,1958 from ../../src/node_wasm_web_api.h:6,1959 from ../../src/node_wasm_web_api.cc:1:1960../../deps/v8/include/v8-profiler.h: In constructor 'v8::HeapProfiler::HeapSnapshotOptions::HeapSnapshotOptions()':1961../../deps/v8/include/v8-profiler.h:1128:27: warning: 'v8::HeapProfiler::HeapSnapshotOptions::global_object_name_resolver' is deprecated: Use context_name_resolver callback instead. [-Wdeprecated-declarations]1962 1128 | HeapSnapshotOptions() {}1963 | ^1964../../deps/v8/include/v8-profiler.h:1142:25: note: declared here1965 1142 | ObjectNameResolver* global_object_name_resolver = nullptr;1966 | ^~~~~~~~~~~~~~~~~~~~~~~~~~~1967../../deps/v8/include/v8-profiler.h:1128:27: warning: 'v8::HeapProfiler::HeapSnapshotOptions::global_object_name_resolver' is deprecated: Use context_name_resolver callback instead. [-Wdeprecated-declarations]1968 1128 | HeapSnapshotOptions() {}1969 | ^1970../../deps/v8/include/v8-profiler.h:1142:25: note: declared here1971 1142 | ObjectNameResolver* global_object_name_resolver = nullptr;1972 | ^~~~~~~~~~~~~~~~~~~~~~~~~~~1973[234/1871] CXX obj/src/ffi/platforms/node_base.loong64.o1974[235/1871] CXX obj/src/ffi/platforms/node_base.riscv64.o1975[236/1871] CXX obj/src/ffi/platforms/node_base.ppc64.o1976[237/1871] CXX obj/src/ffi/platforms/node_base.s390x.o1977[238/1871] CXX obj/src/ffi/node_base.jit_memory.o1978[239/1871] CXX obj/deps/v8/src/torque/torque_base.implementation-visitor.o1979[240/1871] AR obj/tools/v8_gypfiles/libtorque_base.a1980[241/1871] STAMP obj/tools/v8_gypfiles/torque.actions_depends.stamp1981[242/1871] CXX obj/src/tracing/node_base.traced_value.o1982In file included from ../../src/util.h:29,1983 from ../../src/tracing/traced_value.cc:16:1984../../deps/v8/include/v8-profiler.h: In constructor 'v8::HeapProfiler::HeapSnapshotOptions::HeapSnapshotOptions()':1985../../deps/v8/include/v8-profiler.h:1128:27: warning: 'v8::HeapProfiler::HeapSnapshotOptions::global_object_name_resolver' is deprecated: Use context_name_resolver callback instead. [-Wdeprecated-declarations]1986 1128 | HeapSnapshotOptions() {}1987 | ^1988../../deps/v8/include/v8-profiler.h:1142:25: note: declared here1989 1142 | ObjectNameResolver* global_object_name_resolver = nullptr;1990 | ^~~~~~~~~~~~~~~~~~~~~~~~~~~1991../../deps/v8/include/v8-profiler.h:1128:27: warning: 'v8::HeapProfiler::HeapSnapshotOptions::global_object_name_resolver' is deprecated: Use context_name_resolver callback instead. [-Wdeprecated-declarations]1992 1128 | HeapSnapshotOptions() {}1993 | ^1994../../deps/v8/include/v8-profiler.h:1142:25: note: declared here1995 1142 | ObjectNameResolver* global_object_name_resolver = nullptr;1996 | ^~~~~~~~~~~~~~~~~~~~~~~~~~~1997[243/1871] CXX obj/src/ffi/platforms/node_base.x64.o1998[244/1871] CXX obj/deps/v8/third_party/simdutf/simdutf.simdutf.o1999[245/1871] AR obj/tools/v8_gypfiles/libsimdutf.a2000[246/1871] LINK torqueloading 24,277 hidden lines…
26278ok 5022 sea/test-single-executable-application-snapshot # skip Running the resultant binary fails with `/home/iojs/node-tmp/.tmp.2379/sea: error while loading shared libraries: libicui18n.so.71: cannot open shared object file: No such file or directory`.26279 ---26280 duration_ms: 108.1690026281 ...26282ok 5023 sea/test-single-executable-application-snapshot-and-code-cache # skip Running the resultant binary fails with `/home/iojs/node-tmp/.tmp.2379/sea: error while loading shared libraries: libicui18n.so.71: cannot open shared object file: No such file or directory`.26283 ---26284 duration_ms: 108.1750026285 ...26286ok 5024 test-runner/test-output-output-cli26287 ---26288 duration_ms: 1207.6500026289 ...26290ok 5025 sea/test-single-executable-application-snapshot-worker # skip Running the resultant binary fails with `/home/iojs/node-tmp/.tmp.2379/sea: error while loading shared libraries: libicui18n.so.71: cannot open shared object file: No such file or directory`.26291 ---26292 duration_ms: 108.4510026293 ...26294ok 5026 sea/test-single-executable-application-use-code-cache # skip Running the resultant binary fails with `/home/iojs/node-tmp/.tmp.2379/sea: error while loading shared libraries: libicui18n.so.71: cannot open shared object file: No such file or directory`.26295 ---26296 duration_ms: 108.6140026297 ...26298ok 5027 sea/test-single-executable-application-vfs # skip Running the resultant binary fails with `/home/iojs/node-tmp/.tmp.2379/sea: error while loading shared libraries: libicui18n.so.71: cannot open shared object file: No such file or directory`.26299 ---26300 duration_ms: 108.3370026301 ...26302ok 5028 test-runner/test-output-randomize-output-cli26303 ---26304 duration_ms: 1208.4570026305 ...26306ok 5029 sea/test-single-executable-application-vfs-esm # skip Running the resultant binary fails with `/home/iojs/node-tmp/.tmp.2379/sea: error while loading shared libraries: libicui18n.so.71: cannot open shared object file: No such file or directory`.26307 ---26308 duration_ms: 134.7510026309 ...26310ok 5030 test-runner/test-output-no-refs26311 ---26312 duration_ms: 1408.1650026313 ...26314ok 5031 test-runner/test-output-spec-reporter-cli26315 ---26316 duration_ms: 1215.9020026317 ...26318ok 5032 es-module/test-cjs-defer-static-import-eval26319 ---26320 duration_ms: 134.9030026321 ...26322ok 5033 es-module/test-cjs-prototype-pollution26323 ---26324 duration_ms: 108.5090026325 ...26326ok 5034 es-module/test-cjs-legacyMainResolve26327 ---26328 duration_ms: 134.6270026329 ...26330ok 5035 es-module/test-disable-require-module-with-detection26331 ---26332 duration_ms: 108.3710026333 ...26334ok 5036 es-module/test-defer-import-eval26335 ---26336 duration_ms: 135.2970026337 ...26338ok 5037 es-module/test-defer-import-eval-with-tla26339 ---26340 duration_ms: 134.6850026341 ...26342ok 5038 es-module/test-defer-import-with-module-tree26343 ---26344 duration_ms: 134.7740026345 ...26346ok 5039 es-module/test-defer-import-with-regular-import26347 ---26348 duration_ms: 135.0930026349 ...26350ok 5040 es-module/test-esm-assert-strict26351 ---26352 duration_ms: 108.3710026353 ...26354ok 5041 es-module/test-dynamic-import-script-lifetime26355 ---26356 duration_ms: 135.0880026357 ...26358ok 5042 es-module/test-esm-basic-imports26359 ---26360 duration_ms: 108.2280026361 ...26362ok 5043 es-module/test-esm-assertionless-json-import26363 ---26364 duration_ms: 134.5810026365 ...26366ok 5044 es-module/test-cjs-esm-warn26367 ---26368 duration_ms: 261.6090026369 ...26370ok 5045 es-module/test-esm-cjs-named-error26371 ---26372 duration_ms: 108.1520026373 ...26374ok 5046 es-module/test-esm-custom-exports26375 ---26376 duration_ms: 108.3190026377 ...26378ok 5047 es-module/test-esm-cyclic-dynamic-import26379 ---26380 duration_ms: 107.9190026381 ...26382ok 5048 sea/test-single-executable-blob-config26383 ---26384 duration_ms: 326.2880026385 ...26386ok 5049 es-module/test-esm-default-type26387 ---26388 duration_ms: 108.1150026389 ...26390ok 5050 es-module/test-esm-data-urls26391 ---26392 duration_ms: 134.6750026393 ...26394ok 5051 es-module/test-esm-child-process-fork-main26395 ---26396 duration_ms: 209.1650026397 ...26398ok 5052 es-module/test-esm-cjs-builtins26399 ---26400 duration_ms: 209.5520026401 ...26402ok 5053 es-module/test-esm-dns-promises26403 ---26404 duration_ms: 134.5500026405 ...26406ok 5054 es-module/test-esm-double-encoding26407 ---26408 duration_ms: 108.2430026409 ...26410ok 5055 es-module/test-esm-cjs-main26411 ---26412 duration_ms: 209.1630026413 ...26414ok 5056 es-module/test-esm-dynamic-import26415 ---26416 duration_ms: 109.2920026417 ...26418ok 5057 es-module/test-esm-dynamic-import-attribute26419 ---26420 duration_ms: 107.9180026421 ...26422ok 5058 es-module/test-esm-dynamic-import-attribute26423 ---26424 duration_ms: 108.0280026425 ...26426ok 5059 es-module/test-esm-cjs-exports26427 ---26428 duration_ms: 261.3830026429 ...26430ok 5060 es-module/test-esm-dynamic-import-commonjs26431 ---26432 duration_ms: 108.4860026433 ...26434ok 5061 es-module/test-esm-dynamic-import-commonjs26435 ---26436 duration_ms: 108.2760026437 ...26438ok 5062 es-module/test-esm-dynamic-import-mutating-fs26439 ---26440 duration_ms: 108.3280026441 ...26442ok 5063 es-module/test-esm-encoded-path26443 ---26444 duration_ms: 108.1670026445 ...26446ok 5064 test-runner/test-output-timeout-in-before-each26447 ---26448 duration_ms: 1508.0920026449 ...26450ok 5065 es-module/test-esm-example-loader26451 ---26452 duration_ms: 87.0470026453 ...26454ok 5066 es-module/test-esm-error-cache26455 ---26456 duration_ms: 108.1330026457 ...26458ok 5067 es-module/test-esm-dynamic-import-mutating-fs26459 ---26460 duration_ms: 209.8360026461 ...26462ok 5068 es-module/test-esm-forbidden-globals26463 ---26464 duration_ms: 108.3510026465 ...26466ok 5069 es-module/test-esm-fs-promises26467 ---26468 duration_ms: 108.1100026469 ...26470ok 5070 es-module/test-esm-exports26471 ---26472 duration_ms: 169.2080026473 ...26474ok 5071 es-module/test-esm-exports-deprecations26475 ---26476 duration_ms: 168.1010026477 ...26478ok 5072 es-module/test-esm-encoded-path-native26479 ---26480 duration_ms: 209.1730026481 ...26482ok 5073 es-module/test-esm-import-attributes-126483 ---26484 duration_ms: 108.4010026485 ...26486ok 5074 es-module/test-esm-import-attributes-226487 ---26488 duration_ms: 108.2890026489 ...26490ok 5075 sea/test-single-executable-blob-config-errors26491 ---26492 duration_ms: 607.1470026493 ...26494ok 5076 parallel/test-zlib-zip-zip6426495 ---26496 duration_ms: 3319.3420026497 ...26498ok 5077 es-module/test-esm-import-attributes-326499 ---26500 duration_ms: 108.3110026501 ...26502ok 5078 test-runner/test-watch-create-isolation-process26503 ---26504 duration_ms: 1410.4750026505 ...26506ok 5079 es-module/test-esm-export-not-found26507 ---26508 duration_ms: 261.3510026509 ...26510ok 5080 es-module/test-esm-import-assertion-warning26511 ---26512 duration_ms: 209.0610026513 ...26514ok 5081 es-module/test-esm-import-attributes-errors26515 ---26516 duration_ms: 108.6520026517 ...26518ok 5082 es-module/test-esm-import-attributes-validation26519 ---26520 duration_ms: 108.4000026521 ...26522ok 5083 test-runner/test-watch-dependency-isolation-none26523 ---26524 duration_ms: 1409.4550026525 ...26526ok 5084 test-runner/test-watch-dependency-isolation-process26527 ---26528 duration_ms: 1420.0050026529 ...26530ok 5085 wasi/test-wasi-pthread26531 ---26532 duration_ms: 2620.8720026533 ...26534ok 5086 es-module/test-esm-import-attributes-errors26535 ---26536 duration_ms: 134.8740026537 ...26538ok 5087 es-module/test-esm-import-attributes-identity26539 ---26540 duration_ms: 134.9470026541 ...26542ok 5088 es-module/test-esm-import-attributes-validation-text26543 ---26544 duration_ms: 134.9070026545 ...26546ok 5089 es-module/test-esm-import-meta26547 ---26548 duration_ms: 108.2780026549 ...26550ok 5090 test-runner/test-run-watch-create26551 ---26552 duration_ms: 1708.5830026553 ...26554ok 5091 es-module/test-esm-experimental-warnings26555 ---26556 duration_ms: 327.2690026557 ...26558ok 5092 test-runner/test-output-test-runner-plan-timeout26559 ---26560 duration_ms: 1808.1550026561 ...26562ok 5093 test-runner/test-watch-esm-dependency-isolation-none26563 ---26564 duration_ms: 1411.6440026565 ...26566ok 5094 test-runner/test-watch-esm-dependency-isolation-process26567 ---26568 duration_ms: 1407.9310026569 ...26570ok 5095 test-runner/test-watch-no-file-isolation-none26571 ---26572 duration_ms: 1408.8490026573 ...26574ok 5096 es-module/test-esm-import-meta-resolve-hooks26575 ---26576 duration_ms: 108.7880026577 ...26578ok 5097 test-runner/test-watch-no-file-isolation-process26579 ---26580 duration_ms: 1409.2060026581 ...26582ok 5098 test-runner/test-watch-rename-isolation-none26583 ---26584 duration_ms: 1407.2790026585 ...26586ok 5099 test-runner/test-run-watch-dependency-repeatedly26587 ---26588 duration_ms: 1707.8670026589 ...26590ok 5100 es-module/test-esm-import-text26591 ---26592 duration_ms: 109.0520026593 ...26594ok 5101 es-module/test-esm-import-text-disabled26595 ---26596 duration_ms: 108.3980026597 ...26598ok 5102 test-runner/test-watch-rename-isolation-process26599 ---26600 duration_ms: 1407.4210026601 ...26602ok 5103 test-runner/test-run-watch-different-cwd-dependency26603 ---26604 duration_ms: 1707.9470026605 ...26606ok 5104 es-module/test-esm-import-meta-main26607 ---26608 duration_ms: 167.8520026609 ...26610ok 5105 es-module/test-esm-import-json-named-export26611 ---26612 duration_ms: 209.3060026613 ...26614ok 5106 test-runner/test-run-watch-different-cwd-rename26615 ---26616 duration_ms: 1708.3180026617 ...26618ok 5107 es-module/test-esm-in-require-cache26619 ---26620 duration_ms: 108.4670026621 ...26622ok 5108 es-module/test-esm-invalid-data-urls26623 ---26624 duration_ms: 108.6290026625 ...26626ok 5109 test-runner/test-watch-run-repeatedly-isolation-none26627 ---26628 duration_ms: 1407.6690026629 ...26630ok 5110 es-module/test-esm-extensionless-esm-and-wasm26631 ---26632 duration_ms: 408.0320026633 ...26634ok 5111 es-module/test-cjs-legacyMainResolve-permission26635 ---26636 duration_ms: 806.8810026637 ...26638ok 5112 es-module/test-esm-in-require-cache-226639 ---26640 duration_ms: 135.2000026641 ...26642ok 5113 test-runner/test-run-watch-different-runner-cwd26643 ---26644 duration_ms: 1709.5910026645 ...26646ok 5114 test-runner/test-run-watch-different-runner-cwd-isolation-process26647 ---26648 duration_ms: 1709.9630026649 ...26650ok 5115 test-runner/test-watch-run-repeatedly-isolation-process26651 ---26652 duration_ms: 1407.9130026653 ...26654ok 5116 es-module/test-esm-json-cache26655 ---26656 duration_ms: 135.1050026657 ...26658ok 5117 es-module/test-esm-loader-cache-clearing26659 ---26660 duration_ms: 108.5660026661 ...26662ok 5118 es-module/test-esm-imports26663 ---26664 duration_ms: 170.2770026665 ...26666ok 5119 es-module/test-esm-imports-deprecations26667 ---26668 duration_ms: 169.5920026669 ...26670ok 5120 test-runner/test-run-watch-esm-dependency26671 ---26672 duration_ms: 1708.5170026673 ...26674ok 5121 es-module/test-esm-live-binding26675 ---26676 duration_ms: 135.3210026677 ...26678ok 5122 test-runner/test-run-watch-rename26679 ---26680 duration_ms: 1707.8430026681 ...26682ok 5123 test-runner/test-run-watch-repeatedly26683 ---26684 duration_ms: 1711.0580026685 ...26686ok 5124 es-module/test-esm-loader-modulemap26687 ---26688 duration_ms: 108.3100026689 ...26690ok 5125 es-module/test-esm-invalid-pjson26691 ---26692 duration_ms: 209.7410026693 ...26694ok 5126 es-module/test-esm-loader-custom-condition26695 ---26696 duration_ms: 168.6300026697 ...26698ok 5127 test-runner/test-run-watch-run-duration26699 ---26700 duration_ms: 1708.8890026701 ...26702ok 5128 es-module/test-esm-loader-dependency26703 ---26704 duration_ms: 169.0110026705 ...26706ok 5129 es-module/test-esm-loader-search26707 ---26708 duration_ms: 137.3540026709 ...26710ok 5130 es-module/test-esm-loader-event-loop26711 ---26712 duration_ms: 168.5670026713 ...26714ok 5131 test-runner/test-run-watch-without-file26715 ---26716 duration_ms: 1708.4970026717 ...26718ok 5132 es-module/test-esm-loader26719 ---26720 duration_ms: 210.8440026721 ...26722ok 5133 es-module/test-esm-loader-invalid-format26723 ---26724 duration_ms: 171.2320026725 ...26726ok 5134 es-module/test-esm-loader-invalid-url26727 ---26728 duration_ms: 171.3190026729 ...26730ok 5135 parallel/test-stream-iter-broadcast-from26731 ---26732 duration_ms: 10305.8130026733 ...26734ok 5136 es-module/test-esm-loader-mock26735 ---26736 duration_ms: 168.7810026737 ...26738ok 5137 es-module/test-esm-initialization26739 ---26740 duration_ms: 261.8270026741 ...26742ok 5138 es-module/test-esm-json26743 ---26744 duration_ms: 261.2810026745 ...26746ok 5139 es-module/test-esm-cjs-load-error-note26747 ---26748 duration_ms: 807.2620026749 ...26750ok 5140 es-module/test-esm-long-path-win # skip this test is Windows-specific.26751 ---26752 duration_ms: 135.8320026753 ...26754ok 5141 es-module/test-esm-loader-text-format26755 ---26756 duration_ms: 169.0750026757 ...26758ok 5142 es-module/test-esm-loader-with-source26759 ---26760 duration_ms: 169.5320026761 ...26762ok 5143 es-module/test-esm-main-lookup26763 ---26764 duration_ms: 170.3590026765 ...26766ok 5144 es-module/test-esm-namespace26767 ---26768 duration_ms: 169.0770026769 ...26770ok 5145 es-module/test-esm-extension-lookup-deprecation26771 ---26772 duration_ms: 607.5710026773 ...26774ok 5146 es-module/test-esm-loader-stringify-text26775 ---26776 duration_ms: 213.1510026777 ...26778ok 5147 es-module/test-esm-loader-not-found26779 ---26780 duration_ms: 261.5050026781 ...26782ok 5148 es-module/test-esm-named-exports26783 ---26784 duration_ms: 211.8000026785 ...26786ok 5149 es-module/test-esm-no-addons26787 ---26788 duration_ms: 210.7450026789 ...26790ok 5150 es-module/test-esm-pkgname26791 ---26792 duration_ms: 137.4390026793 ...26794ok 5151 es-module/test-esm-preserve-symlinks-not-found26795 ---26796 duration_ms: 134.9090026797 ...26798ok 5152 es-module/test-esm-preserve-symlinks-not-found-plain26799 ---26800 duration_ms: 136.8970026801 ...26802ok 5153 es-module/test-esm-process26803 ---26804 duration_ms: 135.0160026805 ...26806ok 5154 es-module/test-esm-prototype-pollution26807 ---26808 duration_ms: 135.1820026809 ...26810ok 5155 es-module/test-esm-recursive-cjs-dependencies26811 ---26812 duration_ms: 135.3370026813 ...26814ok 5156 es-module/test-esm-path-posix26815 ---26816 duration_ms: 170.3600026817 ...26818ok 5157 es-module/test-esm-non-js26819 ---26820 duration_ms: 261.5130026821 ...26822ok 5158 es-module/test-esm-nowarn-exports26823 ---26824 duration_ms: 262.1820026825 ...26826ok 5159 es-module/test-esm-path-win3226827 ---26828 duration_ms: 172.5210026829 ...26830ok 5160 es-module/test-esm-loader-resolve-type26831 ---26832 duration_ms: 326.5310026833 ...26834ok 5161 es-module/test-esm-require-cache26835 ---26836 duration_ms: 136.8440026837 ...26838ok 5162 es-module/test-esm-loader-with-syntax-error26839 ---26840 duration_ms: 327.3160026841 ...26842ok 5163 es-module/test-esm-require-race-condition26843 ---26844 duration_ms: 168.3110026845 ...26846ok 5164 es-module/test-esm-shebang26847 ---26848 duration_ms: 135.4370026849 ...26850ok 5165 es-module/test-esm-snapshot26851 ---26852 duration_ms: 135.5460026853 ...26854ok 5166 es-module/test-esm-package-map-symlink26855 ---26856 duration_ms: 262.5000026857 ...26858ok 5167 es-module/test-esm-scope-node-modules26859 ---26860 duration_ms: 168.7340026861 ...26862ok 5168 es-module/test-esm-package-map-version-fork26863 ---26864 duration_ms: 265.1490026865 ...26866ok 5169 es-module/test-esm-preserve-symlinks26867 ---26868 duration_ms: 265.4290026869 ...26870ok 5170 es-module/test-esm-package-map-boundaries26871 ---26872 duration_ms: 326.6660026873 ...26874ok 5171 es-module/test-esm-resolve-type26875 ---26876 duration_ms: 210.3150026877 ...26878ok 5172 es-module/test-esm-package-map-exports26879 ---26880 duration_ms: 326.3990026881 ...26882ok 5173 es-module/test-esm-throw-undefined26883 ---26884 duration_ms: 136.0990026885 ...26886ok 5174 es-module/test-esm-package-map-flag26887 ---26888 duration_ms: 327.3030026889 ...26890ok 5175 es-module/test-esm-repl26891 ---26892 duration_ms: 261.9910026893 ...26894ok 5176 es-module/test-esm-import-meta-resolve26895 ---26896 duration_ms: 608.7240026897 ...26898ok 5177 es-module/test-esm-shared-loader-dep26899 ---26900 duration_ms: 209.5810026901 ...26902ok 5178 es-module/test-esm-loader-entry-url26903 ---26904 duration_ms: 507.4180026905 ...26906ok 5179 es-module/test-esm-type-field26907 ---26908 duration_ms: 169.7960026909 ...26910ok 5180 es-module/test-esm-package-map-basic26911 ---26912 duration_ms: 412.4580026913 ...26914ok 5181 es-module/test-esm-symlink-main26915 ---26916 duration_ms: 210.6120026917 ...26918ok 5182 es-module/test-esm-type-main26919 ---26920 duration_ms: 140.8350026921 ...26922ok 5183 es-module/test-esm-type-field-errors-226923 ---26924 duration_ms: 169.5130026925 ...26926ok 5184 es-module/test-esm-repl-imports26927 ---26928 duration_ms: 326.1300026929 ...26930ok 5185 es-module/test-esm-url-extname26931 ---26932 duration_ms: 135.1900026933 ...26934ok 5186 es-module/test-esm-loader-thenable26935 ---26936 duration_ms: 508.7240026937 ...26938ok 5187 es-module/test-esm-symlink26939 ---26940 duration_ms: 262.0710026941 ...26942ok 5188 es-module/test-esm-undefined-cjs-global-like-variables26943 ---26944 duration_ms: 168.5650026945 ...26946ok 5189 es-module/test-esm-symlink-type26947 ---26948 duration_ms: 262.4040026949 ...26950ok 5190 es-module/test-esm-syntax-error26951 ---26952 duration_ms: 262.5650026953 ...26954ok 5191 es-module/test-esm-util-types26955 ---26956 duration_ms: 168.8990026957 ...26958ok 5192 es-module/test-esm-loader-default-resolver26959 ---26960 duration_ms: 607.4380026961 ...26962ok 5193 es-module/test-esm-virtual-json26963 ---26964 duration_ms: 211.4000026965 ...26966ok 5194 es-module/test-esm-type-field-errors26967 ---26968 duration_ms: 326.1800026969 ...26970ok 5195 es-module/test-esm-preserve-symlinks-main26971 ---26972 duration_ms: 514.1740026973 ...26974ok 5196 es-module/test-esm-wasm-escape-import-names26975 ---26976 duration_ms: 264.8830026977 ...26978ok 5197 test-runner/test-run-watch-delete26979 ---26980 duration_ms: 2409.6430026981 ...26982ok 5198 es-module/test-esm-wasm-reject-wasm-export-names26983 ---26984 duration_ms: 217.4570026985 ...26986ok 5199 es-module/test-esm-wasm-globals-all-types26987 ---26988 duration_ms: 266.8340026989 ...26990ok 5200 es-module/test-esm-wasm-js-string-builtins26991 ---26992 duration_ms: 262.6630026993 ...26994ok 5201 es-module/test-esm-wasm-load-exports26995 ---26996 duration_ms: 262.6020026997 ...26998ok 5202 es-module/test-esm-wasm-no-code-injection26999 ---27000 duration_ms: 265.3310027001 ...27002ok 5203 es-module/test-esm-wasm-module-instances-warning27003 ---27004 duration_ms: 266.5380027005 ...27006ok 5204 es-module/test-esm-wasm-non-identifier-exports27007 ---27008 duration_ms: 268.5030027009 ...27010ok 5205 es-module/test-esm-tla27011 ---27012 duration_ms: 408.7860027013 ...27014ok 5206 es-module/test-esm-wasm-reject-wasm-import-names27015 ---27016 duration_ms: 263.1090027017 ...27018ok 5207 es-module/test-esm-wasm-reject-wasm-js-export-names27019 ---27020 duration_ms: 264.0240027021 ...27022ok 5208 es-module/test-esm-windows27023 ---27024 duration_ms: 170.5730027025 ...27026ok 5209 es-module/test-esm-package-map-paths27027 ---27028 duration_ms: 609.0800027029 ...27030ok 5210 es-module/test-esm-wasm-reject-wasm-js-import-module27031 ---27032 duration_ms: 262.8690027033 ...27034ok 5211 es-module/test-esm-import-meta-main-eval27035 ---27036 duration_ms: 908.5830027037 ...27038ok 5212 es-module/test-esm-wasm-source-phase-dynamic27039 ---27040 duration_ms: 263.9200027041 ...27042ok 5213 es-module/test-esm-wasm-reject-wasm-js-import-names27043 ---27044 duration_ms: 265.9050027045 ...27046ok 5214 es-module/test-esm-wasm-source-phase-identity27047 ---27048 duration_ms: 265.2810027049 ...27050ok 5215 es-module/test-esm-wasm-source-phase-no-execute27051 ---27052 duration_ms: 264.8630027053 ...27054ok 5216 es-module/test-import-cjs-jitless27055 ---27056 duration_ms: 210.0760027057 ...27058ok 5217 es-module/test-esm-wasm-source-phase-no-execute-dynamic27059 ---27060 duration_ms: 262.9600027061 ...27062ok 5218 es-module/test-import-module-conditional-exports-module27063 ---27064 duration_ms: 170.8590027065 ...27066ok 5219 es-module/test-import-module-retry-require-errored27067 ---27068 duration_ms: 135.9940027069 ...27070ok 5220 es-module/test-esm-wasm-source-phase-not-defined-static27071 ---27072 duration_ms: 261.8340027073 ...27074ok 5221 es-module/test-esm-wasm-source-phase-not-defined-dynamic27075 ---27076 duration_ms: 263.7850027077 ...27078ok 5222 es-module/test-esm-wasm-source-phase-static27079 ---27080 duration_ms: 261.6720027081 ...27082ok 5223 es-module/test-esm-unknown-extension27083 ---27084 duration_ms: 408.0320027085 ...27086ok 5224 es-module/test-esm-package-map-errors27087 ---27088 duration_ms: 708.8380027089 ...27090ok 5225 es-module/test-esm-wasm-top-level-execution27091 ---27092 duration_ms: 264.0800027093 ...27094ok 5226 es-module/test-loaders-hidden-from-users27095 ---27096 duration_ms: 136.9630027097 ...27098ok 5227 es-module/test-esm-wasm-vm-source-phase-dynamic27099 ---27100 duration_ms: 262.3320027101 ...27102ok 5228 es-module/test-require-module-cached-tla27103 ---27104 duration_ms: 109.6460027105 ...27106ok 5229 es-module/test-esm-wasm-vm-source-phase-static27107 ---27108 duration_ms: 263.2740027109 ...27110ok 5230 es-module/test-require-module27111 ---27112 duration_ms: 136.3200027113 ...27114ok 5231 es-module/test-loaders-unknown-builtin-module27115 ---27116 duration_ms: 169.7790027117 ...27118ok 5232 es-module/test-require-as-esm-interop27119 ---27120 duration_ms: 169.9880027121 ...27122ok 5233 es-module/test-esm-module-not-found-commonjs-hint27123 ---27124 duration_ms: 812.3450027125 ...27126ok 5234 es-module/test-require-module-cycle-cjs-esm-esm27127 ---27128 duration_ms: 135.4670027129 ...27130ok 5235 es-module/test-require-module-defined-esmodule27131 ---27132 duration_ms: 109.8370027133 ...27134ok 5236 test-runner/test-watch-delete-isolation-process27135 ---27136 duration_ms: 2411.0590027137 ...27138ok 5237 test-runner/test-watch-delete-isolation-none27139 ---27140 duration_ms: 2414.3800027141 ...27142ok 5238 es-module/test-esm-register-deprecation27143 ---27144 duration_ms: 708.2460027145 ...27146ok 5239 es-module/test-require-module-conditional-exports27147 ---27148 duration_ms: 168.6790027149 ...27150ok 5240 es-module/test-require-module-default-extension27151 ---27152 duration_ms: 136.5840027153 ...27154ok 5241 es-module/test-require-module-detect-entry-point27155 ---27156 duration_ms: 137.2350027157 ...27158ok 5242 es-module/test-require-module-conditional-exports-module27159 ---27160 duration_ms: 170.7380027161 ...27162ok 5243 es-module/test-extensionless-esm-type-commonjs27163 ---27164 duration_ms: 327.8430027165 ...27166ok 5244 es-module/test-require-module-dont-detect-cjs27167 ---27168 duration_ms: 135.6500027169 ...27170ok 5245 es-module/test-require-module-dynamic-import-127171 ---27172 duration_ms: 137.5930027173 ...27174ok 5246 es-module/test-require-module-dynamic-import-227175 ---27176 duration_ms: 137.9500027177 ...27178ok 5247 es-module/test-import-preload-require-cycle27179 ---27180 duration_ms: 263.4390027181 ...27182ok 5248 es-module/test-require-module-dynamic-import-427183 ---27184 duration_ms: 137.3120027185 ...27186ok 5249 es-module/test-import-require-tla-twice27187 ---27188 duration_ms: 263.4160027189 ...27190ok 5250 es-module/test-require-module-implicit27191 ---27192 duration_ms: 135.9140027193 ...27194ok 5251 es-module/test-require-module-instantiated27195 ---27196 duration_ms: 135.4460027197 ...27198ok 5252 es-module/test-require-module-retry-import-errored27199 ---27200 duration_ms: 136.2180027201 ...27202ok 5253 es-module/test-require-module-retry-import-errored-227203 ---27204 duration_ms: 136.4580027205 ...27206ok 5254 es-module/test-require-module-retry-import-evaluating27207 ---27208 duration_ms: 140.1730027209 ...27210ok 5255 es-module/test-require-module-dynamic-import-327211 ---27212 duration_ms: 174.3610027213 ...27214ok 5256 es-module/test-require-module-error-catching27215 ---27216 duration_ms: 170.2500027217 ...27218ok 5257 es-module/test-require-module-synchronous-rejection-handling27219 ---27220 duration_ms: 136.7050027221 ...27222ok 5258 es-module/test-require-module-detect-entry-point-aou27223 ---27224 duration_ms: 210.1860027225 ...27226ok 5259 es-module/test-esm-import-flag27227 ---27228 duration_ms: 1208.8330027229 ...27230ok 5260 es-module/test-require-module-tla-error-metadata27231 ---27232 duration_ms: 171.8640027233 ...27234ok 5261 es-module/test-require-module-tla-retry-import27235 ---27236 duration_ms: 136.4490027237 ...27238ok 5262 es-module/test-require-module-tla-instantiation-error27239 ---27240 duration_ms: 169.0860027241 ...27242ok 5263 es-module/test-require-module-tla-nested27243 ---27244 duration_ms: 173.2640027245 ...27246ok 5264 es-module/test-require-module-tla-rejected27247 ---27248 duration_ms: 169.5850027249 ...27250ok 5265 es-module/test-require-module-tla-resolved27251 ---27252 duration_ms: 169.7730027253 ...27254ok 5266 es-module/test-require-module-tla-retry-require27255 ---27256 duration_ms: 170.2360027257 ...27258ok 5267 es-module/test-require-module-with-detection27259 ---27260 duration_ms: 141.0250027261 ...27262ok 5268 es-module/test-require-module-tla-unresolved27263 ---27264 duration_ms: 171.6240027265 ...27266ok 5269 es-module/test-require-module-tla-retry-import-227267 ---27268 duration_ms: 177.7160027269 ...27270ok 5270 es-module/test-require-module-twice27271 ---27272 duration_ms: 174.1580027273 ...27274ok 5271 es-module/test-esm-source-map27275 ---27276 duration_ms: 817.8500027277 ...27278ok 5272 es-module/test-require-esm-from-imported-cjs27279 ---27280 duration_ms: 408.5570027281 ...27282ok 5273 es-module/test-require-module-tla-execution27283 ---27284 duration_ms: 266.6070027285 ...27286ok 5274 es-module/test-vm-compile-function-lineoffset27287 ---27288 duration_ms: 175.7080027289 ...27290ok 5275 es-module/test-require-module-tla-print-execution27291 ---27292 duration_ms: 262.3870027293 ...27294ok 5276 es-module/test-vm-main-context-default-loader27295 ---27296 duration_ms: 172.3660027297 ...27298ok 5277 es-module/test-vm-main-context-default-loader-eval27299 ---27300 duration_ms: 172.8200027301 ...27302ok 5278 es-module/test-vm-synthetic-module-leak27303 ---27304 duration_ms: 169.8850027305 ...27306ok 5279 es-module/test-wasm-memory-out-of-bound27307 ---27308 duration_ms: 170.0470027309 ...27310ok 5280 es-module/test-wasm-simple27311 ---27312 duration_ms: 170.2220027313 ...27314ok 5281 es-module/test-vm-compile-function-leak27315 ---27316 duration_ms: 214.0400027317 ...27318ok 5282 es-module/test-vm-contextified-script-leak27319 ---27320 duration_ms: 215.7420027321 ...27322ok 5283 es-module/test-require-module-warning27323 ---27324 duration_ms: 328.1700027325 ...27326ok 5284 es-module/test-require-module-cycle-esm-cjs-esm-esm27327 ---27328 duration_ms: 508.8370027329 ...27330ok 5285 es-module/test-require-module-cycle-esm-esm-cjs-esm27331 ---27332 duration_ms: 511.4980027333 ...27334ok 5286 es-module/test-require-module-cycle-esm-esm-cjs-esm-esm27335 ---27336 duration_ms: 515.9760027337 ...27338ok 5287 client-proxy/test-http-proxy-request-authority-construction27339 ---27340 duration_ms: 210.9080027341 ...27342ok 5288 client-proxy/test-http-proxy-request-invalid-char-in-options27343 ---27344 duration_ms: 214.1290027345 ...27346ok 5289 client-proxy/test-http-proxy-request-invalid-credentials27347 ---27348 duration_ms: 215.6910027349 ...27350ok 5290 client-proxy/test-http-proxy-perf-hooks27351 ---27352 duration_ms: 266.9490027353 ...27354ok 5291 es-module/test-require-module-errors27355 ---27356 duration_ms: 510.6580027357 ...27358ok 5292 es-module/test-require-module-feature-detect27359 ---27360 duration_ms: 511.0000027361 ...27362ok 5293 client-proxy/test-http-proxy-request-invalid-proxy27363 ---27364 duration_ms: 211.4530027365 ...27366ok 5294 client-proxy/test-http-proxy-request-absolute-path-authority-match27367 ---27368 duration_ms: 267.1780027369 ...27370ok 5295 es-module/test-require-module-cycle-esm-cjs-esm27371 ---27372 duration_ms: 608.0780027373 ...27374ok 5296 client-proxy/test-http-proxy-request-max-sockets27375 ---27376 duration_ms: 270.3970027377 ...27378ok 5297 client-proxy/test-http-proxy-request-invalid-char-in-url27379 ---27380 duration_ms: 330.2000027381 ...27382ok 5298 es-module/test-require-module-transpiled27383 ---27384 duration_ms: 510.6990027385 ...27386ok 5299 client-proxy/test-http-proxy-request-origin-form-path27387 ---27388 duration_ms: 264.6260027389 ...27390ok 5300 es-module/test-vm-source-text-module-leak27391 ---27392 duration_ms: 511.9850027393 ...27394ok 5301 client-proxy/test-http-proxy-request-connection-refused27395 ---27396 duration_ms: 417.8500027397 ...27398ok 5302 client-proxy/test-http-proxy-request-socket-keep-alive27399 ---27400 duration_ms: 273.4420027401 ...27402ok 5303 es-module/test-esm-loader-programmatically27403 ---27404 duration_ms: 1511.0600027405 ...27406ok 5304 client-proxy/test-http-proxy-request-validation-errors27407 ---27408 duration_ms: 265.4700027409 ...27410ok 5305 client-proxy/test-http-proxy-request-invalid-url27411 ---27412 duration_ms: 408.7860027413 ...27414ok 5306 client-proxy/test-http-proxy-request-ipv627415 ---27416 duration_ms: 411.3990027417 ...27418ok 5307 es-module/test-require-node-modules-warning27419 ---27420 duration_ms: 613.1420027421 ...27422ok 5308 client-proxy/test-http-proxy-request-no-proxy-asterisk27423 ---27424 duration_ms: 412.8020027425 ...27426ok 5309 es-module/test-require-module-tla-error-snapshot27427 ---27428 duration_ms: 709.1710027429 ...27430ok 5310 client-proxy/test-http-proxy-request-proxy-failure-50027431 ---27432 duration_ms: 409.9710027433 ...27434ok 5311 client-proxy/test-http-set-global-proxy-from-env-invalid-type27435 ---27436 duration_ms: 169.2310027437 ...27438ok 5312 client-proxy/test-http-proxy-request-https-proxy27439 ---27440 duration_ms: 514.6010027441 ...27442ok 5313 client-proxy/test-http-proxy-request-proxy-failure-hang-up27443 ---27444 duration_ms: 409.5410027445 ...27446ok 5314 client-proxy/test-http-set-global-proxy-from-env-invalid-url27447 ---27448 duration_ms: 168.6460027449 ...27450ok 5315 client-proxy/test-http-set-global-proxy-from-env-http-request-empty27451 ---27452 duration_ms: 276.2290027453 ...27454ok 5316 client-proxy/test-http-proxy-request-no-proxy-ip27455 ---27456 duration_ms: 509.3960027457 ...27458ok 5317 client-proxy/test-http-request-proxy-post27459 ---27460 duration_ms: 413.0630027461 ...27462ok 5318 client-proxy/test-http-set-global-proxy-from-env-fetch27463 ---27464 duration_ms: 409.6350027465 ...27466ok 5319 client-proxy/test-http-request-proxy-post-server-failure27467 ---27468 duration_ms: 420.3380027469 ...27470ok 5320 client-proxy/test-http-set-global-proxy-from-env-fetch-default27471 ---27472 duration_ms: 410.4090027473 ...27474ok 5321 client-proxy/test-http-set-global-proxy-from-env-fetch-empty27475 ---27476 duration_ms: 413.0720027477 ...27478ok 5322 client-proxy/test-http-set-global-proxy-from-env-fetch-https27479 ---27480 duration_ms: 410.3820027481 ...27482ok 5323 client-proxy/test-http-set-global-proxy-from-env-fetch-no-proxy27483 ---27484 duration_ms: 413.9120027485 ...27486ok 5324 client-proxy/test-http-set-global-proxy-from-env-fetch-restore27487 ---27488 duration_ms: 411.7720027489 ...27490ok 5325 client-proxy/test-http-set-global-proxy-from-env-http-request27491 ---27492 duration_ms: 411.7100027493 ...27494ok 5326 client-proxy/test-http-set-global-proxy-from-env-http-request-default27495 ---27496 duration_ms: 411.9800027497 ...27498ok 5327 es-module/test-esm-tla-unfinished27499 ---27500 duration_ms: 1415.8350027501 ...27502ok 5328 client-proxy/test-http-proxy-request-no-proxy27503 ---27504 duration_ms: 613.3330027505 ...27506ok 5329 client-proxy/test-http-proxy-request27507 ---27508 duration_ms: 710.2000027509 ...27510ok 5330 client-proxy/test-https-proxy-request-invalid-char-in-options27511 ---27512 duration_ms: 169.1610027513 ...27514ok 5331 client-proxy/test-https-proxy-request-invalid-credentials27515 ---27516 duration_ms: 168.3630027517 ...27518ok 5332 client-proxy/test-http-proxy-request-no-proxy-port-specific27519 ---27520 duration_ms: 614.0430027521 ...27522ok 5333 es-module/test-loaders-workers-spawned27523 ---27524 duration_ms: 1114.7760027525 ...27526ok 5334 client-proxy/test-http-set-global-proxy-from-env-no-proxy27527 ---27528 duration_ms: 327.2550027529 ...27530ok 5335 client-proxy/test-http-set-global-proxy-from-env-https-request27531 ---27532 duration_ms: 409.0210027533 ...27534ok 5336 client-proxy/test-http-set-global-proxy-from-env-http-request-restore27535 ---27536 duration_ms: 417.5580027537 ...27538ok 5337 es-module/test-require-module-preload27539 ---27540 duration_ms: 1011.4420027541 ...27542ok 5338 client-proxy/test-http-proxy-fetch27543 ---27544 duration_ms: 810.9620027545 ...27546ok 5339 client-proxy/test-https-proxy-request-auth-failure27547 ---27548 duration_ms: 327.4790027549 ...27550ok 5340 client-proxy/test-https-proxy-request-invalid-char-in-url27551 ---27552 duration_ms: 262.7920027553 ...27554ok 5341 client-proxy/test-https-proxy-request-max-sockets27555 ---27556 duration_ms: 210.6300027557 ...27558ok 5342 client-proxy/test-http-set-global-proxy-from-env-override-fetch27559 ---27560 duration_ms: 407.4340027561 ...27562ok 5343 client-proxy/test-http-set-global-proxy-from-env-override-http27563 ---27564 duration_ms: 408.8570027565 ...27566ok 5344 async-hooks/test-async-await27567 ---27568 duration_ms: 169.9020027569 ...27570ok 5345 client-proxy/test-https-proxy-request-invalid-url27571 ---27572 duration_ms: 326.5050027573 ...27574ok 5346 client-proxy/test-https-proxy-request-connection-refused27575 ---27576 duration_ms: 409.9770027577 ...27578ok 5347 client-proxy/test-https-proxy-request-socket-keep-alive27579 ---27580 duration_ms: 218.2990027581 ...27582ok 5348 client-proxy/test-https-proxy-request-empty-response27583 ---27584 duration_ms: 413.2090027585 ...27586ok 5349 client-proxy/test-https-proxy-request-handshake-failure27587 ---27588 duration_ms: 409.1900027589 ...27590ok 5350 async-hooks/test-async-local-storage-args27591 ---27592 duration_ms: 135.2170027593 ...27594ok 5351 client-proxy/test-https-proxy-request-https-proxy27595 ---27596 duration_ms: 409.0240027597 ...27598ok 5352 async-hooks/test-async-exec-resource-http27599 ---27600 duration_ms: 179.2040027601 ...27602ok 5353 async-hooks/test-async-exec-resource-http-agent27603 ---27604 duration_ms: 168.5590027605 ...27606ok 5354 async-hooks/test-async-local-storage-async-functions27607 ---27608 duration_ms: 135.8090027609 ...27610ok 5355 async-hooks/test-async-exec-resource-match27611 ---27612 duration_ms: 168.4610027613 ...27614ok 5356 async-hooks/test-async-local-storage-async-await27615 ---27616 duration_ms: 169.0120027617 ...27618ok 5357 async-hooks/test-async-local-storage-dgram27619 ---27620 duration_ms: 168.9860027621 ...27622ok 5358 async-hooks/test-async-local-storage-enable-disable27623 ---27624 duration_ms: 135.5600027625 ...27626ok 5359 es-module/test-esm-loader-spawn-promisified27627 ---27628 duration_ms: 2011.5130027629 ...27630ok 5360 client-proxy/test-https-proxy-request-proxy-failure-hang-up27631 ---27632 duration_ms: 328.2500027633 ...27634ok 5361 async-hooks/test-async-local-storage-errors27635 ---27636 duration_ms: 135.9020027637 ...27638ok 5362 async-hooks/test-async-local-storage-enter-with27639 ---27640 duration_ms: 169.0220027641 ...27642ok 5363 client-proxy/test-https-proxy-request-header-overflow27643 ---27644 duration_ms: 509.0820027645 ...27646ok 5364 async-hooks/test-async-local-storage-http27647 ---27648 duration_ms: 137.0080027649 ...27650ok 5365 client-proxy/test-https-proxy-request-malformed-response27651 ---27652 duration_ms: 413.4810027653 ...27654ok 5366 async-hooks/test-async-local-storage-misc-stores27655 ---27656 duration_ms: 135.9870027657 ...27658ok 5367 client-proxy/test-https-proxy-request-no-proxy27659 ---27660 duration_ms: 411.4510027661 ...27662ok 5368 async-hooks/test-async-local-storage-promises27663 ---27664 duration_ms: 135.7390027665 ...27666ok 5369 async-hooks/test-async-local-storage-gcable27667 ---27668 duration_ms: 169.5920027669 ...27670ok 5370 client-proxy/test-https-proxy-request-proxy-failure-40427671 ---27672 duration_ms: 411.7160027673 ...27674ok 5371 client-proxy/test-https-proxy-request-proxy-failure-50027675 ---27676 duration_ms: 407.7680027677 ...27678ok 5372 async-hooks/test-async-local-storage-http-agent27679 ---27680 duration_ms: 168.3830027681 ...27682ok 5373 async-hooks/test-async-local-storage-socket27683 ---27684 duration_ms: 136.1850027685 ...27686ok 5374 async-hooks/test-async-local-storage-stream-finished27687 ---27688 duration_ms: 136.8690027689 ...27690ok 5375 async-hooks/test-async-local-storage-thenable27691 ---27692 duration_ms: 136.4400027693 ...27694ok 5376 async-hooks/test-async-wrap-providers27695 ---27696 duration_ms: 135.5580027697 ...27698ok 5377 async-hooks/test-async-local-storage-nested27699 ---27700 duration_ms: 169.7610027701 ...27702ok 5378 client-proxy/test-https-proxy-request-proxy-failure-50227703 ---27704 duration_ms: 411.5500027705 ...27706ok 5379 client-proxy/test-https-proxy-request-server-failure-hang-up27707 ---27708 duration_ms: 408.7180027709 ...27710ok 5380 client-proxy/test-http-proxy-request-no-proxy-domain27711 ---27712 duration_ms: 1011.2460027713 ...27714ok 5381 async-hooks/test-crypto-pbkdf227715 ---27716 duration_ms: 135.0370027717 ...27718ok 5382 async-hooks/test-crypto-randomBytes27719 ---27720 duration_ms: 135.1710027721 ...27722ok 5383 client-proxy/test-https-request-proxy-post27723 ---27724 duration_ms: 416.5140027725 ...27726ok 5384 async-hooks/test-disable-in-init27727 ---27728 duration_ms: 135.3990027729 ...27730ok 5385 async-hooks/test-async-local-storage-tlssocket27731 ---27732 duration_ms: 211.5270027733 ...27734ok 5386 async-hooks/test-embedder.api.async-resource.runInAsyncScope27735 ---27736 duration_ms: 134.9220027737 ...27738ok 5387 async-hooks/test-emit-before-after27739 ---27740 duration_ms: 134.9170027741 ...27742ok 5388 async-hooks/test-fsreqcallback-access27743 ---27744 duration_ms: 109.6060027745 ...27746ok 5389 client-proxy/test-https-proxy-request27747 ---27748 duration_ms: 708.5330027749 ...27750ok 5390 async-hooks/test-embedder.api.async-resource27751 ---27752 duration_ms: 168.1000027753 ...27754ok 5391 async-hooks/test-emit-init27755 ---27756 duration_ms: 135.1800027757 ...27758ok 5392 async-hooks/test-enable-disable27759 ---27760 duration_ms: 135.0000027761 ...27762ok 5393 async-hooks/test-destroy-not-blocked27763 ---27764 duration_ms: 209.5490027765 ...27766ok 5394 async-hooks/test-enable-in-init27767 ---27768 duration_ms: 136.0790027769 ...27770ok 5395 async-hooks/test-fsreqcallback-readFile27771 ---27772 duration_ms: 135.8080027773 ...27774ok 5396 async-hooks/test-graph.fsreq-readFile27775 ---27776 duration_ms: 135.0270027777 ...27778ok 5397 client-proxy/test-https-proxy-request-ipv627779 ---27780 duration_ms: 608.6650027781 ...27782ok 5398 async-hooks/test-graph.intervals27783 ---27784 duration_ms: 135.0860027785 ...27786ok 5399 async-hooks/test-fseventwrap27787 ---27788 duration_ms: 168.7940027789 ...27790ok 5400 async-hooks/test-getaddrinforeqwrap27791 ---27792 duration_ms: 168.6020027793 ...27794ok 5401 async-hooks/test-graph.pipeconnect27795 ---27796 duration_ms: 136.7970027797 ...27798ok 5402 async-hooks/test-getnameinforeqwrap27799 ---27800 duration_ms: 169.6250027801 ...27802ok 5403 async-hooks/test-graph.http27803 ---27804 duration_ms: 168.3690027805 ...27806ok 5404 async-hooks/test-graph.statwatcher27807 ---27808 duration_ms: 134.9930027809 ...27810ok 5405 async-hooks/test-filehandle-no-reuse27811 ---27812 duration_ms: 211.3870027813 ...27814ok 5406 async-hooks/test-graph.shutdown27815 ---27816 duration_ms: 168.3130027817 ...27818ok 5407 async-hooks/test-graph.tcp27819 ---27820 duration_ms: 135.5790027821 ...27822ok 5408 async-hooks/test-embedder.api.async-resource-no-type27823 ---27824 duration_ms: 262.2990027825 ...27826ok 5409 client-proxy/test-https-proxy-fetch27827 ---27828 duration_ms: 810.2230027829 ...27830ok 5410 async-hooks/test-graph.signal27831 ---27832 duration_ms: 169.0120027833 ...27834ok 5411 es-module/test-esm-detect-ambiguous27835 ---27836 duration_ms: 2913.1420027837 ...27838ok 5412 async-hooks/test-emit-after-on-destroyed27839 ---27840 duration_ms: 262.3800027841 ...27842ok 5413 async-hooks/test-emit-before-on-destroyed27843 ---27844 duration_ms: 262.2940027845 ...27846ok 5414 client-proxy/test-use-env-proxy-cli-http27847 ---27848 duration_ms: 612.9750027849 ...27850ok 5415 async-hooks/test-graph.timeouts27851 ---27852 duration_ms: 168.6020027853 ...27854ok 5416 client-proxy/test-use-env-proxy-cli-https27855 ---27856 duration_ms: 615.9750027857 ...27858ok 5417 async-hooks/test-httpparser.response27859 ---27860 duration_ms: 135.8140027861 ...27862ok 5418 async-hooks/test-graph.tls-write27863 ---27864 duration_ms: 169.4560027865 ...27866ok 5419 async-hooks/test-graph.tls-write-1227867 ---27868 duration_ms: 168.6680027869 ...27870ok 5420 async-hooks/test-late-hook-enable27871 ---27872 duration_ms: 135.3510027873 ...27874ok 5421 async-hooks/test-net-get-connections27875 ---27876 duration_ms: 136.3730027877 ...27878ok 5422 async-hooks/test-httpparser.request27879 ---27880 duration_ms: 168.6330027881 ...27882ok 5423 async-hooks/test-nexttick-default-trigger27883 ---27884 duration_ms: 136.2010027885 ...27886ok 5424 async-hooks/test-immediate27887 ---27888 duration_ms: 168.3650027889 ...27890ok 5425 async-hooks/test-no-assert-when-disabled27891 ---27892 duration_ms: 136.2740027893 ...27894ok 5426 async-hooks/test-pipeconnectwrap27895 ---27896 duration_ms: 138.0270027897 ...27898ok 5427 async-hooks/test-promise27899 ---27900 duration_ms: 136.6210027901 ...27902ok 5428 async-hooks/test-http-agent-handle-reuse-parallel27903 ---27904 duration_ms: 211.0920027905 ...27906ok 5429 async-hooks/test-http-agent-handle-reuse-serial27907 ---27908 duration_ms: 210.8540027909 ...27910ok 5430 es-module/test-typescript-module27911 ---27912 duration_ms: 1514.0900027913 ...27914ok 5431 async-hooks/test-queue-microtask27915 ---27916 duration_ms: 138.1280027917 ...27918ok 5432 async-hooks/test-graph.pipe27919 ---27920 duration_ms: 326.6950027921 ...27922ok 5433 async-hooks/test-promise.chain-promise-before-init-hooks27923 ---27924 duration_ms: 169.0030027925 ...27926ok 5434 async-hooks/test-tcpwrap27927 ---27928 duration_ms: 136.2000027929 ...27930ok 5435 async-hooks/test-promise.promise-before-init-hooks27931 ---27932 duration_ms: 169.2350027933 ...27934ok 5436 async-hooks/test-track-promises-default27935 ---27936 duration_ms: 109.0310027937 ...27938ok 5437 async-hooks/test-track-promises-false27939 ---27940 duration_ms: 108.7760027941 ...27942ok 5438 client-proxy/test-use-env-proxy-precedence27943 ---27944 duration_ms: 716.4180027945 ...27946ok 5439 async-hooks/test-track-promises-true27947 ---27948 duration_ms: 109.6440027949 ...27950ok 5440 async-hooks/test-shutdownwrap27951 ---27952 duration_ms: 171.9140027953 ...27954ok 5441 async-hooks/test-improper-order27955 ---27956 duration_ms: 261.3380027957 ...27958ok 5442 async-hooks/test-track-promises-false-check27959 ---27960 duration_ms: 136.3490027961 ...27962ok 5443 async-hooks/test-unhandled-rejection-context27963 ---27964 duration_ms: 108.3950027965 ...27966ok 5444 async-hooks/test-improper-unwind27967 ---27968 duration_ms: 263.3130027969 ...27970ok 5445 async-hooks/test-ttywrap.readstream # skip no valid readable TTY available27971 ---27972 duration_ms: 135.3940027973 ...27974ok 5446 async-hooks/test-udpsendwrap27975 ---27976 duration_ms: 135.2430027977 ...27978ok 5447 async-hooks/test-unhandled-exception-valid-ids27979 ---27980 duration_ms: 135.5390027981 ...27982ok 5448 async-hooks/test-udpwrap27983 ---27984 duration_ms: 136.2410027985 ...27986ok 5449 async-hooks/test-signalwrap27987 ---27988 duration_ms: 213.5270027989 ...27990ok 5450 async-hooks/test-track-promises-validation27991 ---27992 duration_ms: 168.3530027993 ...27994ok 5451 async-hooks/test-pipewrap27995 ---27996 duration_ms: 264.6110027997 ...27998ok 5452 async-hooks/test-async-local-storage-no-mix-contexts27999 ---28000 duration_ms: 608.9230028001 ...28002ok 5453 async-hooks/test-zlib.zlib-binding.deflate28003 ---28004 duration_ms: 168.8620028005 ...28006ok 5454 pseudo-tty/console-dumb-tty28007 ---28008 duration_ms: 169.4950028009 ...28010ok 5455 pseudo-tty/console_colors28011 ---28012 duration_ms: 170.5190028013 ...28014ok 5456 pseudo-tty/no_dropped_stdio28015 ---28016 duration_ms: 168.6710028017 ...28018ok 5457 pseudo-tty/no_interleaved_stdio28019 ---28020 duration_ms: 169.2260028021 ...28022ok 5458 pseudo-tty/test-assert-position-indicator28023 ---28024 duration_ms: 135.6930028025 ...28026ok 5459 async-hooks/test-callback-error28027 ---28028 duration_ms: 607.3690028029 ...28030ok 5460 async-hooks/test-writewrap28031 ---28032 duration_ms: 209.9230028033 ...28034ok 5461 pseudo-tty/ref_keeps_node_running28035 ---28036 duration_ms: 170.9870028037 ...28038ok 5462 async-hooks/test-httpparser-reuse28039 ---28040 duration_ms: 408.5270028041 ...28042ok 5463 pseudo-tty/stdin-setrawmode28043 ---28044 duration_ms: 172.4110028045 ...28046ok 5464 pseudo-tty/test-assert-no-color28047 ---28048 duration_ms: 169.8340028049 ...28050ok 5465 pseudo-tty/test-assert-colors28051 ---28052 duration_ms: 171.7870028053 ...28054ok 5466 pseudo-tty/test-async-wrap-getasyncid-tty28055 ---28056 duration_ms: 169.3120028057 ...28058ok 5467 pseudo-tty/test-fatal-error28059 ---28060 duration_ms: 169.1610028061 ...28062ok 5468 es-module/test-esm-loader-chaining28063 ---28064 duration_ms: 2714.7200028065 ...28066ok 5469 pseudo-tty/test-readable-tty-keepalive28067 ---28068 duration_ms: 169.5420028069 ...28070ok 5470 pseudo-tty/readline-dumb-tty28071 ---28072 duration_ms: 214.4210028073 ...28074ok 5471 pseudo-tty/test-set-raw-mode-modes28075 ---28076 duration_ms: 169.4390028077 ...28078ok 5472 pseudo-tty/test-handle-wrap-hasref-tty28079 ---28080 duration_ms: 210.0810028081 ...28082ok 5473 pseudo-tty/test-stderr-stdout-handle-sigwinch28083 ---28084 duration_ms: 171.5200028085 ...28086ok 5474 pseudo-tty/test-stdin-write28087 ---28088 duration_ms: 172.3730028089 ...28090ok 5475 pseudo-tty/test-stdout-read28091 ---28092 duration_ms: 171.7040028093 ...28094ok 5476 pseudo-tty/test-testpy-env-var-via-comment28095 ---28096 duration_ms: 168.6850028097 ...28098ok 5477 pseudo-tty/repl-dumb-tty28099 ---28100 duration_ms: 265.6000028101 ...28102ok 5478 async-hooks/test-timers.setInterval28103 ---28104 duration_ms: 407.2870028105 ...28106ok 5479 es-module/test-typescript-commonjs28107 ---28108 duration_ms: 1813.0150028109 ...28110ok 5480 pseudo-tty/test-tty-color-support-warning-228111 ---28112 duration_ms: 139.1290028113 ...28114ok 5481 async-hooks/test-timers.setTimeout28115 ---28116 duration_ms: 408.0430028117 ...28118ok 5482 report/test-report-config28119 ---28120 duration_ms: 112.1300028121 ...28122ok 5483 pseudo-tty/test-repl-external-module28123 ---28124 duration_ms: 263.2070028125 ...28126ok 5484 pseudo-tty/test-tty-color-support28127 ---28128 duration_ms: 172.1550028129 ...28130ok 5485 pseudo-tty/test-set-raw-mode-reset28131 ---28132 duration_ms: 263.2950028133 ...28134ok 5486 pseudo-tty/test-tty-color-support-warning28135 ---28136 duration_ms: 169.2950028137 ...28138ok 5487 pseudo-tty/test-tty-isatty28139 ---28140 duration_ms: 168.6940028141 ...28142ok 5488 pseudo-tty/test-set-raw-mode-reset-process-exit28143 ---28144 duration_ms: 261.6060028145 ...28146ok 5489 pseudo-tty/test-tty-stream-constructors28147 ---28148 duration_ms: 138.5050028149 ...28150ok 5490 pseudo-tty/test-tty-stdin-call-end28151 ---28152 duration_ms: 169.8130028153 ...28154ok 5491 pseudo-tty/test-tty-stdin-end28155 ---28156 duration_ms: 168.1590028157 ...28158ok 5492 pseudo-tty/test-set-raw-mode-reset-signal28159 ---28160 duration_ms: 263.1310028161 ...28162ok 5493 pseudo-tty/test-start-trace-sigint28163 ---28164 duration_ms: 263.3630028165 ...28166ok 5494 pseudo-tty/test-stop-trace-sigint28167 ---28168 duration_ms: 261.1600028169 ...28170ok 5495 pseudo-tty/test-tty-wrap28171 ---28172 duration_ms: 171.7540028173 ...28174ok 5496 async-hooks/test-querywrap28175 ---28176 duration_ms: 509.5960028177 ...28178ok 5497 async-hooks/test-statwatcher28179 ---28180 duration_ms: 509.2860028181 ...28182ok 5498 report/test-report-uncaught-exception-handled28183 ---28184 duration_ms: 108.7840028185 ...28186ok 5499 report/test-report-getreport28187 ---28188 duration_ms: 135.7740028189 ...28190ok 5500 report/test-report-signal28191 ---28192 duration_ms: 135.2000028193 ...28194ok 5501 pseudo-tty/test-tty-stdout-end28195 ---28196 duration_ms: 212.6760028197 ...28198ok 5502 report/test-report-uncaught-exception-override28199 ---28200 duration_ms: 108.6400028201 ...28202ok 5503 pseudo-tty/test-trace-sigint-disabled28203 ---28204 duration_ms: 262.6410028205 ...28206ok 5504 pseudo-tty/test-tty-stdout-resize28207 ---28208 duration_ms: 214.3440028209 ...28210ok 5505 pseudo-tty/test-tty-window-size28211 ---28212 duration_ms: 213.1400028213 ...28214ok 5506 pseudo-tty/test-trace-sigint28215 ---28216 duration_ms: 326.7990028217 ...28218ok 5507 report/test-report-writereport-exclude-env28219 ---28220 duration_ms: 168.1630028221 ...28222ok 5508 async-hooks/test-tlswrap28223 ---28224 duration_ms: 607.8430028225 ...28226ok 5509 report/test-report-worker28227 ---28228 duration_ms: 209.8710028229 ...28230ok 5510 report/test-report-uncaught-exception28231 ---28232 duration_ms: 261.6870028233 ...28234ok 5511 report/test-report-exclude-network28235 ---28236 duration_ms: 328.2100028237 ...28238ok 5512 report/test-report-uncaught-exception-compat28239 ---28240 duration_ms: 262.1110028241 ...28242ok 5513 client-proxy/test-https-proxy-request-incomplete-headers28243 ---28244 duration_ms: 1407.9130028245 ...28246ok 5514 report/test-report-uncaught-exception-primitives28247 ---28248 duration_ms: 262.1520028249 ...28250ok 5515 pseudo-tty/test-trace-sigint-on-idle28251 ---28252 duration_ms: 414.0100028253 ...28254ok 5516 report/test-report-uncaught-exception-symbols28255 ---28256 duration_ms: 263.0460028257 ...28258ok 5517 report/test-report-fatalerror-oomerror-compact28259 ---28260 duration_ms: 412.6650028261 ...28262ok 5518 report/test-report-fatalerror-oomerror-directory28263 ---28264 duration_ms: 412.5280028265 ...28266ok 5519 report/test-report-uv-handles28267 ---28268 duration_ms: 326.2710028269 ...28270ok 5520 report/test-report-fatalerror-oomerror-filename28271 ---28272 duration_ms: 407.3290028273 ...28274ok 5521 report/test-report-fatalerror-oomerror-not-set28275 ---28276 duration_ms: 406.7660028277 ...28278ok 5522 report/test-report-fatalerror-oomerror-set28279 ---28280 duration_ms: 407.3670028281 ...28282ok 5523 async-hooks/test-async-exec-resource-http-3206028283 ---28284 duration_ms: 1309.5140028285 ...28286ok 5524 client-proxy/test-https-proxy-request-tunnel-timeout28287 ---28288 duration_ms: 1410.6070028289 ...28290ok 5525 client-proxy/test-https-proxy-request-tunnel-timeout-agent28291 ---28292 duration_ms: 1409.9090028293 ...28294ok 5526 report/test-report-writereport28295 ---28296 duration_ms: 406.7970028297 ...28298ok 5527 pummel/test-array-hash-collision28299 ---28300 duration_ms: 507.1660028301 ...28302ok 5528 es-module/test-typescript-eval28303 ---28304 duration_ms: 2514.3460028305 ...28306ok 5529 wasi/test-wasi-poll28307 ---28308 duration_ms: 6520.1000028309 ...28310ok 5530 es-module/test-esm-tla-syntax-errors-not-recognized-as-tla-error28311 ---28312 duration_ms: 3713.6970028313 ...28314ok 5531 es-module/test-typescript28315 ---28316 duration_ms: 3415.3480028317 ...28318ok 5532 es-module/test-wasm-web-api28319 ---28320 duration_ms: 3512.8080028321 ...28322ok 5533 pummel/test-blob-slice-with-large-size28323 ---28324 duration_ms: 1809.0720028325 ...28326ok 5534 pummel/test-buffer-large-size-buffer-alloc28327 ---28328 duration_ms: 1708.6940028329 ...28330ok 5535 pummel/test-buffer-large-size-buffer-alloc-unsafe28331 ---28332 duration_ms: 1708.8320028333 ...28334ok 5536 pummel/test-buffer-large-size-buffer-alloc-unsafe-slow28335 ---28336 duration_ms: 1709.5290028337 ...28338ok 5537 pummel/test-buffer-large-size-buffer-write28339 ---28340 duration_ms: 109.1700028341 ...28342ok 5538 parallel/test-runner-execution-ordered-bypass28343 ---28344 duration_ms: 30441.9490028345 ...28346ok 5539 pummel/test-buffer-large-size-copy28347 ---28348 duration_ms: 2710.6470028349 ...28350ok 5540 pummel/test-buffer-large-size-slowbuffer28351 ---28352 duration_ms: 1709.1080028353 ...28354ok 5541 pummel/test-child-process-spawn-loop28355 ---28356 duration_ms: 1408.6870028357 ...28358ok 5542 pummel/test-crypto-argon2-nonblocking-constructor28359 ---28360 duration_ms: 2411.1640028361 ...28362ok 5543 pummel/test-crypto-dh-hash28363 ---28364 duration_ms: 262.3420028365 ...28366ok 5544 pummel/test-crypto-dh-keys28367 ---28368 duration_ms: 407.0820028369 ...28370ok 5545 pummel/test-crypto-pqc-sign-verify-slh-dsa28371 ---28372 duration_ms: 13721.8500028373 ...28374ok 5546 pummel/test-dh-regr28375 ---28376 duration_ms: 25631.3150028377 ...28378ok 5547 pummel/test-fs-largefile28379 ---28380 duration_ms: 136.5300028381 ...28382ok 5548 pummel/test-fs-read-file-sync-utf8-memory28383 ---28384 duration_ms: 608.8510028385 ...28386ok 5549 pummel/test-fs-readfile-tostring-fail28387 ---28388 duration_ms: 1611.2260028389 ...28390ok 5550 pummel/test-heap-profile-and-snapshot-near-heap-limit28391 ---28392 duration_ms: 1310.1100028393 ...28394ok 5551 pummel/test-heap-profile-near-heap-limit28395 ---28396 duration_ms: 1109.4020028397 ...28398ok 5552 pummel/test-heapdump-dns28399 ---28400 duration_ms: 3113.0960028401 ...28402ok 5553 pummel/test-heapdump-env28403 ---28404 duration_ms: 1311.3280028405 ...28406ok 5554 pummel/test-heapdump-fs-promise28407 ---28408 duration_ms: 2412.1790028409 ...28410ok 5555 pummel/test-heapdump-http228411 ---28412 duration_ms: 4014.1050028413 ...28414ok 5556 pummel/test-heapdump-inspector28415 ---28416 duration_ms: 1909.8540028417 ...28418ok 5557 pummel/test-heapdump-shadow-realm28419 ---28420 duration_ms: 4112.9020028421 ...28422ok 5558 pummel/test-heapdump-tls28423 ---28424 duration_ms: 1908.6010028425 ...28426ok 5559 pummel/test-heapdump-urlpattern28427 ---28428 duration_ms: 1808.6510028429 ...28430ok 5560 pummel/test-heapdump-vm-script28431 ---28432 duration_ms: 908.5370028433 ...28434ok 5561 pummel/test-heapdump-worker28435 ---28436 duration_ms: 1809.6640028437 ...28438ok 5562 pummel/test-heapdump-zlib28439 ---28440 duration_ms: 13024.2890028441 ...28442ok 5563 pummel/test-heapdump-zstd28443 ---28444 duration_ms: 2411.2010028445 ...28446ok 5564 pummel/test-heapsnapshot-near-heap-limit28447 ---28448 duration_ms: 3712.7360028449 ...28450ok 5565 pummel/test-heapsnapshot-near-heap-limit-big28451 ---28452 duration_ms: 3010.7380028453 ...28454ok 5566 pummel/test-heapsnapshot-near-heap-limit-bounded28455 ---28456 duration_ms: 3213.6750028457 ...28458ok 5567 pummel/test-heapsnapshot-near-heap-limit-by-api28459 ---28460 duration_ms: 5114.6490028461 ...28462ok 5568 pummel/test-http-many-keep-alive-connections28463 ---28464 duration_ms: 708.0390028465 ...28466ok 5569 pummel/test-http-upload-timeout28467 ---28468 duration_ms: 3412.1820028469 ...28470ok 5570 pummel/test-https-large-response28471 ---28472 duration_ms: 329.6710028473 ...28474ok 5571 pummel/test-https-no-reader28475 ---28476 duration_ms: 2412.5560028477 ...28478ok 5572 pummel/test-keep-alive # skip test requires `wrk` to be installed first28479 ---28480 duration_ms: 170.8370028481 ...28482ok 5573 pummel/test-net-many-clients28483 ---28484 duration_ms: 263.9830028485 ...28486ok 5574 pummel/test-net-pause28487 ---28488 duration_ms: 2312.4770028489 ...28490ok 5575 pummel/test-net-pingpong28491 ---28492 duration_ms: 330.4590028493 ...28494ok 5576 pummel/test-net-pingpong-delay28495 ---28496 duration_ms: 509.0470028497 ...28498ok 5577 pummel/test-net-timeout28499 ---28500 duration_ms: 3813.1360028501 ...28502ok 5578 pummel/test-net-timeout228503 ---28504 duration_ms: 5315.3610028505 ...28506ok 5579 pummel/test-net-write-callbacks28507 ---28508 duration_ms: 910.1600028509 ...28510ok 5580 pummel/test-next-tick-infinite-calls28511 ---28512 duration_ms: 6314.5560028513 ...28514ok 5581 pummel/test-process-cpuUsage28515 ---28516 duration_ms: 709.3240028517 ...28518ok 5582 pummel/test-process-hrtime28519 ---28520 duration_ms: 2213.5390028521 ...28522ok 5583 pummel/test-regress-GH-89228523 ---28524 duration_ms: 509.1710028525 ...28526ok 5584 pummel/test-repl-paste-big-data28527 ---28528 duration_ms: 608.6680028529 ...28530ok 5585 pummel/test-stream-pipe-multi28531 ---28532 duration_ms: 1029.9700028533 ...28534ok 5586 pummel/test-string-decoder-large-buffer28535 ---28536 duration_ms: 108.9310028537 ...28538ok 5587 pummel/test-structuredclone-jstransferable28539 ---28540 duration_ms: 1008.0010028541 ...28542ok 5588 pummel/test-timers28543 ---28544 duration_ms: 3212.3310028545 ...28546ok 5589 pummel/test-tls-server-large-request28547 ---28548 duration_ms: 328.5770028549 ...28550ok 5590 pummel/test-tls-throttle28551 ---28552 duration_ms: 328.8130028553 ...28554ok 5591 pummel/test-vm-memleak28555 ---28556 duration_ms: 5616.0070028557 ...28558ok 5592 pummel/test-vm-race28559 ---28560 duration_ms: 5211.9410028561 ...28562ok 5593 pummel/test-watch-file28563 ---28564 duration_ms: 5215.3740028565 ...28566ok 5594 pummel/test-webcrypto-derivebits-pbkdf228567 ---28568 duration_ms: 5514.6770028569 ...28570ok 5595 pummel/test-webcrypto-kangarootwelve-32bit-overflow # skip only relevant when kMaxLength < 2^3228571 ---28572 duration_ms: 109.6820028573 ...28574ok 5596 pummel/test-worker-take-heapsnapshot28575 ---28576 duration_ms: 607.9270028577 ...28578ok 5597 pummel/test-zlib-zip-slow28579 ---28580 duration_ms: 13426.2950028581 ...28582ok 5598 abort/test-abort-backtrace28583 ---28584 duration_ms: 418.5690028585 ...28586ok 5599 abort/test-abort-fatal-error28587 ---28588 duration_ms: 515.1020028589 ...28590ok 5600 abort/test-abort-uncaught-exception28591 ---28592 duration_ms: 515.0580028593 ...28594ok 5601 abort/test-addon-register-signal-handler # skip binding not built yet28595 ---28596 duration_ms: 144.5310028597 ...28598ok 5602 abort/test-addon-uv-handle-leak # skip binding not built yet28599 ---28600 duration_ms: 143.3180028601 ...28602ok 5603 abort/test-http-parser-consume28603 ---28604 duration_ms: 515.8560028605 ...28606ok 5604 abort/test-process-abort-exitcode28607 ---28608 duration_ms: 416.8200028609 ...28610ok 5605 abort/test-signal-handler28611 ---28612 duration_ms: 416.6040028613 ...28614ok 5606 abort/test-worker-abort-uncaught-exception28615 ---28616 duration_ms: 517.3340028617 ...28618ok 5607 abort/test-zlib-invalid-internals-usage28619 ---28620 duration_ms: 417.7870028621 ...28622ok 5608 wpt/test-abort28623 ---28624 duration_ms: 2410.9010028625 ...28626ok 5609 wpt/test-atob28627 ---28628 duration_ms: 326.7110028629 ...28630ok 5610 wpt/test-blob28631 ---28632 duration_ms: 407.7360028633 ...28634ok 5611 wpt/test-broadcastchannel28635 ---28636 duration_ms: 327.7350028637 ...28638ok 5612 wpt/test-compression28639 ---28640 duration_ms: 1108.4650028641 ...28642ok 5613 wpt/test-console28643 ---28644 duration_ms: 409.1580028645 ...28646ok 5614 wpt/test-encoding28647 ---28648 duration_ms: 813.9340028649 ...28650ok 5615 wpt/test-events28651 ---28652 duration_ms: 326.3520028653 ...28654ok 5616 wpt/test-file28655 ---28656 duration_ms: 326.4480028657 ...28658ok 5617 wpt/test-hr-time28659 ---28660 duration_ms: 2310.4930028661 ...28662ok 5618 wpt/test-microtask-queuing28663 ---28664 duration_ms: 327.1210028665 ...28666ok 5619 wpt/test-performance-timeline28667 ---28668 duration_ms: 2409.5840028669 ...28670ok 5620 wpt/test-resource-timing28671 ---28672 duration_ms: 508.2810028673 ...28674ok 5621 wpt/test-streams28675 ---28676 duration_ms: 2712.5110028677 ...28678ok 5622 wpt/test-structured-clone28679 ---28680 duration_ms: 328.3860028681 ...28682ok 5623 wpt/test-timers28683 ---28684 duration_ms: 1108.6760028685 ...28686ok 5624 wpt/test-url # skip Different versions of Ada affect the WPT tests28687 ---28688 duration_ms: 109.4300028689 ...28690ok 5625 wpt/test-urlpattern28691 ---28692 duration_ms: 327.4890028693 ...28694ok 5626 wpt/test-wasm-jsapi28695 ---28696 duration_ms: 1108.0480028697 ...28698ok 5627 wpt/test-wasm-webapi28699 ---28700 duration_ms: 326.6360028701 ...28702ok 5628 wpt/test-web-locks28703 ---28704 duration_ms: 2710.2250028705 ...28706ok 5629 wpt/test-webcrypto28707 ---28708 duration_ms: 6051.5680028709 ...28710ok 5630 wpt/test-webidl28711 ---28712 duration_ms: 409.0040028713 ...28714ok 5631 wpt/test-webstorage28715 ---28716 duration_ms: 1908.7890028717 ...28718ok 5632 wpt/test-workers28719 ---28720 duration_ms: 807.8170028721 ...28722ok 5633 sequential/test-async-wrap-getasyncid28723 ---28724 duration_ms: 326.0120028725 ...28726ok 5634 sequential/test-buffer-creation-regression28727 ---28728 duration_ms: 109.2250028729 ...28730ok 5635 sequential/test-child-process-emfile28731 ---28732 duration_ms: 210.2240028733 ...28734ok 5636 sequential/test-child-process-execsync28735 ---28736 duration_ms: 807.5390028737 ...28738ok 5637 sequential/test-child-process-exit28739 ---28740 duration_ms: 606.9970028741 ...28742ok 5638 sequential/test-child-process-pass-fd28743 ---28744 duration_ms: 608.3890028745 ...28746ok 5639 sequential/test-cli-syntax-bad28747 ---28748 duration_ms: 707.6840028749 ...28750ok 5640 sequential/test-cli-syntax-file-not-found28751 ---28752 duration_ms: 210.3120028753 ...28754ok 5641 sequential/test-cli-syntax-good28755 ---28756 duration_ms: 210.4440028757 ...28758ok 5642 sequential/test-cli-syntax-require28759 ---28760 duration_ms: 407.8940028761 ...28762ok 5643 sequential/test-cluster-inspect-brk28763 ---28764 duration_ms: 168.7680028765 ...28766ok 5644 sequential/test-cluster-net-listen-ipv6only-none28767 ---28768 duration_ms: 261.6920028769 ...28770ok 5645 sequential/test-cluster-net-listen-ipv6only-rr28771 ---28772 duration_ms: 261.5620028773 ...28774ok 5646 sequential/test-cluster-port-reuse-between-workers28775 ---28776 duration_ms: 327.3580028777 ...28778ok 5647 sequential/test-cluster-send-handle-large-payload28779 ---28780 duration_ms: 210.3010028781 ...28782ok 5648 sequential/test-cpu-prof-default28783 ---28784 duration_ms: 1208.4660028785 ...28786ok 5649 sequential/test-cpu-prof-dir-absolute28787 ---28788 duration_ms: 1308.6350028789 ...28790ok 5650 sequential/test-cpu-prof-dir-and-name28791 ---28792 duration_ms: 1207.9590028793 ...28794ok 5651 sequential/test-cpu-prof-dir-relative28795 ---28796 duration_ms: 1308.5910028797 ...28798ok 5652 sequential/test-cpu-prof-drained28799 ---28800 duration_ms: 1408.2150028801 ...28802ok 5653 sequential/test-cpu-prof-exit28803 ---28804 duration_ms: 408.3760028805 ...28806ok 5654 sequential/test-cpu-prof-invalid-options28807 ---28808 duration_ms: 327.2190028809 ...28810ok 5655 sequential/test-cpu-prof-kill28811 ---28812 duration_ms: 407.7390028813 ...28814ok 5656 sequential/test-cpu-prof-name28815 ---28816 duration_ms: 3111.5440028817 ...28818ok 5657 sequential/test-cpu-prof-worker-argv28819 ---28820 duration_ms: 1809.4280028821 ...28822ok 5658 sequential/test-crypto-timing-safe-equal28823 ---28824 duration_ms: 136.2680028825 ...28826ok 5659 sequential/test-crypto-timing-safe-equal-fast28827 ---28828 duration_ms: 211.1710028829 ...28830ok 5660 sequential/test-debug-prompt28831 ---28832 duration_ms: 709.7410028833 ...28834ok 5661 sequential/test-debugger-custom-port28835 ---28836 duration_ms: 809.7030028837 ...28838ok 5662 sequential/test-debugger-debug-brk28839 ---28840 duration_ms: 262.1510028841 ...28842ok 5663 sequential/test-debugger-invalid-args28843 ---28844 duration_ms: 5415.6550028845 ...28846ok 5664 sequential/test-debugger-launch28847 ---28848 duration_ms: 909.7590028849 ...28850ok 5665 sequential/test-debugger-pid28851 ---28852 duration_ms: 508.2470028853 ...28854ok 5666 sequential/test-deprecation-flags28855 ---28856 duration_ms: 262.6180028857 ...28858ok 5667 sequential/test-dgram-bind-shared-ports28859 ---28860 duration_ms: 509.5860028861 ...28862ok 5668 sequential/test-dgram-implicit-bind-failure28863 ---28864 duration_ms: 170.3190028865 ...28866ok 5669 sequential/test-dgram-pingpong28867 ---28868 duration_ms: 170.4460028869 ...28870ok 5670 sequential/test-diagnostic-dir-cpu-prof28871 ---28872 duration_ms: 3314.1030028873 ...28874ok 5671 sequential/test-diagnostic-dir-heap-prof28875 ---28876 duration_ms: 1710.2950028877 ...28878ok 5672 sequential/test-dtls-interop-openssl-client # skip DTLS is not enabled28879 ---28880 duration_ms: 170.6380028881 ...28882ok 5673 sequential/test-dtls-interop-openssl-server # skip DTLS is not enabled28883 ---28884 duration_ms: 136.4910028885 ...28886ok 5674 sequential/test-error-serdes28887 ---28888 duration_ms: 170.1820028889 ...28890ok 5675 sequential/test-fs-opendir-recursive28891 ---28892 duration_ms: 263.1810028893 ...28894ok 5676 sequential/test-fs-readdir-recursive28895 ---28896 duration_ms: 212.0270028897 ...28898ok 5677 sequential/test-fs-stat-sync-overflow28899 ---28900 duration_ms: 327.8730028901 ...28902ok 5678 sequential/test-gc-http-client28903 ---28904 duration_ms: 1108.0710028905 ...28906ok 5679 sequential/test-gc-http-client-onerror28907 ---28908 duration_ms: 1108.1420028909 ...28910ok 5680 sequential/test-gc-http-client-timeout28911 ---28912 duration_ms: 608.1920028913 ...28914ok 5681 sequential/test-get-heapsnapshot-options28915 ---28916 duration_ms: 2310.7040028917 ...28918ok 5682 sequential/test-heapdump28919 ---28920 duration_ms: 808.7660028921 ...28922ok 5683 sequential/test-heapdump-flag28923 ---28924 duration_ms: 706.8530028925 ...28926ok 5684 sequential/test-heapdump-flag-custom-dir28927 ---28928 duration_ms: 707.5350028929 ...28930ok 5685 sequential/test-http-econnrefused28931 ---28932 duration_ms: 211.4790028933 ...28934ok 5686 sequential/test-http-keep-alive-large-write28935 ---28936 duration_ms: 210.4710028937 ...28938ok 5687 sequential/test-http-keepalive-maxsockets28939 ---28940 duration_ms: 508.9660028941 ...28942ok 5688 sequential/test-http-regr-gh-292828943 ---28944 duration_ms: 170.1150028945 ...28946ok 5689 sequential/test-http-server-keep-alive-timeout-slow-client-headers28947 ---28948 duration_ms: 2010.6980028949 ...28950ok 5690 sequential/test-http-server-keep-alive-timeout-slow-server28951 ---28952 duration_ms: 809.6020028953 ...28954ok 5691 sequential/test-http2-max-session-memory28955 ---28956 duration_ms: 169.3230028957 ...28958ok 5692 sequential/test-http2-ping-flood28959 ---28960 duration_ms: 210.4460028961 ...28962ok 5693 sequential/test-http2-settings-flood28963 ---28964 duration_ms: 210.1390028965 ...28966ok 5694 sequential/test-http2-timeout-large-write28967 ---28968 duration_ms: 2911.8330028969 ...28970ok 5695 sequential/test-http2-timeout-large-write-file28971 ---28972 duration_ms: 2913.1620028973 ...28974ok 5696 sequential/test-https-connect-localport28975 ---28976 duration_ms: 6317.4890028977 ...28978ok 5697 sequential/test-https-server-keep-alive-timeout28979 ---28980 duration_ms: 1910.9680028981 ...28982ok 5698 sequential/test-init28983 ---28984 duration_ms: 327.6400028985 ...28986ok 5699 sequential/test-inspector-network-resource28987 ---28988 duration_ms: 1912.3880028989 ...28990ok 5700 sequential/test-inspector-open-dispose28991 ---28992 duration_ms: 328.4350028993 ...28994ok 5701 sequential/test-inspector-port-cluster28995 ---28996 duration_ms: 710.0760028997 ...28998ok 5702 sequential/test-module-loading28999 ---29000 duration_ms: 212.3330029001 ...29002ok 5703 sequential/test-net-GH-550429003 ---29004 duration_ms: 609.9510029005 ...29006ok 5704 sequential/test-net-better-error-messages-port29007 ---29008 duration_ms: 169.9710029009 ...29010ok 5705 sequential/test-net-connect-econnrefused29011 ---29012 duration_ms: 263.4060029013 ...29014ok 5706 sequential/test-net-connect-handle-econnrefused29015 ---29016 duration_ms: 169.8160029017 ...29018ok 5707 sequential/test-net-connect-local-error29019 ---29020 duration_ms: 169.9640029021 ...29022ok 5708 sequential/test-net-listen-ipv6only29023 ---29024 duration_ms: 169.9280029025 ...29026ok 5709 sequential/test-net-listen-shared-ports29027 ---29028 duration_ms: 509.7330029029 ...29030ok 5710 sequential/test-net-localport29031 ---29032 duration_ms: 170.7440029033 ...29034ok 5711 sequential/test-net-reconnect-error29035 ---29036 duration_ms: 170.3690029037 ...29038ok 5712 sequential/test-net-response-size29039 ---29040 duration_ms: 1410.8760029041 ...29042ok 5713 sequential/test-net-server-address29043 ---29044 duration_ms: 170.3320029045 ...29046ok 5714 sequential/test-net-server-bind29047 ---29048 duration_ms: 328.3500029049 ...29050ok 5715 sequential/test-net-server-listen-ipv6-link-local29051 ---29052 duration_ms: 169.6930029053 ...29054ok 5716 sequential/test-next-tick-error-spin29055 ---29056 duration_ms: 326.4930029057 ...29058ok 5717 sequential/test-perf-hooks29059 ---29060 duration_ms: 1308.9870029061 ...29062ok 5718 sequential/test-performance-eventloopdelay29063 ---29064 duration_ms: 7319.8500029065 ...29066ok 5719 sequential/test-pipe29067 ---29068 duration_ms: 4415.5180029069 ...29070ok 5720 sequential/test-process-title29071 ---29072 duration_ms: 263.3940029073 ...29074ok 5721 sequential/test-process-warnings29075 ---29076 duration_ms: 263.4800029077 ...29078ok 5722 sequential/test-repl-timeout-throw29079 ---29080 duration_ms: 408.6870029081 ...29082ok 5723 sequential/test-require-cache-without-stat29083 ---29084 duration_ms: 170.5610029085 ...29086ok 5724 sequential/test-resolution-inspect-brk29087 ---29088 duration_ms: 211.4340029089 ...29090ok 5725 sequential/test-stream2-fs29091 ---29092 duration_ms: 169.4330029093 ...29094ok 5726 sequential/test-stream2-stderr-sync29095 ---29096 duration_ms: 328.1300029097 ...29098ok 5727 sequential/test-timers-block-eventloop29099 ---29100 duration_ms: 211.6050029101 ...29102ok 5728 sequential/test-timers-set-interval-excludes-callback-duration29103 ---29104 duration_ms: 610.0210029105 ...29106ok 5729 sequential/test-tls-connect29107 ---29108 duration_ms: 170.6230029109 ...29110ok 5730 sequential/test-tls-lookup29111 ---29112 duration_ms: 170.5850029113 ...29114ok 5731 sequential/test-tls-psk-client # skip missing openssl cli29115 ---29116 duration_ms: 169.9680029117 ...29118ok 5732 sequential/test-tls-session-timeout # skip node compiled without OpenSSL CLI.29119 ---29120 duration_ms: 170.3310029121 ...29122ok 5733 sequential/test-util-debug29123 ---29124 duration_ms: 608.6360029125 ...29126ok 5734 sequential/test-vm-break-on-sigint29127 ---29128 duration_ms: 263.3440029129 ...29130ok 5735 sequential/test-vm-timeout-escape-promise-module-229131 ---29132 duration_ms: 170.0560029133 ...29134ok 5736 sequential/test-vm-timeout-rethrow29135 ---29136 duration_ms: 328.6520029137 ...29138ok 5737 sequential/test-watch-mode-restart-esm-loading-error29139 ---29140 duration_ms: 2412.0330029141 ...29142ok 5738 sequential/test-watch-mode-watch-flags29143 ---29144 duration_ms: 609.1530029145 ...29146ok 5739 sequential/test-watch-mode-worker29147 ---29148 duration_ms: 3111.0210029149 ...29150ok 5740 sequential/test-without-async-context-frame29151 ---29152 duration_ms: 1610.6470029153 ...29154ok 5741 sequential/test-worker-eventlooputil29155 ---29156 duration_ms: 327.9710029157 ...29158ok 5742 sequential/test-worker-fshandles-error-on-termination29159 ---29160 duration_ms: 407.8420029161 ...29162ok 5743 sequential/test-worker-fshandles-open-close-on-termination29163 ---29164 duration_ms: 407.6840029165 ...29166ok 5744 sequential/test-worker-heapsnapshot-options29167 ---29168 duration_ms: 808.6720029169 ...29170ok 5745 sequential/test-worker-prof29171 ---29172 duration_ms: 2009.3450029173 ...29174ok 5746 sequential/test-write-heapsnapshot-options29175 ---29176 duration_ms: 2209.9580029177 ...29178ok 5747 sequential/test-zlib-crc32-fast-api29179 ---29180 duration_ms: 211.0540029181 ...29182ok 5748 known_issues/test-cli-print-var-crypto29183 ---29184 duration_ms: 328.2870029185 ...29186ok 5749 known_issues/test-cwd-enoent-file29187 ---29188 duration_ms: 263.1920029189 ...29190ok 5750 known_issues/test-dgram-bind-shared-ports-after-port-029191 ---29192 duration_ms: 408.8000029193 ...29194ok 5751 known_issues/test-fs-cp-async-buffer29195 ---29196 duration_ms: 136.9340029197 ...29198ok 5752 known_issues/test-fs-cp-filter29199 ---29200 duration_ms: 108.7910029201 ...29202ok 5753 known_issues/test-fs-cp-non-utf829203 ---29204 duration_ms: 168.3830029205 ...29206ok 5754 known_issues/test-fs-writeFileSync-invalid-windows29207 ---29208 duration_ms: 136.5710029209 ...29210ok 5755 known_issues/test-http-clientrequest-end-contentlength29211 ---29212 duration_ms: 211.0750029213 ...29214ok 5756 known_issues/test-http-clientrequest-end-empty-response-body29215 ---29216 duration_ms: 135.8090029217 ...29218ok 5757 known_issues/test-http-clientrequest-write-chunked29219 ---29220 duration_ms: 169.8460029221 ...29222ok 5758 known_issues/test-http-path-contains-unicode29223 ---29224 duration_ms: 136.5210029225 ...29226ok 5759 known_issues/test-inspector-cluster-port-clash29227 ---29228 duration_ms: 327.8520029229 ...29230ok 5760 known_issues/test-inspector-instrumentation-breakpoint29231 ---29232 duration_ms: 15428.6430029233 ...29234ok 5761 known_issues/test-repl-require-context29235 ---29236 duration_ms: 211.8300029237 ...29238ok 5762 known_issues/test-stdin-is-always-net.socket29239 ---29240 duration_ms: 327.9880029241 ...29242ok 5763 known_issues/test-stream-writable-sync-error29243 ---29244 duration_ms: 169.8930029245 ...29246ok 5764 known_issues/test-url-parse-conformance29247 ---29248 duration_ms: 211.8100029249 ...29250ok 5765 known_issues/test-vm-function-declaration-uses-define29251 ---29252 duration_ms: 170.3840029253 ...29254ok 5766 known_issues/test-vm-timeout-escape-nexttick29255 ---29256 duration_ms: 909.7220029257 ...29258ok 5767 wasm-allocation/test-wasm-allocation29259 ---29260 duration_ms: 178.5860029261 ...29262ok 5768 wasm-allocation/test-wasm-allocation-auto-adapt29263 ---29264 duration_ms: 178.8710029265 ...29266ok 5769 wasm-allocation/test-wasm-allocation-disable-trap-handler29267 ---29268 duration_ms: 144.7030029269 ...29270ok 5770 wasm-allocation/test-wasm-allocation-memory6429271 ---29272 duration_ms: 178.3440029273 ...2927429275Failed tests:29276out/Release/node /build/node-v26.9.0/test/parallel/test-fs-cp-async-file-modes.mjs29277make: *** [Makefile:631: test-ci-js] Error 1