nodejs-slim-26.9.0
checks.x86_64-linux.pkgs-hermes-desktop
· build #5011
· raw
1structuredAttrs is enabled
unpackPhase
2unpacking source archive /nix/store/7ajvk1c4mspigbdgf21bn9d7f7p9kmgk-node-v26.9.0.tar.xz3source root is node-v26.9.04setting SOURCE_DATE_EPOCH to timestamp 1789550914 of file "node-v26.9.0/tools/nix/v8.nix"patchPhase
5applying patch /nix/store/j4p9lc7z8hi4g40cpqpj3qxb9a7bvanp-configure-armv6-vfpv2.patch6patching file configure.py7Hunk #1 succeeded at 49 with fuzz 1 (offset -1 lines).8applying patch /nix/store/igz0qnjkvwi4f2mn7i13h3ndxl9n5ryi-node-npm-build-npm-package-logic.patch9patching file deps/npm/node_modules/@npmcli/run-script/lib/set-path.js10Hunk #1 succeeded at 13 with fuzz 2 (offset 1 line).11Hunk #2 succeeded at 37 (offset 8 lines).12patching file deps/npm/node_modules/pacote/lib/git.js13Hunk #1 succeeded at 186 (offset -2 lines).14patching file deps/npm/node_modules/@npmcli/arborist/lib/arborist/build-ideal-tree.js15Hunk #1 succeeded at 802 (offset 62 lines).16patching file deps/npm/node_modules/@npmcli/arborist/lib/arborist/load-actual.js17Hunk #1 succeeded at 121 with fuzz 1 (offset -26 lines).18applying patch /nix/store/57n0csr7hpdd0y91ljxpiwlfw7fsx3kl-use-correct-env-in-tests.patch19patching file test/parallel/test-child-process-default-options.js20patching file test/parallel/test-child-process-env.js21patching file test/parallel/test-child-process-exec-env.js22applying patch /nix/store/p2mhv95s89kaqmdynhz6y6asalf8y4dh-bin-sh-node-run-v22.patch23patching file test/fixtures/run-script/node_modules/.bin/positional-args24Hunk #1 succeeded at 1 with fuzz 1.25applying patch /nix/store/3za8p3x3hjfr1a9b1lc3z4aapp9sm2ja-use-nix-codesign.patch26patching file test/parallel/test-macos-app-sandbox.js27applying patch /nix/store/6whc7i794ygkcwjwrprw7y9aglfl238g-fix-temporal-integration-with-shared-icu.patch28patching file deps/v8/src/objects/js-temporal-zoneinfo64.cc29patching file tools/v8_gypfiles/v8.gyp30Hunk #1 succeeded at 1398 (offset 19 lines).31Hunk #2 succeeded at 2051 (offset 93 lines).updateAutotoolsGnuConfigScriptsPhase
32Updating Autotools / GNU config script to a newer upstream version: ./deps/ngtcp2/ngtcp2/third-party/libev/config.sub33Updating Autotools / GNU config script to a newer upstream version: ./deps/cares/config/config.sub34Updating Autotools / GNU config script to a newer upstream version: ./deps/libffi/config.sub35Updating Autotools / GNU config script to a newer upstream version: ./deps/ngtcp2/ngtcp2/third-party/libev/config.guess36Updating Autotools / GNU config script to a newer upstream version: ./deps/cares/config/config.guess37Updating Autotools / GNU config script to a newer upstream version: ./deps/libffi/config.guessconfigurePhase
38fixing libtool script ./deps/ngtcp2/ngtcp2/third-party/libev/ltmain.sh39fixing libtool script ./deps/cares/config/ltmain.sh40fixing libtool script ./deps/libffi/ltmain.sh41./deps/ngtcp2/ngtcp2/third-party/libev/configure42./deps/cares/configure43./deps/libffi/configure44configure flags: --prefix=/nix/store/mn8r5sjblqmigxv5lg89q4wcj5zqb16n-nodejs-slim-26.9.0 --ninja --with-intl=system-icu --openssl-use-def-ca-store --no-cross-compiling --dest-os=linux --dest-cpu=x64 --v8-enable-temporal-support --use-prefix-to-find-headers --shared-abseil --shared-abseil-libpath=/nix/store/iqvb7h1ykhm12304qwx17xbncrhhy1g4-abseil-cpp-20260107.1/lib --shared-ada --shared-ada-libpath=/nix/store/vk3yq4nzlrdvq1qxgy3764qaycanr0mc-ada-4.0.0/lib --shared-brotli --shared-brotli-libpath=/nix/store/xhgd6rb4h8ssid9yw8nvw74cwq69md5y-brotli-1.2.0-lib/lib --shared-cares --shared-cares-libpath=/nix/store/68syfccdbv3hlz7imlc9xl9fzyz4v8gx-c-ares-1.34.8/lib --shared-ffi --shared-ffi-libpath=/nix/store/3r5wfb1dl3sfknvy1yringvmap0hxj4r-libffi-3.8.0/lib --shared-gtest --shared-gtest-libpath=/nix/store/5sdsmm8s00hck28yp95fk993rg42mqsp-gtest-1.18.0/lib --shared-hdr-histogram --shared-hdr-histogram-libpath=/nix/store/9g532g9jf92xy9xh68p99ml815q11zs0-hdrhistogram_c-0.11.10/lib --shared-highway --shared-highway-libpath=/nix/store/xs1jbkdzxs4ym0rh89nx8xfwj387x3aj-libhwy-1.4.0/lib --shared-http-parser --shared-http-parser-libpath=/nix/store/1lw7d9jsv7qb6nvc4fmvvqsyphaacqcs-llhttp-9.4.3/lib --shared-libuv --shared-libuv-libpath=/nix/store/68b1blnvl4scgdq48d4p7h4lw4pm5w0w-libuv-1.52.1/lib --shared-lief --shared-lief-libpath=/nix/store/nx4g3j20wvgq36b406q6rysvqzzrxaci-lief-0.17.6/lib --shared-merve --shared-merve-libpath=/nix/store/2gj58j8rd88kaan7bsqhl9fjxxp11qqi-merve-1.2.2/lib --shared-nbytes --shared-nbytes-libpath=/nix/store/zf8c839ahp1fn736lih7ai2y14rrx2gn-nbytes-0.1.4/lib --shared-nghttp2 --shared-nghttp2-libpath=/nix/store/6avzrsm02jh7q48ym3hgznj3ypc2shc2-nghttp2-1.70.0-lib/lib --shared-nghttp3 --shared-nghttp3-libpath=/nix/store/dki4fkk75v2x4aqkszmi257wxq6rkkyr-nghttp3-1.16.0/lib --shared-ngtcp2 --shared-ngtcp2-libpath=/nix/store/2hc131frgdz45bjbajmpvlrj185lah7p-ngtcp2-1.23.0/lib --shared-openssl --shared-openssl-libpath=/nix/store/yj34vymbqf7mf4lmffipy8jqc4kwr1mc-openssl-3.6.4/lib --shared-simdjson --shared-simdjson-libpath=/nix/store/129shchmqszagbb0m8kk7ddzb7nnklxv-simdjson-4.6.8/lib --shared-simdutf --shared-simdutf-libpath=/nix/store/dw6xlar7m4qfrhbk63zhcc5pmixa1ga1-simdutf-9.1.0/lib --shared-sqlite --shared-sqlite-libpath=/nix/store/7a0nx1a0rdc5s07vxrsdhplqnzncl5z9-sqlite-3.53.3/lib --shared-temporal_capi --shared-temporal_capi-libpath=/nix/store/7hrx4vyx67h46xxwqj3zw4nafa1m8d04-temporal_capi-0.2.6/lib --shared-uvwasi --shared-uvwasi-libpath=/nix/store/qnbgx63w8yya5330xcxyixja3ah6gfzm-uvwasi-0.0.23/lib --shared-zlib --shared-zlib-libpath=/nix/store/lw86vj9kfwgvlivg3p8qg2nibpmhmsl9-zlib-1.3.2/lib --shared-zstd --shared-zstd-libpath=/nix/store/8ik1d1r4l2jzm9mjh6bc0a13yczx62wg-zstd-1.5.7/lib45INFO: configure completed successfullybuildPhase
46build flags: -j48 SHELL=/nix/store/svx59425zxp552p2b8gm11qj5r09b56i-bash-5.3p15/bin/bash47TERM=dumb ninja -C out/Release -j4848ninja: Entering directory `out/Release'49[1/1871] CXX obj/deps/v8/src/base/v8_libbase.fpu.o50[2/1871] CXX obj/deps/v8/src/base/v8_libbase.vlq-base64.o51[3/1871] CXX obj/deps/v8/src/base/v8_libbase.sys-info.o52[4/1871] CXX obj/deps/v8/src/base/v8_libbase.bits.o53[5/1871] CXX obj/deps/v8/src/base/v8_libbase.abort-mode.o54[6/1871] CXX obj/deps/v8/src/base/v8_libbase.once.o55[7/1871] CXX obj/deps/v8/src/base/v8_libbase.division-by-constant.o56[8/1871] CXX obj/deps/v8/src/base/numbers/v8_libbase.diy-fp.o57[9/1871] CXX obj/deps/v8/src/base/v8_libbase.cpu.o58[10/1871] CXX obj/deps/v8/src/base/debug/v8_libbase.stack_trace.o59[11/1871] CXX obj/deps/v8/src/base/numbers/v8_libbase.cached-powers.o60[12/1871] CXX obj/deps/v8/src/base/platform/v8_libbase.semaphore.o61[13/1871] CXX obj/deps/v8/src/base/platform/v8_libbase.platform.o62[14/1871] CXX obj/deps/v8/src/base/platform/v8_libbase.platform-posix-time.o63[15/1871] CXX obj/deps/v8/src/base/numbers/v8_libbase.dtoa.o64[16/1871] CXX obj/deps/v8/src/base/v8_libbase.strings.o65[17/1871] CXX obj/deps/v8/src/base/sanitizer/v8_libbase.lsan-page-allocator.o66[18/1871] CXX obj/deps/v8/src/base/v8_libbase.file-utils.o67[19/1871] CXX obj/deps/v8/src/base/platform/v8_libbase.memory-protection-key.o68[20/1871] CXX obj/deps/v8/src/base/sanitizer/v8_libbase.lsan-virtual-address-space.o69[21/1871] CXX obj/deps/v8/src/base/numbers/v8_libbase.bignum-dtoa.o70[22/1871] CXX obj/deps/v8/src/base/v8_libbase.page-allocator.o71[23/1871] CXX obj/deps/v8/src/base/v8_libbase.region-allocator.o72[24/1871] CXX obj/deps/v8/src/base/numbers/v8_libbase.fixed-dtoa.o73[25/1871] CXX obj/deps/v8/src/base/numbers/v8_libbase.bignum.o74[26/1871] CXX obj/deps/v8/src/base/numbers/v8_libbase.strtod.o75[27/1871] ACTION Checking inspector protocol compatibility76[28/1871] ACTION Generating temporal zoneinfo static data77[29/1871] CXX obj/deps/v8/src/base/numbers/v8_libbase.fast-dtoa.o78[30/1871] CC obj/deps/v8/third_party/zlib/v8_zlib.cpu_features.o79cc1: warning: command-line option '-fvisibility-inlines-hidden' is valid for C++/ObjC++ but not for C80[31/1871] CXX obj/deps/v8/src/base/debug/v8_libbase.stack_trace_posix.o81[32/1871] CC obj/deps/v8/third_party/zlib/v8_zlib.compress.o82cc1: warning: command-line option '-fvisibility-inlines-hidden' is valid for C++/ObjC++ but not for C83[33/1871] CC obj/deps/v8/third_party/zlib/v8_zlib.adler32.o84cc1: warning: command-line option '-fvisibility-inlines-hidden' is valid for C++/ObjC++ but not for C85[34/1871] CC obj/deps/v8/third_party/zlib/v8_zlib.gzclose.o86cc1: warning: command-line option '-fvisibility-inlines-hidden' is valid for C++/ObjC++ but not for C87[35/1871] CXX obj/deps/v8/src/base/platform/v8_libbase.platform-linux.o88[36/1871] CC obj/deps/v8/third_party/zlib/v8_zlib.gzlib.o89cc1: warning: command-line option '-fvisibility-inlines-hidden' is valid for C++/ObjC++ but not for C90[37/1871] CC obj/deps/v8/third_party/zlib/v8_zlib.crc32.o91cc1: warning: command-line option '-fvisibility-inlines-hidden' is valid for C++/ObjC++ but not for C92[38/1871] CXX obj/deps/v8/src/base/v8_libbase.ieee754.o93[39/1871] CC obj/deps/v8/third_party/zlib/v8_zlib.gzwrite.o94cc1: warning: command-line option '-fvisibility-inlines-hidden' is valid for C++/ObjC++ but not for C95[40/1871] CC obj/deps/v8/third_party/zlib/v8_zlib.uncompr.o96cc1: warning: command-line option '-fvisibility-inlines-hidden' is valid for C++/ObjC++ but not for C97[41/1871] ACTION Generating inspector protocol sources from protocol json98[42/1871] STAMP obj/tools/v8_gypfiles/v8_inspector_headers.actions_rules_copies.stamp99[43/1871] CC obj/deps/v8/third_party/zlib/v8_zlib.inftrees.o100cc1: warning: command-line option '-fvisibility-inlines-hidden' is valid for C++/ObjC++ but not for C101[44/1871] CC obj/deps/v8/third_party/zlib/v8_zlib.inffast.o102cc1: warning: command-line option '-fvisibility-inlines-hidden' is valid for C++/ObjC++ but not for C103[45/1871] CC obj/deps/v8/third_party/zlib/v8_zlib.zutil.o104cc1: warning: command-line option '-fvisibility-inlines-hidden' is valid for C++/ObjC++ but not for C105[46/1871] CC obj/deps/v8/third_party/zlib/v8_zlib.infback.o106cc1: warning: command-line option '-fvisibility-inlines-hidden' is valid for C++/ObjC++ but not for C107[47/1871] CC obj/deps/v8/third_party/zlib/v8_zlib.gzread.o108cc1: warning: command-line option '-fvisibility-inlines-hidden' is valid for C++/ObjC++ but not for C109[48/1871] CXX obj/deps/v8/third_party/zlib/google/v8_zlib.compression_utils_portable.o110[49/1871] CXX obj/deps/v8/src/base/platform/v8_libbase.condition-variable.o111[50/1871] CXX obj/deps/v8/src/base/platform/v8_libbase.time.o112[51/1871] CXX obj/deps/v8/src/base/platform/v8_libbase.mutex.o113[52/1871] CXX obj/deps/v8/src/base/v8_libbase.logging.o114[53/1871] CC obj/deps/v8/third_party/zlib/v8_zlib.deflate.o115cc1: warning: command-line option '-fvisibility-inlines-hidden' is valid for C++/ObjC++ but not for C116[54/1871] CC obj/deps/v8/third_party/zlib/v8_zlib.trees.o117cc1: warning: command-line option '-fvisibility-inlines-hidden' is valid for C++/ObjC++ but not for C118[55/1871] CXX obj/deps/v8/src/base/utils/v8_libbase.random-number-generator.o119[56/1871] CXX obj/deps/v8/src/base/v8_libbase.virtual-address-space.o120[57/1871] CXX obj/deps/v8/src/base/v8_libbase.bounded-page-allocator.o121[58/1871] CXX obj/deps/v8/src/interpreter/bytecode_builtins_list_generator.bytecode-operands.o122[59/1871] CXX obj/deps/v8/src/base/v8_libbase.emulated-virtual-address-subspace.o123[60/1871] CXX obj/deps/v8/src/base/v8_libbase.virtual-address-space-page-allocator.o124[61/1871] CXX obj/deps/v8/src/base/platform/v8_libbase.platform-posix.o125[62/1871] AR obj/tools/v8_gypfiles/libv8_libbase.a126[63/1871] STAMP obj/tools/v8_gypfiles/v8_flags.actions_depends.stamp127[64/1871] CXX obj/deps/v8/src/regexp/gen-regexp-special-case.gen-regexp-special-case.o128[65/1871] CXX obj/deps/v8/src/torque/torque_base.source-positions.o129[66/1871] CXX obj/deps/v8/src/builtins/bytecode_builtins_list_generator.generate-bytecodes-builtins-list.o130[67/1871] CC obj/deps/v8/third_party/zlib/v8_zlib.inflate.o131cc1: warning: command-line option '-fvisibility-inlines-hidden' is valid for C++/ObjC++ but not for C132[68/1871] CXX obj/deps/v8/src/interpreter/bytecode_builtins_list_generator.bytecodes.o133[69/1871] AR obj/tools/v8_gypfiles/libv8_zlib.a134[70/1871] CXX obj/deps/v8/src/torque/torque_base.cpp-builder.o135[71/1871] CXX obj/deps/v8/src/libplatform/v8_libplatform.default-thread-isolated-allocator.o136[72/1871] CXX obj/src/node_js2c.embedded_data.o137[73/1871] CXX obj/src/node_js2c.builtin_info.o138[74/1871] LINK gen-regexp-special-case139[75/1871] CXX obj/deps/v8/src/libplatform/tracing/v8_libplatform.trace-config.o140[76/1871] CXX obj/deps/v8/src/libplatform/tracing/v8_libplatform.trace-object.o141[77/1871] ACTION run_gen-regexp-special-case: run_gen-regexp-special-case_action_72d03329d19e24c609ee6e65eeeb110034e9261c37b8a8d83522628d574e9fa7142[78/1871] LINK bytecode_builtins_list_generator143[79/1871] CXX obj/deps/v8/src/torque/torque_base.declarable.o144[80/1871] CC obj/test/overlapped-checker/overlapped-checker.main_unix.o145[81/1871] CXX obj/deps/inspector_protocol/crdtp/crdtp.json_platform.o146[82/1871] CC obj/test/nop/nop.nop.o147[83/1871] ACTION generate_bytecode_builtins_list: generate_bytecode_builtins_list_action_73a03d1964edbe79fc19deb968fa21d5c456544c3d095b62158c8959ed2aeed1148[84/1871] CXX obj/deps/v8/src/torque/torque_base.type-inference.o149[85/1871] CXX obj/deps/v8/src/libplatform/tracing/v8_libplatform.trace-writer.o150[86/1871] CXX obj/deps/ncrypto/ncrypto_engine.engine.o151[87/1871] AR obj/deps/ncrypto/libncrypto_engine.a152[88/1871] CXX obj/deps/inspector_protocol/crdtp/crdtp.error_support.o153[89/1871] CXX obj/deps/inspector_protocol/crdtp/crdtp.span.o154[90/1871] CXX obj/deps/v8/src/torque/torque_base.torque-code-generator.o155[91/1871] LINK overlapped-checker156[92/1871] LINK nop157[93/1871] CXX obj/deps/inspector_protocol/crdtp/crdtp.serializable.o158[94/1871] CXX obj/deps/v8/src/torque/torque_base.global-context.o159[95/1871] CXX obj/deps/v8/src/libplatform/v8_libplatform.default-job.o160[96/1871] CXX obj/deps/v8/src/libplatform/tracing/v8_libplatform.trace-buffer.o161[97/1871] CXX obj/deps/v8/src/libplatform/v8_libplatform.task-queue.o162[98/1871] CXX obj/deps/inspector_protocol/crdtp/crdtp.status.o163[99/1871] CXX obj/deps/v8/src/libplatform/v8_libplatform.default-worker-threads-task-runner.o164[100/1871] CXX obj/deps/v8/src/torque/torque_base.type-oracle.o165[101/1871] CXX obj/deps/v8/src/libplatform/v8_libplatform.worker-thread.o166[102/1871] CXX obj/deps/v8/src/libplatform/v8_libplatform.delayed-task-queue.o167[103/1871] CXX obj/deps/v8/src/torque/torque_base.utils.o168[104/1871] CXX obj/deps/inspector_protocol/crdtp/crdtp.cbor.o169[105/1871] CXX obj/deps/v8/src/libplatform/v8_libplatform.default-platform.o170[106/1871] CXX obj/deps/inspector_protocol/crdtp/crdtp.protocol_core.o171[107/1871] CXX obj/deps/v8/src/torque/torque_base.server-data.o172[108/1871] CXX obj/deps/v8/src/libplatform/tracing/v8_libplatform.tracing-controller.o173[109/1871] CXX obj/deps/v8/src/libplatform/v8_libplatform.default-foreground-task-runner.o174[110/1871] AR obj/tools/v8_gypfiles/libv8_libplatform.a175[111/1871] CXX obj/deps/v8/src/torque/torque_base.kythe-data.o176[112/1871] CXX obj/deps/v8/src/torque/torque_base.earley-parser.o177[113/1871] CXX obj/deps/v8/src/torque/torque_base.cfg.o178[114/1871] CXX obj/deps/inspector_protocol/crdtp/crdtp.dispatch.o179[115/1871] CXX obj/deps/v8/src/torque/torque_base.class-debug-reader-generator.o180[116/1871] CXX obj/deps/v8/src/torque/torque_base.cc-generator.o181[117/1871] CXX obj/deps/v8/src/torque/torque_base.instance-type-generator.o182[118/1871] CXX obj/deps/v8/src/torque/torque.torque.o183[119/1871] CXX obj/tools/node_js2c.js2c.o184[120/1871] CXX obj/deps/v8/src/torque/torque_base.declarations.o185[121/1871] CXX obj/deps/v8/src/torque/torque_base.csa-generator.o186[122/1871] CXX obj/deps/inspector_protocol/crdtp/crdtp.json.o187[123/1871] AR obj/deps/inspector_protocol/libcrdtp.a188[124/1871] LINK node_js2c189[125/1871] STAMP obj/node_base.actions_depends.stamp190[126/1871] ACTION node_base: convert_node_protocol_to_json_f26a10641803f604d1307d23f68bde8b450ad8f073bd43313642df31e7a3478c191[127/1871] CXX obj/deps/v8/src/torque/torque_base.declaration-visitor.o192[128/1871] ACTION node_base: node_js2c_f26a10641803f604d1307d23f68bde8b450ad8f073bd43313642df31e7a3478c193[129/1871] ACTION node_base: concatenate_protocols_f26a10641803f604d1307d23f68bde8b450ad8f073bd43313642df31e7a3478c194[130/1871] ACTION node_base: v8_inspector_compress_protocol_json_f26a10641803f604d1307d23f68bde8b450ad8f073bd43313642df31e7a3478c195[131/1871] ACTION Generating node protocol sources from protocol json196[132/1871] STAMP obj/node_base.actions_rules_copies.stamp197[133/1871] CXX obj/deps/v8/src/torque/torque_base.torque-compiler.o198[134/1871] CXX obj/deps/v8/src/torque/torque_base.instructions.o199[135/1871] CXX obj/src/node_base.embedded_data.o200[136/1871] CXX obj/src/node_base.builtin_info.o201[137/1871] CXX obj/deps/v8/src/torque/torque_base.type-visitor.o202[138/1871] CXX obj/src/api/node_base.utils.o203[139/1871] CXX obj/gen/src/node/inspector/protocol/node_base.IO.o204In file included from ../../src/util.h:29,205 from ../../src/inspector/node_string.h:10,206 from gen/src/node/inspector/protocol/Forward.h:19,207 from gen/src/node/inspector/protocol/Protocol.h:18,208 from gen/src/node/inspector/protocol/IO.h:10,209 from gen/src/node/inspector/protocol/IO.cpp:7:210../../deps/v8/include/v8-profiler.h: In constructor 'v8::HeapProfiler::HeapSnapshotOptions::HeapSnapshotOptions()':211../../deps/v8/include/v8-profiler.h:1128:27: warning: 'v8::HeapProfiler::HeapSnapshotOptions::global_object_name_resolver' is deprecated: Use context_name_resolver callback instead. [-Wdeprecated-declarations]212 1128 | HeapSnapshotOptions() {}213 | ^214../../deps/v8/include/v8-profiler.h:1142:25: note: declared here215 1142 | ObjectNameResolver* global_object_name_resolver = nullptr;216 | ^~~~~~~~~~~~~~~~~~~~~~~~~~~217../../deps/v8/include/v8-profiler.h:1128:27: warning: 'v8::HeapProfiler::HeapSnapshotOptions::global_object_name_resolver' is deprecated: Use context_name_resolver callback instead. [-Wdeprecated-declarations]218 1128 | HeapSnapshotOptions() {}219 | ^220../../deps/v8/include/v8-profiler.h:1142:25: note: declared here221 1142 | ObjectNameResolver* global_object_name_resolver = nullptr;222 | ^~~~~~~~~~~~~~~~~~~~~~~~~~~223[140/1871] CXX obj/deps/ncrypto/ncrypto.ncrypto.o224[141/1871] CXX obj/src/node_base.json_utils.o225[142/1871] CXX obj/src/node_base.internal_only_v8.o226In file included from ../../src/util.h:29,227 from ../../src/util-inl.h:33,228 from ../../src/internal_only_v8.cc:3:229../../deps/v8/include/v8-profiler.h: In constructor 'v8::HeapProfiler::HeapSnapshotOptions::HeapSnapshotOptions()':230../../deps/v8/include/v8-profiler.h:1128:27: warning: 'v8::HeapProfiler::HeapSnapshotOptions::global_object_name_resolver' is deprecated: Use context_name_resolver callback instead. [-Wdeprecated-declarations]231 1128 | HeapSnapshotOptions() {}232 | ^233../../deps/v8/include/v8-profiler.h:1142:25: note: declared here234 1142 | ObjectNameResolver* global_object_name_resolver = nullptr;235 | ^~~~~~~~~~~~~~~~~~~~~~~~~~~236../../deps/v8/include/v8-profiler.h:1128:27: warning: 'v8::HeapProfiler::HeapSnapshotOptions::global_object_name_resolver' is deprecated: Use context_name_resolver callback instead. [-Wdeprecated-declarations]237 1128 | HeapSnapshotOptions() {}238 | ^239../../deps/v8/include/v8-profiler.h:1142:25: note: declared here240 1142 | ObjectNameResolver* global_object_name_resolver = nullptr;241 | ^~~~~~~~~~~~~~~~~~~~~~~~~~~242[143/1871] CXX obj/gen/src/node/inspector/protocol/node_base.NodeRuntime.o243In file included from ../../src/util.h:29,244 from ../../src/inspector/node_string.h:10,245 from gen/src/node/inspector/protocol/Forward.h:19,246 from gen/src/node/inspector/protocol/Protocol.h:18,247 from gen/src/node/inspector/protocol/NodeRuntime.h:10,248 from gen/src/node/inspector/protocol/NodeRuntime.cpp:7:249../../deps/v8/include/v8-profiler.h: In constructor 'v8::HeapProfiler::HeapSnapshotOptions::HeapSnapshotOptions()':250../../deps/v8/include/v8-profiler.h:1128:27: warning: 'v8::HeapProfiler::HeapSnapshotOptions::global_object_name_resolver' is deprecated: Use context_name_resolver callback instead. [-Wdeprecated-declarations]251 1128 | HeapSnapshotOptions() {}252 | ^253../../deps/v8/include/v8-profiler.h:1142:25: note: declared here254 1142 | ObjectNameResolver* global_object_name_resolver = nullptr;255 | ^~~~~~~~~~~~~~~~~~~~~~~~~~~256../../deps/v8/include/v8-profiler.h:1128:27: warning: 'v8::HeapProfiler::HeapSnapshotOptions::global_object_name_resolver' is deprecated: Use context_name_resolver callback instead. [-Wdeprecated-declarations]257 1128 | HeapSnapshotOptions() {}258 | ^259../../deps/v8/include/v8-profiler.h:1142:25: note: declared here260 1142 | ObjectNameResolver* global_object_name_resolver = nullptr;261 | ^~~~~~~~~~~~~~~~~~~~~~~~~~~262[144/1871] CXX obj/gen/src/node/inspector/protocol/node_base.Target.o263In file included from ../../src/util.h:29,264 from ../../src/inspector/node_string.h:10,265 from gen/src/node/inspector/protocol/Forward.h:19,266 from gen/src/node/inspector/protocol/Protocol.h:18,267 from gen/src/node/inspector/protocol/Target.h:10,268 from gen/src/node/inspector/protocol/Target.cpp:7:269../../deps/v8/include/v8-profiler.h: In constructor 'v8::HeapProfiler::HeapSnapshotOptions::HeapSnapshotOptions()':270../../deps/v8/include/v8-profiler.h:1128:27: warning: 'v8::HeapProfiler::HeapSnapshotOptions::global_object_name_resolver' is deprecated: Use context_name_resolver callback instead. [-Wdeprecated-declarations]271 1128 | HeapSnapshotOptions() {}272 | ^273../../deps/v8/include/v8-profiler.h:1142:25: note: declared here274 1142 | ObjectNameResolver* global_object_name_resolver = nullptr;275 | ^~~~~~~~~~~~~~~~~~~~~~~~~~~276../../deps/v8/include/v8-profiler.h:1128:27: warning: 'v8::HeapProfiler::HeapSnapshotOptions::global_object_name_resolver' is deprecated: Use context_name_resolver callback instead. [-Wdeprecated-declarations]277 1128 | HeapSnapshotOptions() {}278 | ^279../../deps/v8/include/v8-profiler.h:1142:25: note: declared here280 1142 | ObjectNameResolver* global_object_name_resolver = nullptr;281 | ^~~~~~~~~~~~~~~~~~~~~~~~~~~282[145/1871] CXX obj/gen/src/node/inspector/protocol/node_base.Protocol.o283In file included from ../../src/util.h:29,284 from ../../src/inspector/node_string.h:10,285 from gen/src/node/inspector/protocol/Forward.h:19,286 from gen/src/node/inspector/protocol/Protocol.h:18,287 from gen/src/node/inspector/protocol/Protocol.cpp:7:288../../deps/v8/include/v8-profiler.h: In constructor 'v8::HeapProfiler::HeapSnapshotOptions::HeapSnapshotOptions()':289../../deps/v8/include/v8-profiler.h:1128:27: warning: 'v8::HeapProfiler::HeapSnapshotOptions::global_object_name_resolver' is deprecated: Use context_name_resolver callback instead. [-Wdeprecated-declarations]290 1128 | HeapSnapshotOptions() {}291 | ^292../../deps/v8/include/v8-profiler.h:1142:25: note: declared here293 1142 | ObjectNameResolver* global_object_name_resolver = nullptr;294 | ^~~~~~~~~~~~~~~~~~~~~~~~~~~295../../deps/v8/include/v8-profiler.h:1128:27: warning: 'v8::HeapProfiler::HeapSnapshotOptions::global_object_name_resolver' is deprecated: Use context_name_resolver callback instead. [-Wdeprecated-declarations]296 1128 | HeapSnapshotOptions() {}297 | ^298../../deps/v8/include/v8-profiler.h:1142:25: note: declared here299 1142 | ObjectNameResolver* global_object_name_resolver = nullptr;300 | ^~~~~~~~~~~~~~~~~~~~~~~~~~~301[146/1871] CXX obj/gen/src/node/inspector/protocol/node_base.NodeTracing.o302In file included from ../../src/util.h:29,303 from ../../src/inspector/node_string.h:10,304 from gen/src/node/inspector/protocol/Forward.h:19,305 from gen/src/node/inspector/protocol/Protocol.h:18,306 from gen/src/node/inspector/protocol/NodeTracing.h:10,307 from gen/src/node/inspector/protocol/NodeTracing.cpp:7:308../../deps/v8/include/v8-profiler.h: In constructor 'v8::HeapProfiler::HeapSnapshotOptions::HeapSnapshotOptions()':309../../deps/v8/include/v8-profiler.h:1128:27: warning: 'v8::HeapProfiler::HeapSnapshotOptions::global_object_name_resolver' is deprecated: Use context_name_resolver callback instead. [-Wdeprecated-declarations]310 1128 | HeapSnapshotOptions() {}311 | ^312../../deps/v8/include/v8-profiler.h:1142:25: note: declared here313 1142 | ObjectNameResolver* global_object_name_resolver = nullptr;314 | ^~~~~~~~~~~~~~~~~~~~~~~~~~~315../../deps/v8/include/v8-profiler.h:1128:27: warning: 'v8::HeapProfiler::HeapSnapshotOptions::global_object_name_resolver' is deprecated: Use context_name_resolver callback instead. [-Wdeprecated-declarations]316 1128 | HeapSnapshotOptions() {}317 | ^318../../deps/v8/include/v8-profiler.h:1142:25: note: declared here319 1142 | ObjectNameResolver* global_object_name_resolver = nullptr;320 | ^~~~~~~~~~~~~~~~~~~~~~~~~~~321[147/1871] CXX obj/gen/src/node/inspector/protocol/node_base.Storage.o322In file included from ../../src/util.h:29,323 from ../../src/inspector/node_string.h:10,324 from gen/src/node/inspector/protocol/Forward.h:19,325 from gen/src/node/inspector/protocol/Protocol.h:18,326 from gen/src/node/inspector/protocol/Storage.h:10,327 from gen/src/node/inspector/protocol/Storage.cpp:7:328../../deps/v8/include/v8-profiler.h: In constructor 'v8::HeapProfiler::HeapSnapshotOptions::HeapSnapshotOptions()':329../../deps/v8/include/v8-profiler.h:1128:27: warning: 'v8::HeapProfiler::HeapSnapshotOptions::global_object_name_resolver' is deprecated: Use context_name_resolver callback instead. [-Wdeprecated-declarations]330 1128 | HeapSnapshotOptions() {}331 | ^332../../deps/v8/include/v8-profiler.h:1142:25: note: declared here333 1142 | ObjectNameResolver* global_object_name_resolver = nullptr;334 | ^~~~~~~~~~~~~~~~~~~~~~~~~~~335../../deps/v8/include/v8-profiler.h:1128:27: warning: 'v8::HeapProfiler::HeapSnapshotOptions::global_object_name_resolver' is deprecated: Use context_name_resolver callback instead. [-Wdeprecated-declarations]336 1128 | HeapSnapshotOptions() {}337 | ^338../../deps/v8/include/v8-profiler.h:1142:25: note: declared here339 1142 | ObjectNameResolver* global_object_name_resolver = nullptr;340 | ^~~~~~~~~~~~~~~~~~~~~~~~~~~341[148/1871] CXX obj/src/node_base.cleanup_queue.o342In file included from ../../src/memory_tracker.h:6,343 from ../../src/cleanup_queue.h:11,344 from ../../src/cleanup_queue.cc:1:345../../deps/v8/include/v8-profiler.h: In constructor 'v8::HeapProfiler::HeapSnapshotOptions::HeapSnapshotOptions()':346../../deps/v8/include/v8-profiler.h:1128:27: warning: 'v8::HeapProfiler::HeapSnapshotOptions::global_object_name_resolver' is deprecated: Use context_name_resolver callback instead. [-Wdeprecated-declarations]347 1128 | HeapSnapshotOptions() {}348 | ^349../../deps/v8/include/v8-profiler.h:1142:25: note: declared here350 1142 | ObjectNameResolver* global_object_name_resolver = nullptr;351 | ^~~~~~~~~~~~~~~~~~~~~~~~~~~352../../deps/v8/include/v8-profiler.h:1128:27: warning: 'v8::HeapProfiler::HeapSnapshotOptions::global_object_name_resolver' is deprecated: Use context_name_resolver callback instead. [-Wdeprecated-declarations]353 1128 | HeapSnapshotOptions() {}354 | ^355../../deps/v8/include/v8-profiler.h:1142:25: note: declared here356 1142 | ObjectNameResolver* global_object_name_resolver = nullptr;357 | ^~~~~~~~~~~~~~~~~~~~~~~~~~~358[149/1871] CXX obj/src/node_base.node_debug.o359[150/1871] CXX obj/gen/src/node/inspector/protocol/node_base.NodeWorker.o360In file included from ../../src/util.h:29,361 from ../../src/inspector/node_string.h:10,362 from gen/src/node/inspector/protocol/Forward.h:19,363 from gen/src/node/inspector/protocol/Protocol.h:18,364 from gen/src/node/inspector/protocol/NodeWorker.h:10,365 from gen/src/node/inspector/protocol/NodeWorker.cpp:7:366../../deps/v8/include/v8-profiler.h: In constructor 'v8::HeapProfiler::HeapSnapshotOptions::HeapSnapshotOptions()':367../../deps/v8/include/v8-profiler.h:1128:27: warning: 'v8::HeapProfiler::HeapSnapshotOptions::global_object_name_resolver' is deprecated: Use context_name_resolver callback instead. [-Wdeprecated-declarations]368 1128 | HeapSnapshotOptions() {}369 | ^370../../deps/v8/include/v8-profiler.h:1142:25: note: declared here371 1142 | ObjectNameResolver* global_object_name_resolver = nullptr;372 | ^~~~~~~~~~~~~~~~~~~~~~~~~~~373../../deps/v8/include/v8-profiler.h:1128:27: warning: 'v8::HeapProfiler::HeapSnapshotOptions::global_object_name_resolver' is deprecated: Use context_name_resolver callback instead. [-Wdeprecated-declarations]374 1128 | HeapSnapshotOptions() {}375 | ^376../../deps/v8/include/v8-profiler.h:1142:25: note: declared here377 1142 | ObjectNameResolver* global_object_name_resolver = nullptr;378 | ^~~~~~~~~~~~~~~~~~~~~~~~~~~379[151/1871] CXX obj/gen/src/node/inspector/protocol/node_base.DOMStorage.o380In file included from ../../src/util.h:29,381 from ../../src/inspector/node_string.h:10,382 from gen/src/node/inspector/protocol/Forward.h:19,383 from gen/src/node/inspector/protocol/Protocol.h:18,384 from gen/src/node/inspector/protocol/DOMStorage.h:10,385 from gen/src/node/inspector/protocol/DOMStorage.cpp:7:386../../deps/v8/include/v8-profiler.h: In constructor 'v8::HeapProfiler::HeapSnapshotOptions::HeapSnapshotOptions()':387../../deps/v8/include/v8-profiler.h:1128:27: warning: 'v8::HeapProfiler::HeapSnapshotOptions::global_object_name_resolver' is deprecated: Use context_name_resolver callback instead. [-Wdeprecated-declarations]388 1128 | HeapSnapshotOptions() {}389 | ^390../../deps/v8/include/v8-profiler.h:1142:25: note: declared here391 1142 | ObjectNameResolver* global_object_name_resolver = nullptr;392 | ^~~~~~~~~~~~~~~~~~~~~~~~~~~393../../deps/v8/include/v8-profiler.h:1128:27: warning: 'v8::HeapProfiler::HeapSnapshotOptions::global_object_name_resolver' is deprecated: Use context_name_resolver callback instead. [-Wdeprecated-declarations]394 1128 | HeapSnapshotOptions() {}395 | ^396../../deps/v8/include/v8-profiler.h:1142:25: note: declared here397 1142 | ObjectNameResolver* global_object_name_resolver = nullptr;398 | ^~~~~~~~~~~~~~~~~~~~~~~~~~~399[152/1871] CXX obj/deps/v8/src/torque/torque_base.types.o400[153/1871] CXX obj/gen/src/node/inspector/protocol/node_base.Network.o401In file included from ../../src/util.h:29,402 from ../../src/inspector/node_string.h:10,403 from gen/src/node/inspector/protocol/Forward.h:19,404 from gen/src/node/inspector/protocol/Protocol.h:18,405 from gen/src/node/inspector/protocol/Network.h:10,406 from gen/src/node/inspector/protocol/Network.cpp:7:407../../deps/v8/include/v8-profiler.h: In constructor 'v8::HeapProfiler::HeapSnapshotOptions::HeapSnapshotOptions()':408../../deps/v8/include/v8-profiler.h:1128:27: warning: 'v8::HeapProfiler::HeapSnapshotOptions::global_object_name_resolver' is deprecated: Use context_name_resolver callback instead. [-Wdeprecated-declarations]409 1128 | HeapSnapshotOptions() {}410 | ^411../../deps/v8/include/v8-profiler.h:1142:25: note: declared here412 1142 | ObjectNameResolver* global_object_name_resolver = nullptr;413 | ^~~~~~~~~~~~~~~~~~~~~~~~~~~414../../deps/v8/include/v8-profiler.h:1128:27: warning: 'v8::HeapProfiler::HeapSnapshotOptions::global_object_name_resolver' is deprecated: Use context_name_resolver callback instead. [-Wdeprecated-declarations]415 1128 | HeapSnapshotOptions() {}416 | ^417../../deps/v8/include/v8-profiler.h:1142:25: note: declared here418 1142 | ObjectNameResolver* global_object_name_resolver = nullptr;419 | ^~~~~~~~~~~~~~~~~~~~~~~~~~~420[154/1871] CXX obj/src/node_base.handle_wrap.o421In file included from ../../src/memory_tracker.h:6,422 from ../../src/base_object.h:29,423 from ../../src/async_wrap.h:27,424 from ../../src/handle_wrap.h:27,425 from ../../src/handle_wrap.cc:22:426../../deps/v8/include/v8-profiler.h: In constructor 'v8::HeapProfiler::HeapSnapshotOptions::HeapSnapshotOptions()':427../../deps/v8/include/v8-profiler.h:1128:27: warning: 'v8::HeapProfiler::HeapSnapshotOptions::global_object_name_resolver' is deprecated: Use context_name_resolver callback instead. [-Wdeprecated-declarations]428 1128 | HeapSnapshotOptions() {}429 | ^430../../deps/v8/include/v8-profiler.h:1142:25: note: declared here431 1142 | ObjectNameResolver* global_object_name_resolver = nullptr;432 | ^~~~~~~~~~~~~~~~~~~~~~~~~~~433../../deps/v8/include/v8-profiler.h:1128:27: warning: 'v8::HeapProfiler::HeapSnapshotOptions::global_object_name_resolver' is deprecated: Use context_name_resolver callback instead. [-Wdeprecated-declarations]434 1128 | HeapSnapshotOptions() {}435 | ^436../../deps/v8/include/v8-profiler.h:1142:25: note: declared here437 1142 | ObjectNameResolver* global_object_name_resolver = nullptr;438 | ^~~~~~~~~~~~~~~~~~~~~~~~~~~439[155/1871] CXX obj/src/api/node_base.callback.o440In file included from ../../src/memory_tracker.h:6,441 from ../../src/base_object.h:29,442 from ../../src/async_context_frame.h:6,443 from ../../src/api/callback.cc:1:444../../deps/v8/include/v8-profiler.h: In constructor 'v8::HeapProfiler::HeapSnapshotOptions::HeapSnapshotOptions()':445../../deps/v8/include/v8-profiler.h:1128:27: warning: 'v8::HeapProfiler::HeapSnapshotOptions::global_object_name_resolver' is deprecated: Use context_name_resolver callback instead. [-Wdeprecated-declarations]446 1128 | HeapSnapshotOptions() {}447 | ^448../../deps/v8/include/v8-profiler.h:1142:25: note: declared here449 1142 | ObjectNameResolver* global_object_name_resolver = nullptr;450 | ^~~~~~~~~~~~~~~~~~~~~~~~~~~451../../deps/v8/include/v8-profiler.h:1128:27: warning: 'v8::HeapProfiler::HeapSnapshotOptions::global_object_name_resolver' is deprecated: Use context_name_resolver callback instead. [-Wdeprecated-declarations]452 1128 | HeapSnapshotOptions() {}453 | ^454../../deps/v8/include/v8-profiler.h:1142:25: note: declared here455 1142 | ObjectNameResolver* global_object_name_resolver = nullptr;456 | ^~~~~~~~~~~~~~~~~~~~~~~~~~~457[156/1871] CXX obj/src/node_base.debug_utils.o458In file included from ../../src/memory_tracker.h:6,459 from ../../src/base_object.h:29,460 from ../../src/async_wrap.h:27,461 from ../../src/debug_utils.h:6,462 from ../../src/debug_utils-inl.h:6,463 from ../../src/debug_utils.cc:1:464../../deps/v8/include/v8-profiler.h: In constructor 'v8::HeapProfiler::HeapSnapshotOptions::HeapSnapshotOptions()':465../../deps/v8/include/v8-profiler.h:1128:27: warning: 'v8::HeapProfiler::HeapSnapshotOptions::global_object_name_resolver' is deprecated: Use context_name_resolver callback instead. [-Wdeprecated-declarations]466 1128 | HeapSnapshotOptions() {}467 | ^468../../deps/v8/include/v8-profiler.h:1142:25: note: declared here469 1142 | ObjectNameResolver* global_object_name_resolver = nullptr;470 | ^~~~~~~~~~~~~~~~~~~~~~~~~~~471../../deps/v8/include/v8-profiler.h:1128:27: warning: 'v8::HeapProfiler::HeapSnapshotOptions::global_object_name_resolver' is deprecated: Use context_name_resolver callback instead. [-Wdeprecated-declarations]472 1128 | HeapSnapshotOptions() {}473 | ^474../../deps/v8/include/v8-profiler.h:1142:25: note: declared here475 1142 | ObjectNameResolver* global_object_name_resolver = nullptr;476 | ^~~~~~~~~~~~~~~~~~~~~~~~~~~477[157/1871] CXX obj/src/node_base.connection_wrap.o478In file included from ../../src/memory_tracker.h:6,479 from ../../src/aliased_buffer.h:7,480 from ../../src/env.h:27,481 from ../../src/stream_base.h:6,482 from ../../src/stream_wrap.h:27,483 from ../../src/connection_wrap.h:6,484 from ../../src/connection_wrap.cc:1:485../../deps/v8/include/v8-profiler.h: In constructor 'v8::HeapProfiler::HeapSnapshotOptions::HeapSnapshotOptions()':486../../deps/v8/include/v8-profiler.h:1128:27: warning: 'v8::HeapProfiler::HeapSnapshotOptions::global_object_name_resolver' is deprecated: Use context_name_resolver callback instead. [-Wdeprecated-declarations]487 1128 | HeapSnapshotOptions() {}488 | ^489../../deps/v8/include/v8-profiler.h:1142:25: note: declared here490 1142 | ObjectNameResolver* global_object_name_resolver = nullptr;491 | ^~~~~~~~~~~~~~~~~~~~~~~~~~~492../../deps/v8/include/v8-profiler.h:1128:27: warning: 'v8::HeapProfiler::HeapSnapshotOptions::global_object_name_resolver' is deprecated: Use context_name_resolver callback instead. [-Wdeprecated-declarations]493 1128 | HeapSnapshotOptions() {}494 | ^495../../deps/v8/include/v8-profiler.h:1142:25: note: declared here496 1142 | ObjectNameResolver* global_object_name_resolver = nullptr;497 | ^~~~~~~~~~~~~~~~~~~~~~~~~~~498[158/1871] CXX obj/src/api/node_base.hooks.o499In file included from ../../src/memory_tracker.h:6,500 from ../../src/aliased_buffer.h:7,501 from ../../src/aliased_buffer-inl.h:6,502 from ../../src/env-inl.h:27,503 from ../../src/api/hooks.cc:1:504../../deps/v8/include/v8-profiler.h: In constructor 'v8::HeapProfiler::HeapSnapshotOptions::HeapSnapshotOptions()':505../../deps/v8/include/v8-profiler.h:1128:27: warning: 'v8::HeapProfiler::HeapSnapshotOptions::global_object_name_resolver' is deprecated: Use context_name_resolver callback instead. [-Wdeprecated-declarations]506 1128 | HeapSnapshotOptions() {}507 | ^508../../deps/v8/include/v8-profiler.h:1142:25: note: declared here509 1142 | ObjectNameResolver* global_object_name_resolver = nullptr;510 | ^~~~~~~~~~~~~~~~~~~~~~~~~~~511../../deps/v8/include/v8-profiler.h:1128:27: warning: 'v8::HeapProfiler::HeapSnapshotOptions::global_object_name_resolver' is deprecated: Use context_name_resolver callback instead. [-Wdeprecated-declarations]512 1128 | HeapSnapshotOptions() {}513 | ^514../../deps/v8/include/v8-profiler.h:1142:25: note: declared here515 1142 | ObjectNameResolver* global_object_name_resolver = nullptr;516 | ^~~~~~~~~~~~~~~~~~~~~~~~~~~517[159/1871] CXX obj/src/node_base.async_context_frame.o518In file included from ../../src/memory_tracker.h:6,519 from ../../src/base_object.h:29,520 from ../../src/async_context_frame.h:6,521 from ../../src/async_context_frame.cc:1:522../../deps/v8/include/v8-profiler.h: In constructor 'v8::HeapProfiler::HeapSnapshotOptions::HeapSnapshotOptions()':523../../deps/v8/include/v8-profiler.h:1128:27: warning: 'v8::HeapProfiler::HeapSnapshotOptions::global_object_name_resolver' is deprecated: Use context_name_resolver callback instead. [-Wdeprecated-declarations]524 1128 | HeapSnapshotOptions() {}525 | ^526../../deps/v8/include/v8-profiler.h:1142:25: note: declared here527 1142 | ObjectNameResolver* global_object_name_resolver = nullptr;528 | ^~~~~~~~~~~~~~~~~~~~~~~~~~~529../../deps/v8/include/v8-profiler.h:1128:27: warning: 'v8::HeapProfiler::HeapSnapshotOptions::global_object_name_resolver' is deprecated: Use context_name_resolver callback instead. [-Wdeprecated-declarations]530 1128 | HeapSnapshotOptions() {}531 | ^532../../deps/v8/include/v8-profiler.h:1142:25: note: declared here533 1142 | ObjectNameResolver* global_object_name_resolver = nullptr;534 | ^~~~~~~~~~~~~~~~~~~~~~~~~~~535[160/1871] CXX obj/src/node_base.heap_utils.o536In file included from ../../src/memory_tracker.h:6,537 from ../../src/aliased_buffer.h:7,538 from ../../src/env.h:27,539 from ../../src/node_internals.h:27,540 from ../../src/diagnosticfilename-inl.h:6,541 from ../../src/heap_utils.cc:1:542../../deps/v8/include/v8-profiler.h: In constructor 'v8::HeapProfiler::HeapSnapshotOptions::HeapSnapshotOptions()':543../../deps/v8/include/v8-profiler.h:1128:27: warning: 'v8::HeapProfiler::HeapSnapshotOptions::global_object_name_resolver' is deprecated: Use context_name_resolver callback instead. [-Wdeprecated-declarations]544 1128 | HeapSnapshotOptions() {}545 | ^546../../deps/v8/include/v8-profiler.h:1142:25: note: declared here547 1142 | ObjectNameResolver* global_object_name_resolver = nullptr;548 | ^~~~~~~~~~~~~~~~~~~~~~~~~~~549../../deps/v8/include/v8-profiler.h:1128:27: warning: 'v8::HeapProfiler::HeapSnapshotOptions::global_object_name_resolver' is deprecated: Use context_name_resolver callback instead. [-Wdeprecated-declarations]550 1128 | HeapSnapshotOptions() {}551 | ^552../../deps/v8/include/v8-profiler.h:1142:25: note: declared here553 1142 | ObjectNameResolver* global_object_name_resolver = nullptr;554 | ^~~~~~~~~~~~~~~~~~~~~~~~~~~555[161/1871] CXX obj/src/node_base.js_stream.o556In file included from ../../src/memory_tracker.h:6,557 from ../../src/base_object.h:29,558 from ../../src/async_wrap.h:27,559 from ../../src/js_stream.h:6,560 from ../../src/js_stream.cc:1:561../../deps/v8/include/v8-profiler.h: In constructor 'v8::HeapProfiler::HeapSnapshotOptions::HeapSnapshotOptions()':562../../deps/v8/include/v8-profiler.h:1128:27: warning: 'v8::HeapProfiler::HeapSnapshotOptions::global_object_name_resolver' is deprecated: Use context_name_resolver callback instead. [-Wdeprecated-declarations]563 1128 | HeapSnapshotOptions() {}564 | ^565../../deps/v8/include/v8-profiler.h:1142:25: note: declared here566 1142 | ObjectNameResolver* global_object_name_resolver = nullptr;567 | ^~~~~~~~~~~~~~~~~~~~~~~~~~~568../../deps/v8/include/v8-profiler.h:1128:27: warning: 'v8::HeapProfiler::HeapSnapshotOptions::global_object_name_resolver' is deprecated: Use context_name_resolver callback instead. [-Wdeprecated-declarations]569 1128 | HeapSnapshotOptions() {}570 | ^571../../deps/v8/include/v8-profiler.h:1142:25: note: declared here572 1142 | ObjectNameResolver* global_object_name_resolver = nullptr;573 | ^~~~~~~~~~~~~~~~~~~~~~~~~~~574[162/1871] CXX obj/src/node_base.fs_event_wrap.o575In file included from ../../src/memory_tracker.h:6,576 from ../../src/base_object.h:29,577 from ../../src/async_wrap.h:27,578 from ../../src/async_wrap-inl.h:27,579 from ../../src/fs_event_wrap.cc:22:580../../deps/v8/include/v8-profiler.h: In constructor 'v8::HeapProfiler::HeapSnapshotOptions::HeapSnapshotOptions()':581../../deps/v8/include/v8-profiler.h:1128:27: warning: 'v8::HeapProfiler::HeapSnapshotOptions::global_object_name_resolver' is deprecated: Use context_name_resolver callback instead. [-Wdeprecated-declarations]582 1128 | HeapSnapshotOptions() {}583 | ^584../../deps/v8/include/v8-profiler.h:1142:25: note: declared here585 1142 | ObjectNameResolver* global_object_name_resolver = nullptr;586 | ^~~~~~~~~~~~~~~~~~~~~~~~~~~587../../deps/v8/include/v8-profiler.h:1128:27: warning: 'v8::HeapProfiler::HeapSnapshotOptions::global_object_name_resolver' is deprecated: Use context_name_resolver callback instead. [-Wdeprecated-declarations]588 1128 | HeapSnapshotOptions() {}589 | ^590../../deps/v8/include/v8-profiler.h:1142:25: note: declared here591 1142 | ObjectNameResolver* global_object_name_resolver = nullptr;592 | ^~~~~~~~~~~~~~~~~~~~~~~~~~~593[163/1871] CXX obj/src/dataqueue/node_base.queue.o594In file included from ../../src/memory_tracker.h:6,595 from ../../src/base_object.h:29,596 from ../../src/dataqueue/queue.h:5,597 from ../../src/dataqueue/queue.cc:1:598../../deps/v8/include/v8-profiler.h: In constructor 'v8::HeapProfiler::HeapSnapshotOptions::HeapSnapshotOptions()':599../../deps/v8/include/v8-profiler.h:1128:27: warning: 'v8::HeapProfiler::HeapSnapshotOptions::global_object_name_resolver' is deprecated: Use context_name_resolver callback instead. [-Wdeprecated-declarations]600 1128 | HeapSnapshotOptions() {}601 | ^602../../deps/v8/include/v8-profiler.h:1142:25: note: declared here603 1142 | ObjectNameResolver* global_object_name_resolver = nullptr;604 | ^~~~~~~~~~~~~~~~~~~~~~~~~~~605../../deps/v8/include/v8-profiler.h:1128:27: warning: 'v8::HeapProfiler::HeapSnapshotOptions::global_object_name_resolver' is deprecated: Use context_name_resolver callback instead. [-Wdeprecated-declarations]606 1128 | HeapSnapshotOptions() {}607 | ^608../../deps/v8/include/v8-profiler.h:1142:25: note: declared here609 1142 | ObjectNameResolver* global_object_name_resolver = nullptr;610 | ^~~~~~~~~~~~~~~~~~~~~~~~~~~611[164/1871] CXX obj/src/node_base.js_native_api_v8.o612In file included from ../../src/memory_tracker.h:6,613 from ../../src/aliased_buffer.h:7,614 from ../../src/aliased_buffer-inl.h:6,615 from ../../src/env-inl.h:27,616 from ../../src/js_native_api_v8.cc:7:617../../deps/v8/include/v8-profiler.h: In constructor 'v8::HeapProfiler::HeapSnapshotOptions::HeapSnapshotOptions()':618../../deps/v8/include/v8-profiler.h:1128:27: warning: 'v8::HeapProfiler::HeapSnapshotOptions::global_object_name_resolver' is deprecated: Use context_name_resolver callback instead. [-Wdeprecated-declarations]619 1128 | HeapSnapshotOptions() {}620 | ^621../../deps/v8/include/v8-profiler.h:1142:25: note: declared here622 1142 | ObjectNameResolver* global_object_name_resolver = nullptr;623 | ^~~~~~~~~~~~~~~~~~~~~~~~~~~624../../deps/v8/include/v8-profiler.h:1128:27: warning: 'v8::HeapProfiler::HeapSnapshotOptions::global_object_name_resolver' is deprecated: Use context_name_resolver callback instead. [-Wdeprecated-declarations]625 1128 | HeapSnapshotOptions() {}626 | ^627../../deps/v8/include/v8-profiler.h:1142:25: note: declared here628 1142 | ObjectNameResolver* global_object_name_resolver = nullptr;629 | ^~~~~~~~~~~~~~~~~~~~~~~~~~~630[165/1871] CXX obj/src/node_base.node_file_utils.o631In file included from ../../src/util.h:29,632 from ../../src/util-inl.h:33,633 from ../../src/node_file_utils.cc:10:634../../deps/v8/include/v8-profiler.h: In constructor 'v8::HeapProfiler::HeapSnapshotOptions::HeapSnapshotOptions()':635../../deps/v8/include/v8-profiler.h:1128:27: warning: 'v8::HeapProfiler::HeapSnapshotOptions::global_object_name_resolver' is deprecated: Use context_name_resolver callback instead. [-Wdeprecated-declarations]636 1128 | HeapSnapshotOptions() {}637 | ^638../../deps/v8/include/v8-profiler.h:1142:25: note: declared here639 1142 | ObjectNameResolver* global_object_name_resolver = nullptr;640 | ^~~~~~~~~~~~~~~~~~~~~~~~~~~641../../deps/v8/include/v8-profiler.h:1128:27: warning: 'v8::HeapProfiler::HeapSnapshotOptions::global_object_name_resolver' is deprecated: Use context_name_resolver callback instead. [-Wdeprecated-declarations]642 1128 | HeapSnapshotOptions() {}643 | ^644../../deps/v8/include/v8-profiler.h:1142:25: note: declared here645 1142 | ObjectNameResolver* global_object_name_resolver = nullptr;646 | ^~~~~~~~~~~~~~~~~~~~~~~~~~~647../../src/node_file_utils.cc: In function 'int node::WriteFileSync(const char*, uv_buf_t*, size_t)':648../../src/node_file_utils.cc:62:32: warning: enumerated and non-enumerated type in conditional expression [-Wextra]649 62 | int err = req.result < 0 ? req.result : UV_EIO;650 | ~~~~~~~~~~~~~~~^~~~~~~~~~~~~~~~~~~~~651[166/1871] CXX obj/src/node_base.encoding_binding.o652In file included from ../../src/memory_tracker.h:6,653 from ../../src/aliased_buffer.h:7,654 from ../../src/encoding_binding.h:7,655 from ../../src/encoding_binding.cc:1:656../../deps/v8/include/v8-profiler.h: In constructor 'v8::HeapProfiler::HeapSnapshotOptions::HeapSnapshotOptions()':657../../deps/v8/include/v8-profiler.h:1128:27: warning: 'v8::HeapProfiler::HeapSnapshotOptions::global_object_name_resolver' is deprecated: Use context_name_resolver callback instead. [-Wdeprecated-declarations]658 1128 | HeapSnapshotOptions() {}659 | ^660../../deps/v8/include/v8-profiler.h:1142:25: note: declared here661 1142 | ObjectNameResolver* global_object_name_resolver = nullptr;662 | ^~~~~~~~~~~~~~~~~~~~~~~~~~~663../../deps/v8/include/v8-profiler.h:1128:27: warning: 'v8::HeapProfiler::HeapSnapshotOptions::global_object_name_resolver' is deprecated: Use context_name_resolver callback instead. [-Wdeprecated-declarations]664 1128 | HeapSnapshotOptions() {}665 | ^666../../deps/v8/include/v8-profiler.h:1142:25: note: declared here667 1142 | ObjectNameResolver* global_object_name_resolver = nullptr;668 | ^~~~~~~~~~~~~~~~~~~~~~~~~~~669[167/1871] CXX obj/src/api/node_base.environment.o670In file included from ../../src/memory_tracker.h:6,671 from ../../src/base_object.h:29,672 from ../../src/async_wrap.h:27,673 from ../../src/crypto/crypto_util.h:6,674 from ../../src/api/environment.cc:3:675../../deps/v8/include/v8-profiler.h: In constructor 'v8::HeapProfiler::HeapSnapshotOptions::HeapSnapshotOptions()':676../../deps/v8/include/v8-profiler.h:1128:27: warning: 'v8::HeapProfiler::HeapSnapshotOptions::global_object_name_resolver' is deprecated: Use context_name_resolver callback instead. [-Wdeprecated-declarations]677 1128 | HeapSnapshotOptions() {}678 | ^679../../deps/v8/include/v8-profiler.h:1142:25: note: declared here680 1142 | ObjectNameResolver* global_object_name_resolver = nullptr;681 | ^~~~~~~~~~~~~~~~~~~~~~~~~~~682../../deps/v8/include/v8-profiler.h:1128:27: warning: 'v8::HeapProfiler::HeapSnapshotOptions::global_object_name_resolver' is deprecated: Use context_name_resolver callback instead. [-Wdeprecated-declarations]683 1128 | HeapSnapshotOptions() {}684 | ^685../../deps/v8/include/v8-profiler.h:1142:25: note: declared here686 1142 | ObjectNameResolver* global_object_name_resolver = nullptr;687 | ^~~~~~~~~~~~~~~~~~~~~~~~~~~688[168/1871] CXX obj/src/node_base.js_udp_wrap.o689In file included from ../../src/memory_tracker.h:6,690 from ../../src/base_object.h:29,691 from ../../src/async_wrap.h:27,692 from ../../src/handle_wrap.h:27,693 from ../../src/udp_wrap.h:27,694 from ../../src/js_udp_wrap.cc:1:695../../deps/v8/include/v8-profiler.h: In constructor 'v8::HeapProfiler::HeapSnapshotOptions::HeapSnapshotOptions()':696../../deps/v8/include/v8-profiler.h:1128:27: warning: 'v8::HeapProfiler::HeapSnapshotOptions::global_object_name_resolver' is deprecated: Use context_name_resolver callback instead. [-Wdeprecated-declarations]697 1128 | HeapSnapshotOptions() {}698 | ^699../../deps/v8/include/v8-profiler.h:1142:25: note: declared here700 1142 | ObjectNameResolver* global_object_name_resolver = nullptr;701 | ^~~~~~~~~~~~~~~~~~~~~~~~~~~702../../deps/v8/include/v8-profiler.h:1128:27: warning: 'v8::HeapProfiler::HeapSnapshotOptions::global_object_name_resolver' is deprecated: Use context_name_resolver callback instead. [-Wdeprecated-declarations]703 1128 | HeapSnapshotOptions() {}704 | ^705../../deps/v8/include/v8-profiler.h:1142:25: note: declared here706 1142 | ObjectNameResolver* global_object_name_resolver = nullptr;707 | ^~~~~~~~~~~~~~~~~~~~~~~~~~~708[169/1871] CXX obj/src/node_base.connect_wrap.o709In file included from ../../src/memory_tracker.h:6,710 from ../../src/base_object.h:29,711 from ../../src/async_wrap.h:27,712 from ../../src/req_wrap.h:6,713 from ../../src/req_wrap-inl.h:6,714 from ../../src/connect_wrap.h:6,715 from ../../src/connect_wrap.cc:1:716../../deps/v8/include/v8-profiler.h: In constructor 'v8::HeapProfiler::HeapSnapshotOptions::HeapSnapshotOptions()':717../../deps/v8/include/v8-profiler.h:1128:27: warning: 'v8::HeapProfiler::HeapSnapshotOptions::global_object_name_resolver' is deprecated: Use context_name_resolver callback instead. [-Wdeprecated-declarations]718 1128 | HeapSnapshotOptions() {}719 | ^720../../deps/v8/include/v8-profiler.h:1142:25: note: declared here721 1142 | ObjectNameResolver* global_object_name_resolver = nullptr;722 | ^~~~~~~~~~~~~~~~~~~~~~~~~~~723../../deps/v8/include/v8-profiler.h:1128:27: warning: 'v8::HeapProfiler::HeapSnapshotOptions::global_object_name_resolver' is deprecated: Use context_name_resolver callback instead. [-Wdeprecated-declarations]724 1128 | HeapSnapshotOptions() {}725 | ^726../../deps/v8/include/v8-profiler.h:1142:25: note: declared here727 1142 | ObjectNameResolver* global_object_name_resolver = nullptr;728 | ^~~~~~~~~~~~~~~~~~~~~~~~~~~729[170/1871] CXX obj/src/api/node_base.embed_helpers.o730In file included from ../../src/memory_tracker.h:6,731 from ../../src/base_object.h:29,732 from ../../src/async_wrap.h:27,733 from ../../src/debug_utils.h:6,734 from ../../src/debug_utils-inl.h:6,735 from ../../src/api/embed_helpers.cc:1:736../../deps/v8/include/v8-profiler.h: In constructor 'v8::HeapProfiler::HeapSnapshotOptions::HeapSnapshotOptions()':737../../deps/v8/include/v8-profiler.h:1128:27: warning: 'v8::HeapProfiler::HeapSnapshotOptions::global_object_name_resolver' is deprecated: Use context_name_resolver callback instead. [-Wdeprecated-declarations]738 1128 | HeapSnapshotOptions() {}739 | ^740../../deps/v8/include/v8-profiler.h:1142:25: note: declared here741 1142 | ObjectNameResolver* global_object_name_resolver = nullptr;742 | ^~~~~~~~~~~~~~~~~~~~~~~~~~~743../../deps/v8/include/v8-profiler.h:1128:27: warning: 'v8::HeapProfiler::HeapSnapshotOptions::global_object_name_resolver' is deprecated: Use context_name_resolver callback instead. [-Wdeprecated-declarations]744 1128 | HeapSnapshotOptions() {}745 | ^746../../deps/v8/include/v8-profiler.h:1142:25: note: declared here747 1142 | ObjectNameResolver* global_object_name_resolver = nullptr;748 | ^~~~~~~~~~~~~~~~~~~~~~~~~~~749[171/1871] CXX obj/src/api/node_base.async_resource.o750In file included from ../../src/memory_tracker.h:6,751 from ../../src/base_object.h:29,752 from ../../src/async_context_frame.h:6,753 from ../../src/api/async_resource.cc:1:754../../deps/v8/include/v8-profiler.h: In constructor 'v8::HeapProfiler::HeapSnapshotOptions::HeapSnapshotOptions()':755../../deps/v8/include/v8-profiler.h:1128:27: warning: 'v8::HeapProfiler::HeapSnapshotOptions::global_object_name_resolver' is deprecated: Use context_name_resolver callback instead. [-Wdeprecated-declarations]756 1128 | HeapSnapshotOptions() {}757 | ^758../../deps/v8/include/v8-profiler.h:1142:25: note: declared here759 1142 | ObjectNameResolver* global_object_name_resolver = nullptr;760 | ^~~~~~~~~~~~~~~~~~~~~~~~~~~761../../deps/v8/include/v8-profiler.h:1128:27: warning: 'v8::HeapProfiler::HeapSnapshotOptions::global_object_name_resolver' is deprecated: Use context_name_resolver callback instead. [-Wdeprecated-declarations]762 1128 | HeapSnapshotOptions() {}763 | ^764../../deps/v8/include/v8-profiler.h:1142:25: note: declared here765 1142 | ObjectNameResolver* global_object_name_resolver = nullptr;766 | ^~~~~~~~~~~~~~~~~~~~~~~~~~~767[172/1871] CXX obj/src/api/node_base.exceptions.o768In file included from ../../src/memory_tracker.h:6,769 from ../../src/aliased_buffer.h:7,770 from ../../src/aliased_buffer-inl.h:6,771 from ../../src/env-inl.h:27,772 from ../../src/api/exceptions.cc:3:773../../deps/v8/include/v8-profiler.h: In constructor 'v8::HeapProfiler::HeapSnapshotOptions::HeapSnapshotOptions()':774../../deps/v8/include/v8-profiler.h:1128:27: warning: 'v8::HeapProfiler::HeapSnapshotOptions::global_object_name_resolver' is deprecated: Use context_name_resolver callback instead. [-Wdeprecated-declarations]775 1128 | HeapSnapshotOptions() {}776 | ^777../../deps/v8/include/v8-profiler.h:1142:25: note: declared here778 1142 | ObjectNameResolver* global_object_name_resolver = nullptr;779 | ^~~~~~~~~~~~~~~~~~~~~~~~~~~780../../deps/v8/include/v8-profiler.h:1128:27: warning: 'v8::HeapProfiler::HeapSnapshotOptions::global_object_name_resolver' is deprecated: Use context_name_resolver callback instead. [-Wdeprecated-declarations]781 1128 | HeapSnapshotOptions() {}782 | ^783../../deps/v8/include/v8-profiler.h:1142:25: note: declared here784 1142 | ObjectNameResolver* global_object_name_resolver = nullptr;785 | ^~~~~~~~~~~~~~~~~~~~~~~~~~~786[173/1871] CXX obj/src/node_base.base_object.o787In file included from ../../src/memory_tracker.h:6,788 from ../../src/base_object.h:29,789 from ../../src/base_object.cc:1:790../../deps/v8/include/v8-profiler.h: In constructor 'v8::HeapProfiler::HeapSnapshotOptions::HeapSnapshotOptions()':791../../deps/v8/include/v8-profiler.h:1128:27: warning: 'v8::HeapProfiler::HeapSnapshotOptions::global_object_name_resolver' is deprecated: Use context_name_resolver callback instead. [-Wdeprecated-declarations]792 1128 | HeapSnapshotOptions() {}793 | ^794../../deps/v8/include/v8-profiler.h:1142:25: note: declared here795 1142 | ObjectNameResolver* global_object_name_resolver = nullptr;796 | ^~~~~~~~~~~~~~~~~~~~~~~~~~~797../../deps/v8/include/v8-profiler.h:1128:27: warning: 'v8::HeapProfiler::HeapSnapshotOptions::global_object_name_resolver' is deprecated: Use context_name_resolver callback instead. [-Wdeprecated-declarations]798 1128 | HeapSnapshotOptions() {}799 | ^800../../deps/v8/include/v8-profiler.h:1142:25: note: declared here801 1142 | ObjectNameResolver* global_object_name_resolver = nullptr;802 | ^~~~~~~~~~~~~~~~~~~~~~~~~~~803[174/1871] CXX obj/src/api/node_base.encoding.o804In file included from ../../src/memory_tracker.h:6,805 from ../../src/aliased_buffer.h:7,806 from ../../src/aliased_buffer-inl.h:6,807 from ../../src/env-inl.h:27,808 from ../../src/string_bytes.h:30,809 from ../../src/api/encoding.cc:2:810../../deps/v8/include/v8-profiler.h: In constructor 'v8::HeapProfiler::HeapSnapshotOptions::HeapSnapshotOptions()':811../../deps/v8/include/v8-profiler.h:1128:27: warning: 'v8::HeapProfiler::HeapSnapshotOptions::global_object_name_resolver' is deprecated: Use context_name_resolver callback instead. [-Wdeprecated-declarations]812 1128 | HeapSnapshotOptions() {}813 | ^814../../deps/v8/include/v8-profiler.h:1142:25: note: declared here815 1142 | ObjectNameResolver* global_object_name_resolver = nullptr;816 | ^~~~~~~~~~~~~~~~~~~~~~~~~~~817../../deps/v8/include/v8-profiler.h:1128:27: warning: 'v8::HeapProfiler::HeapSnapshotOptions::global_object_name_resolver' is deprecated: Use context_name_resolver callback instead. [-Wdeprecated-declarations]818 1128 | HeapSnapshotOptions() {}819 | ^820../../deps/v8/include/v8-profiler.h:1142:25: note: declared here821 1142 | ObjectNameResolver* global_object_name_resolver = nullptr;822 | ^~~~~~~~~~~~~~~~~~~~~~~~~~~823[175/1871] CXX obj/src/node_base.node_env_var.o824In file included from ../../src/memory_tracker.h:6,825 from ../../src/base_object.h:29,826 from ../../src/async_wrap.h:27,827 from ../../src/debug_utils.h:6,828 from ../../src/debug_utils-inl.h:6,829 from ../../src/node_env_var.cc:1:830../../deps/v8/include/v8-profiler.h: In constructor 'v8::HeapProfiler::HeapSnapshotOptions::HeapSnapshotOptions()':831../../deps/v8/include/v8-profiler.h:1128:27: warning: 'v8::HeapProfiler::HeapSnapshotOptions::global_object_name_resolver' is deprecated: Use context_name_resolver callback instead. [-Wdeprecated-declarations]832 1128 | HeapSnapshotOptions() {}833 | ^834../../deps/v8/include/v8-profiler.h:1142:25: note: declared here835 1142 | ObjectNameResolver* global_object_name_resolver = nullptr;836 | ^~~~~~~~~~~~~~~~~~~~~~~~~~~837../../deps/v8/include/v8-profiler.h:1128:27: warning: 'v8::HeapProfiler::HeapSnapshotOptions::global_object_name_resolver' is deprecated: Use context_name_resolver callback instead. [-Wdeprecated-declarations]838 1128 | HeapSnapshotOptions() {}839 | ^840../../deps/v8/include/v8-profiler.h:1142:25: note: declared here841 1142 | ObjectNameResolver* global_object_name_resolver = nullptr;842 | ^~~~~~~~~~~~~~~~~~~~~~~~~~~843[176/1871] CXX obj/src/node_base.histogram.o844In file included from ../../src/memory_tracker.h:6,845 from ../../src/base_object.h:29,846 from ../../src/histogram.h:7,847 from ../../src/histogram.cc:1:848../../deps/v8/include/v8-profiler.h: In constructor 'v8::HeapProfiler::HeapSnapshotOptions::HeapSnapshotOptions()':849../../deps/v8/include/v8-profiler.h:1128:27: warning: 'v8::HeapProfiler::HeapSnapshotOptions::global_object_name_resolver' is deprecated: Use context_name_resolver callback instead. [-Wdeprecated-declarations]850 1128 | HeapSnapshotOptions() {}851 | ^852../../deps/v8/include/v8-profiler.h:1142:25: note: declared here853 1142 | ObjectNameResolver* global_object_name_resolver = nullptr;854 | ^~~~~~~~~~~~~~~~~~~~~~~~~~~855../../deps/v8/include/v8-profiler.h:1128:27: warning: 'v8::HeapProfiler::HeapSnapshotOptions::global_object_name_resolver' is deprecated: Use context_name_resolver callback instead. [-Wdeprecated-declarations]856 1128 | HeapSnapshotOptions() {}857 | ^858../../deps/v8/include/v8-profiler.h:1142:25: note: declared here859 1142 | ObjectNameResolver* global_object_name_resolver = nullptr;860 | ^~~~~~~~~~~~~~~~~~~~~~~~~~~861[177/1871] CXX obj/src/node_base.compile_cache.o862In file included from ../../src/memory_tracker.h:6,863 from ../../src/base_object.h:29,864 from ../../src/async_wrap.h:27,865 from ../../src/debug_utils.h:6,866 from ../../src/debug_utils-inl.h:6,867 from ../../src/compile_cache.cc:3:868../../deps/v8/include/v8-profiler.h: In constructor 'v8::HeapProfiler::HeapSnapshotOptions::HeapSnapshotOptions()':869../../deps/v8/include/v8-profiler.h:1128:27: warning: 'v8::HeapProfiler::HeapSnapshotOptions::global_object_name_resolver' is deprecated: Use context_name_resolver callback instead. [-Wdeprecated-declarations]870 1128 | HeapSnapshotOptions() {}871 | ^872../../deps/v8/include/v8-profiler.h:1142:25: note: declared here873 1142 | ObjectNameResolver* global_object_name_resolver = nullptr;874 | ^~~~~~~~~~~~~~~~~~~~~~~~~~~875../../deps/v8/include/v8-profiler.h:1128:27: warning: 'v8::HeapProfiler::HeapSnapshotOptions::global_object_name_resolver' is deprecated: Use context_name_resolver callback instead. [-Wdeprecated-declarations]876 1128 | HeapSnapshotOptions() {}877 | ^878../../deps/v8/include/v8-profiler.h:1142:25: note: declared here879 1142 | ObjectNameResolver* global_object_name_resolver = nullptr;880 | ^~~~~~~~~~~~~~~~~~~~~~~~~~~881[178/1871] CXX obj/src/node_base.async_wrap.o882In file included from ../../src/memory_tracker.h:6,883 from ../../src/base_object.h:29,884 from ../../src/async_wrap.h:27,885 from ../../src/async_wrap.cc:22:886../../deps/v8/include/v8-profiler.h: In constructor 'v8::HeapProfiler::HeapSnapshotOptions::HeapSnapshotOptions()':887../../deps/v8/include/v8-profiler.h:1128:27: warning: 'v8::HeapProfiler::HeapSnapshotOptions::global_object_name_resolver' is deprecated: Use context_name_resolver callback instead. [-Wdeprecated-declarations]888 1128 | HeapSnapshotOptions() {}889 | ^890../../deps/v8/include/v8-profiler.h:1142:25: note: declared here891 1142 | ObjectNameResolver* global_object_name_resolver = nullptr;892 | ^~~~~~~~~~~~~~~~~~~~~~~~~~~893../../deps/v8/include/v8-profiler.h:1128:27: warning: 'v8::HeapProfiler::HeapSnapshotOptions::global_object_name_resolver' is deprecated: Use context_name_resolver callback instead. [-Wdeprecated-declarations]894 1128 | HeapSnapshotOptions() {}895 | ^896../../deps/v8/include/v8-profiler.h:1142:25: note: declared here897 1142 | ObjectNameResolver* global_object_name_resolver = nullptr;898 | ^~~~~~~~~~~~~~~~~~~~~~~~~~~899[179/1871] CXX obj/src/node_base.node_api.o900In file included from ../../src/memory_tracker.h:6,901 from ../../src/base_object.h:29,902 from ../../src/async_context_frame.h:6,903 from ../../src/node_api.cc:1:904../../deps/v8/include/v8-profiler.h: In constructor 'v8::HeapProfiler::HeapSnapshotOptions::HeapSnapshotOptions()':905../../deps/v8/include/v8-profiler.h:1128:27: warning: 'v8::HeapProfiler::HeapSnapshotOptions::global_object_name_resolver' is deprecated: Use context_name_resolver callback instead. [-Wdeprecated-declarations]906 1128 | HeapSnapshotOptions() {}907 | ^908../../deps/v8/include/v8-profiler.h:1142:25: note: declared here909 1142 | ObjectNameResolver* global_object_name_resolver = nullptr;910 | ^~~~~~~~~~~~~~~~~~~~~~~~~~~911../../deps/v8/include/v8-profiler.h:1128:27: warning: 'v8::HeapProfiler::HeapSnapshotOptions::global_object_name_resolver' is deprecated: Use context_name_resolver callback instead. [-Wdeprecated-declarations]912 1128 | HeapSnapshotOptions() {}913 | ^914../../deps/v8/include/v8-profiler.h:1142:25: note: declared here915 1142 | ObjectNameResolver* global_object_name_resolver = nullptr;916 | ^~~~~~~~~~~~~~~~~~~~~~~~~~~917[180/1871] CXX obj/src/node_base.node.o918In file included from ../../src/memory_tracker.h:6,919 from ../../src/aliased_buffer.h:7,920 from ../../src/env.h:27,921 from ../../src/node_internals.h:27,922 from ../../src/node_config_file.h:12,923 from ../../src/node.cc:23:924../../deps/v8/include/v8-profiler.h: In constructor 'v8::HeapProfiler::HeapSnapshotOptions::HeapSnapshotOptions()':925../../deps/v8/include/v8-profiler.h:1128:27: warning: 'v8::HeapProfiler::HeapSnapshotOptions::global_object_name_resolver' is deprecated: Use context_name_resolver callback instead. [-Wdeprecated-declarations]926 1128 | HeapSnapshotOptions() {}927 | ^928../../deps/v8/include/v8-profiler.h:1142:25: note: declared here929 1142 | ObjectNameResolver* global_object_name_resolver = nullptr;930 | ^~~~~~~~~~~~~~~~~~~~~~~~~~~931../../deps/v8/include/v8-profiler.h:1128:27: warning: 'v8::HeapProfiler::HeapSnapshotOptions::global_object_name_resolver' is deprecated: Use context_name_resolver callback instead. [-Wdeprecated-declarations]932 1128 | HeapSnapshotOptions() {}933 | ^934../../deps/v8/include/v8-profiler.h:1142:25: note: declared here935 1142 | ObjectNameResolver* global_object_name_resolver = nullptr;936 | ^~~~~~~~~~~~~~~~~~~~~~~~~~~937[181/1871] CXX obj/src/node_base.node_config.o938In file included from ../../src/memory_tracker.h:6,939 from ../../src/aliased_buffer.h:7,940 from ../../src/aliased_buffer-inl.h:6,941 from ../../src/env-inl.h:27,942 from ../../src/node_config.cc:1:943../../deps/v8/include/v8-profiler.h: In constructor 'v8::HeapProfiler::HeapSnapshotOptions::HeapSnapshotOptions()':944../../deps/v8/include/v8-profiler.h:1128:27: warning: 'v8::HeapProfiler::HeapSnapshotOptions::global_object_name_resolver' is deprecated: Use context_name_resolver callback instead. [-Wdeprecated-declarations]945 1128 | HeapSnapshotOptions() {}946 | ^947../../deps/v8/include/v8-profiler.h:1142:25: note: declared here948 1142 | ObjectNameResolver* global_object_name_resolver = nullptr;949 | ^~~~~~~~~~~~~~~~~~~~~~~~~~~950../../deps/v8/include/v8-profiler.h:1128:27: warning: 'v8::HeapProfiler::HeapSnapshotOptions::global_object_name_resolver' is deprecated: Use context_name_resolver callback instead. [-Wdeprecated-declarations]951 1128 | HeapSnapshotOptions() {}952 | ^953../../deps/v8/include/v8-profiler.h:1142:25: note: declared here954 1142 | ObjectNameResolver* global_object_name_resolver = nullptr;955 | ^~~~~~~~~~~~~~~~~~~~~~~~~~~956[182/1871] CXX obj/src/node_base.node_credentials.o957In file included from ../../src/memory_tracker.h:6,958 from ../../src/aliased_buffer.h:7,959 from ../../src/aliased_buffer-inl.h:6,960 from ../../src/env-inl.h:27,961 from ../../src/node_credentials.cc:1:962../../deps/v8/include/v8-profiler.h: In constructor 'v8::HeapProfiler::HeapSnapshotOptions::HeapSnapshotOptions()':963../../deps/v8/include/v8-profiler.h:1128:27: warning: 'v8::HeapProfiler::HeapSnapshotOptions::global_object_name_resolver' is deprecated: Use context_name_resolver callback instead. [-Wdeprecated-declarations]964 1128 | HeapSnapshotOptions() {}965 | ^966../../deps/v8/include/v8-profiler.h:1142:25: note: declared here967 1142 | ObjectNameResolver* global_object_name_resolver = nullptr;968 | ^~~~~~~~~~~~~~~~~~~~~~~~~~~969../../deps/v8/include/v8-profiler.h:1128:27: warning: 'v8::HeapProfiler::HeapSnapshotOptions::global_object_name_resolver' is deprecated: Use context_name_resolver callback instead. [-Wdeprecated-declarations]970 1128 | HeapSnapshotOptions() {}971 | ^972../../deps/v8/include/v8-profiler.h:1142:25: note: declared here973 1142 | ObjectNameResolver* global_object_name_resolver = nullptr;974 | ^~~~~~~~~~~~~~~~~~~~~~~~~~~975[183/1871] CXX obj/src/node_base.node_blob.o976In file included from ../../src/memory_tracker.h:6,977 from ../../src/base_object.h:29,978 from ../../src/async_wrap.h:27,979 from ../../src/node_blob.h:8,980 from ../../src/node_blob.cc:1:981../../deps/v8/include/v8-profiler.h: In constructor 'v8::HeapProfiler::HeapSnapshotOptions::HeapSnapshotOptions()':982../../deps/v8/include/v8-profiler.h:1128:27: warning: 'v8::HeapProfiler::HeapSnapshotOptions::global_object_name_resolver' is deprecated: Use context_name_resolver callback instead. [-Wdeprecated-declarations]983 1128 | HeapSnapshotOptions() {}984 | ^985../../deps/v8/include/v8-profiler.h:1142:25: note: declared here986 1142 | ObjectNameResolver* global_object_name_resolver = nullptr;987 | ^~~~~~~~~~~~~~~~~~~~~~~~~~~988../../deps/v8/include/v8-profiler.h:1128:27: warning: 'v8::HeapProfiler::HeapSnapshotOptions::global_object_name_resolver' is deprecated: Use context_name_resolver callback instead. [-Wdeprecated-declarations]989 1128 | HeapSnapshotOptions() {}990 | ^991../../deps/v8/include/v8-profiler.h:1142:25: note: declared here992 1142 | ObjectNameResolver* global_object_name_resolver = nullptr;993 | ^~~~~~~~~~~~~~~~~~~~~~~~~~~994[184/1871] CXX obj/src/node_base.node_constants.o995In file included from ../../src/memory_tracker.h:6,996 from ../../src/aliased_buffer.h:7,997 from ../../src/aliased_buffer-inl.h:6,998 from ../../src/env-inl.h:27,999 from ../../src/node_constants.cc:22:1000../../deps/v8/include/v8-profiler.h: In constructor 'v8::HeapProfiler::HeapSnapshotOptions::HeapSnapshotOptions()':1001../../deps/v8/include/v8-profiler.h:1128:27: warning: 'v8::HeapProfiler::HeapSnapshotOptions::global_object_name_resolver' is deprecated: Use context_name_resolver callback instead. [-Wdeprecated-declarations]1002 1128 | HeapSnapshotOptions() {}1003 | ^1004../../deps/v8/include/v8-profiler.h:1142:25: note: declared here1005 1142 | ObjectNameResolver* global_object_name_resolver = nullptr;1006 | ^~~~~~~~~~~~~~~~~~~~~~~~~~~1007../../deps/v8/include/v8-profiler.h:1128:27: warning: 'v8::HeapProfiler::HeapSnapshotOptions::global_object_name_resolver' is deprecated: Use context_name_resolver callback instead. [-Wdeprecated-declarations]1008 1128 | HeapSnapshotOptions() {}1009 | ^1010../../deps/v8/include/v8-profiler.h:1142:25: note: declared here1011 1142 | ObjectNameResolver* global_object_name_resolver = nullptr;1012 | ^~~~~~~~~~~~~~~~~~~~~~~~~~~1013[185/1871] CXX obj/src/node_base.node_binding.o1014In file included from ../../src/memory_tracker.h:6,1015 from ../../src/aliased_buffer.h:7,1016 from ../../src/aliased_buffer-inl.h:6,1017 from ../../src/env-inl.h:27,1018 from ../../src/node_binding.cc:3:1019../../deps/v8/include/v8-profiler.h: In constructor 'v8::HeapProfiler::HeapSnapshotOptions::HeapSnapshotOptions()':1020../../deps/v8/include/v8-profiler.h:1128:27: warning: 'v8::HeapProfiler::HeapSnapshotOptions::global_object_name_resolver' is deprecated: Use context_name_resolver callback instead. [-Wdeprecated-declarations]1021 1128 | HeapSnapshotOptions() {}1022 | ^1023../../deps/v8/include/v8-profiler.h:1142:25: note: declared here1024 1142 | ObjectNameResolver* global_object_name_resolver = nullptr;1025 | ^~~~~~~~~~~~~~~~~~~~~~~~~~~1026../../deps/v8/include/v8-profiler.h:1128:27: warning: 'v8::HeapProfiler::HeapSnapshotOptions::global_object_name_resolver' is deprecated: Use context_name_resolver callback instead. [-Wdeprecated-declarations]1027 1128 | HeapSnapshotOptions() {}1028 | ^1029../../deps/v8/include/v8-profiler.h:1142:25: note: declared here1030 1142 | ObjectNameResolver* global_object_name_resolver = nullptr;1031 | ^~~~~~~~~~~~~~~~~~~~~~~~~~~1032[186/1871] CXX obj/src/node_base.node_profiling.o1033In file included from ../../src/node_profiling.h:6,1034 from ../../src/node_profiling.cc:1:1035../../deps/v8/include/v8-profiler.h: In constructor 'v8::HeapProfiler::HeapSnapshotOptions::HeapSnapshotOptions()':1036../../deps/v8/include/v8-profiler.h:1128:27: warning: 'v8::HeapProfiler::HeapSnapshotOptions::global_object_name_resolver' is deprecated: Use context_name_resolver callback instead. [-Wdeprecated-declarations]1037 1128 | HeapSnapshotOptions() {}1038 | ^1039../../deps/v8/include/v8-profiler.h:1142:25: note: declared here1040 1142 | ObjectNameResolver* global_object_name_resolver = nullptr;1041 | ^~~~~~~~~~~~~~~~~~~~~~~~~~~1042../../deps/v8/include/v8-profiler.h:1128:27: warning: 'v8::HeapProfiler::HeapSnapshotOptions::global_object_name_resolver' is deprecated: Use context_name_resolver callback instead. [-Wdeprecated-declarations]1043 1128 | HeapSnapshotOptions() {}1044 | ^1045../../deps/v8/include/v8-profiler.h:1142:25: note: declared here1046 1142 | ObjectNameResolver* global_object_name_resolver = nullptr;1047 | ^~~~~~~~~~~~~~~~~~~~~~~~~~~1048[187/1871] CXX obj/src/node_base.module_wrap.o1049In file included from ../../src/memory_tracker.h:6,1050 from ../../src/base_object.h:29,1051 from ../../src/module_wrap.h:10,1052 from ../../src/module_wrap.cc:1:1053../../deps/v8/include/v8-profiler.h: In constructor 'v8::HeapProfiler::HeapSnapshotOptions::HeapSnapshotOptions()':1054../../deps/v8/include/v8-profiler.h:1128:27: warning: 'v8::HeapProfiler::HeapSnapshotOptions::global_object_name_resolver' is deprecated: Use context_name_resolver callback instead. [-Wdeprecated-declarations]1055 1128 | HeapSnapshotOptions() {}1056 | ^1057../../deps/v8/include/v8-profiler.h:1142:25: note: declared here1058 1142 | ObjectNameResolver* global_object_name_resolver = nullptr;1059 | ^~~~~~~~~~~~~~~~~~~~~~~~~~~1060../../deps/v8/include/v8-profiler.h:1128:27: warning: 'v8::HeapProfiler::HeapSnapshotOptions::global_object_name_resolver' is deprecated: Use context_name_resolver callback instead. [-Wdeprecated-declarations]1061 1128 | HeapSnapshotOptions() {}1062 | ^1063../../deps/v8/include/v8-profiler.h:1142:25: note: declared here1064 1142 | ObjectNameResolver* global_object_name_resolver = nullptr;1065 | ^~~~~~~~~~~~~~~~~~~~~~~~~~~1066[188/1871] CXX obj/src/node_base.node_config_file.o1067In file included from ../../src/memory_tracker.h:6,1068 from ../../src/aliased_buffer.h:7,1069 from ../../src/env.h:27,1070 from ../../src/node_internals.h:27,1071 from ../../src/node_config_file.h:12,1072 from ../../src/node_config_file.cc:1:1073../../deps/v8/include/v8-profiler.h: In constructor 'v8::HeapProfiler::HeapSnapshotOptions::HeapSnapshotOptions()':1074../../deps/v8/include/v8-profiler.h:1128:27: warning: 'v8::HeapProfiler::HeapSnapshotOptions::global_object_name_resolver' is deprecated: Use context_name_resolver callback instead. [-Wdeprecated-declarations]1075 1128 | HeapSnapshotOptions() {}1076 | ^1077../../deps/v8/include/v8-profiler.h:1142:25: note: declared here1078 1142 | ObjectNameResolver* global_object_name_resolver = nullptr;1079 | ^~~~~~~~~~~~~~~~~~~~~~~~~~~1080../../deps/v8/include/v8-profiler.h:1128:27: warning: 'v8::HeapProfiler::HeapSnapshotOptions::global_object_name_resolver' is deprecated: Use context_name_resolver callback instead. [-Wdeprecated-declarations]1081 1128 | HeapSnapshotOptions() {}1082 | ^1083../../deps/v8/include/v8-profiler.h:1142:25: note: declared here1084 1142 | ObjectNameResolver* global_object_name_resolver = nullptr;1085 | ^~~~~~~~~~~~~~~~~~~~~~~~~~~1086[189/1871] CXX obj/src/node_base.node_errors.o1087In file included from ../../src/memory_tracker.h:6,1088 from ../../src/base_object.h:29,1089 from ../../src/async_wrap.h:27,1090 from ../../src/debug_utils.h:6,1091 from ../../src/debug_utils-inl.h:6,1092 from ../../src/node_errors.cc:6:1093../../deps/v8/include/v8-profiler.h: In constructor 'v8::HeapProfiler::HeapSnapshotOptions::HeapSnapshotOptions()':1094../../deps/v8/include/v8-profiler.h:1128:27: warning: 'v8::HeapProfiler::HeapSnapshotOptions::global_object_name_resolver' is deprecated: Use context_name_resolver callback instead. [-Wdeprecated-declarations]1095 1128 | HeapSnapshotOptions() {}1096 | ^1097../../deps/v8/include/v8-profiler.h:1142:25: note: declared here1098 1142 | ObjectNameResolver* global_object_name_resolver = nullptr;1099 | ^~~~~~~~~~~~~~~~~~~~~~~~~~~1100../../deps/v8/include/v8-profiler.h:1128:27: warning: 'v8::HeapProfiler::HeapSnapshotOptions::global_object_name_resolver' is deprecated: Use context_name_resolver callback instead. [-Wdeprecated-declarations]1101 1128 | HeapSnapshotOptions() {}1102 | ^1103../../deps/v8/include/v8-profiler.h:1142:25: note: declared here1104 1142 | ObjectNameResolver* global_object_name_resolver = nullptr;1105 | ^~~~~~~~~~~~~~~~~~~~~~~~~~~1106[190/1871] CXX obj/src/node_base.node_dir.o1107In file included from ../../src/memory_tracker.h:6,1108 from ../../src/aliased_buffer.h:7,1109 from ../../src/node_file.h:7,1110 from ../../src/node_dir.h:6,1111 from ../../src/node_dir.cc:1:1112../../deps/v8/include/v8-profiler.h: In constructor 'v8::HeapProfiler::HeapSnapshotOptions::HeapSnapshotOptions()':1113../../deps/v8/include/v8-profiler.h:1128:27: warning: 'v8::HeapProfiler::HeapSnapshotOptions::global_object_name_resolver' is deprecated: Use context_name_resolver callback instead. [-Wdeprecated-declarations]1114 1128 | HeapSnapshotOptions() {}1115 | ^1116../../deps/v8/include/v8-profiler.h:1142:25: note: declared here1117 1142 | ObjectNameResolver* global_object_name_resolver = nullptr;1118 | ^~~~~~~~~~~~~~~~~~~~~~~~~~~1119../../deps/v8/include/v8-profiler.h:1128:27: warning: 'v8::HeapProfiler::HeapSnapshotOptions::global_object_name_resolver' is deprecated: Use context_name_resolver callback instead. [-Wdeprecated-declarations]1120 1128 | HeapSnapshotOptions() {}1121 | ^1122../../deps/v8/include/v8-profiler.h:1142:25: note: declared here1123 1142 | ObjectNameResolver* global_object_name_resolver = nullptr;1124 | ^~~~~~~~~~~~~~~~~~~~~~~~~~~1125[191/1871] CXX obj/src/node_base.node_cjs_lexer.o1126In file included from ../../src/memory_tracker.h:6,1127 from ../../src/aliased_buffer.h:7,1128 from ../../src/aliased_buffer-inl.h:6,1129 from ../../src/env-inl.h:27,1130 from ../../src/node_cjs_lexer.cc:1:1131../../deps/v8/include/v8-profiler.h: In constructor 'v8::HeapProfiler::HeapSnapshotOptions::HeapSnapshotOptions()':1132../../deps/v8/include/v8-profiler.h:1128:27: warning: 'v8::HeapProfiler::HeapSnapshotOptions::global_object_name_resolver' is deprecated: Use context_name_resolver callback instead. [-Wdeprecated-declarations]1133 1128 | HeapSnapshotOptions() {}1134 | ^1135../../deps/v8/include/v8-profiler.h:1142:25: note: declared here1136 1142 | ObjectNameResolver* global_object_name_resolver = nullptr;1137 | ^~~~~~~~~~~~~~~~~~~~~~~~~~~1138../../deps/v8/include/v8-profiler.h:1128:27: warning: 'v8::HeapProfiler::HeapSnapshotOptions::global_object_name_resolver' is deprecated: Use context_name_resolver callback instead. [-Wdeprecated-declarations]1139 1128 | HeapSnapshotOptions() {}1140 | ^1141../../deps/v8/include/v8-profiler.h:1142:25: note: declared here1142 1142 | ObjectNameResolver* global_object_name_resolver = nullptr;1143 | ^~~~~~~~~~~~~~~~~~~~~~~~~~~1144[192/1871] CXX obj/src/node_base.node_dotenv.o1145In file included from ../../src/util.h:29,1146 from ../../src/util-inl.h:33,1147 from ../../src/node_dotenv.h:6,1148 from ../../src/node_dotenv.cc:1:1149../../deps/v8/include/v8-profiler.h: In constructor 'v8::HeapProfiler::HeapSnapshotOptions::HeapSnapshotOptions()':1150../../deps/v8/include/v8-profiler.h:1128:27: warning: 'v8::HeapProfiler::HeapSnapshotOptions::global_object_name_resolver' is deprecated: Use context_name_resolver callback instead. [-Wdeprecated-declarations]1151 1128 | HeapSnapshotOptions() {}1152 | ^1153../../deps/v8/include/v8-profiler.h:1142:25: note: declared here1154 1142 | ObjectNameResolver* global_object_name_resolver = nullptr;1155 | ^~~~~~~~~~~~~~~~~~~~~~~~~~~1156../../deps/v8/include/v8-profiler.h:1128:27: warning: 'v8::HeapProfiler::HeapSnapshotOptions::global_object_name_resolver' is deprecated: Use context_name_resolver callback instead. [-Wdeprecated-declarations]1157 1128 | HeapSnapshotOptions() {}1158 | ^1159../../deps/v8/include/v8-profiler.h:1142:25: note: declared here1160 1142 | ObjectNameResolver* global_object_name_resolver = nullptr;1161 | ^~~~~~~~~~~~~~~~~~~~~~~~~~~1162[193/1871] CXX obj/src/node_base.node_external_reference.o1163In file included from ../../src/memory_tracker.h:6,1164 from ../../src/base_object.h:29,1165 from ../../src/base_object-inl.h:27,1166 from ../../src/node_external_reference.cc:4:1167../../deps/v8/include/v8-profiler.h: In constructor 'v8::HeapProfiler::HeapSnapshotOptions::HeapSnapshotOptions()':1168../../deps/v8/include/v8-profiler.h:1128:27: warning: 'v8::HeapProfiler::HeapSnapshotOptions::global_object_name_resolver' is deprecated: Use context_name_resolver callback instead. [-Wdeprecated-declarations]1169 1128 | HeapSnapshotOptions() {}1170 | ^1171../../deps/v8/include/v8-profiler.h:1142:25: note: declared here1172 1142 | ObjectNameResolver* global_object_name_resolver = nullptr;1173 | ^~~~~~~~~~~~~~~~~~~~~~~~~~~1174../../deps/v8/include/v8-profiler.h:1128:27: warning: 'v8::HeapProfiler::HeapSnapshotOptions::global_object_name_resolver' is deprecated: Use context_name_resolver callback instead. [-Wdeprecated-declarations]1175 1128 | HeapSnapshotOptions() {}1176 | ^1177../../deps/v8/include/v8-profiler.h:1142:25: note: declared here1178 1142 | ObjectNameResolver* global_object_name_resolver = nullptr;1179 | ^~~~~~~~~~~~~~~~~~~~~~~~~~~1180[194/1871] CXX obj/src/node_base.node_builtins.o1181In file included from ../../src/util.h:29,1182 from ../../src/node_mutex.h:6,1183 from ../../src/node_builtins.h:16,1184 from ../../src/node_builtins.cc:1:1185../../deps/v8/include/v8-profiler.h: In constructor 'v8::HeapProfiler::HeapSnapshotOptions::HeapSnapshotOptions()':1186../../deps/v8/include/v8-profiler.h:1128:27: warning: 'v8::HeapProfiler::HeapSnapshotOptions::global_object_name_resolver' is deprecated: Use context_name_resolver callback instead. [-Wdeprecated-declarations]1187 1128 | HeapSnapshotOptions() {}1188 | ^1189../../deps/v8/include/v8-profiler.h:1142:25: note: declared here1190 1142 | ObjectNameResolver* global_object_name_resolver = nullptr;1191 | ^~~~~~~~~~~~~~~~~~~~~~~~~~~1192../../deps/v8/include/v8-profiler.h:1128:27: warning: 'v8::HeapProfiler::HeapSnapshotOptions::global_object_name_resolver' is deprecated: Use context_name_resolver callback instead. [-Wdeprecated-declarations]1193 1128 | HeapSnapshotOptions() {}1194 | ^1195../../deps/v8/include/v8-profiler.h:1142:25: note: declared here1196 1142 | ObjectNameResolver* global_object_name_resolver = nullptr;1197 | ^~~~~~~~~~~~~~~~~~~~~~~~~~~1198[195/1871] CXX obj/src/node_base.node_buffer.o1199In file included from ../../src/memory_tracker.h:6,1200 from ../../src/base_object.h:29,1201 from ../../src/async_wrap.h:27,1202 from ../../src/node_blob.h:8,1203 from ../../src/node_buffer.cc:24:1204../../deps/v8/include/v8-profiler.h: In constructor 'v8::HeapProfiler::HeapSnapshotOptions::HeapSnapshotOptions()':1205../../deps/v8/include/v8-profiler.h:1128:27: warning: 'v8::HeapProfiler::HeapSnapshotOptions::global_object_name_resolver' is deprecated: Use context_name_resolver callback instead. [-Wdeprecated-declarations]1206 1128 | HeapSnapshotOptions() {}1207 | ^1208../../deps/v8/include/v8-profiler.h:1142:25: note: declared here1209 1142 | ObjectNameResolver* global_object_name_resolver = nullptr;1210 | ^~~~~~~~~~~~~~~~~~~~~~~~~~~1211../../deps/v8/include/v8-profiler.h:1128:27: warning: 'v8::HeapProfiler::HeapSnapshotOptions::global_object_name_resolver' is deprecated: Use context_name_resolver callback instead. [-Wdeprecated-declarations]1212 1128 | HeapSnapshotOptions() {}1213 | ^1214../../deps/v8/include/v8-profiler.h:1142:25: note: declared here1215 1142 | ObjectNameResolver* global_object_name_resolver = nullptr;1216 | ^~~~~~~~~~~~~~~~~~~~~~~~~~~1217[196/1871] CXX obj/gen/node_base.node_javascript.o1218In file included from ../../src/memory_tracker.h:6,1219 from ../../src/aliased_buffer.h:7,1220 from ../../src/aliased_buffer-inl.h:6,1221 from ../../src/env-inl.h:27,1222 from gen/node_javascript.cc:2:1223../../deps/v8/include/v8-profiler.h: In constructor 'v8::HeapProfiler::HeapSnapshotOptions::HeapSnapshotOptions()':1224../../deps/v8/include/v8-profiler.h:1128:27: warning: 'v8::HeapProfiler::HeapSnapshotOptions::global_object_name_resolver' is deprecated: Use context_name_resolver callback instead. [-Wdeprecated-declarations]1225 1128 | HeapSnapshotOptions() {}1226 | ^1227../../deps/v8/include/v8-profiler.h:1142:25: note: declared here1228 1142 | ObjectNameResolver* global_object_name_resolver = nullptr;1229 | ^~~~~~~~~~~~~~~~~~~~~~~~~~~1230../../deps/v8/include/v8-profiler.h:1128:27: warning: 'v8::HeapProfiler::HeapSnapshotOptions::global_object_name_resolver' is deprecated: Use context_name_resolver callback instead. [-Wdeprecated-declarations]1231 1128 | HeapSnapshotOptions() {}1232 | ^1233../../deps/v8/include/v8-profiler.h:1142:25: note: declared here1234 1142 | ObjectNameResolver* global_object_name_resolver = nullptr;1235 | ^~~~~~~~~~~~~~~~~~~~~~~~~~~1236[197/1871] CXX obj/src/node_base.node_contextify.o1237In file included from ../../src/memory_tracker.h:6,1238 from ../../src/base_object.h:29,1239 from ../../src/base_object-inl.h:27,1240 from ../../src/node_contextify.h:6,1241 from ../../src/node_contextify.cc:22:1242../../deps/v8/include/v8-profiler.h: In constructor 'v8::HeapProfiler::HeapSnapshotOptions::HeapSnapshotOptions()':1243../../deps/v8/include/v8-profiler.h:1128:27: warning: 'v8::HeapProfiler::HeapSnapshotOptions::global_object_name_resolver' is deprecated: Use context_name_resolver callback instead. [-Wdeprecated-declarations]1244 1128 | HeapSnapshotOptions() {}1245 | ^1246../../deps/v8/include/v8-profiler.h:1142:25: note: declared here1247 1142 | ObjectNameResolver* global_object_name_resolver = nullptr;1248 | ^~~~~~~~~~~~~~~~~~~~~~~~~~~1249../../deps/v8/include/v8-profiler.h:1128:27: warning: 'v8::HeapProfiler::HeapSnapshotOptions::global_object_name_resolver' is deprecated: Use context_name_resolver callback instead. [-Wdeprecated-declarations]1250 1128 | HeapSnapshotOptions() {}1251 | ^1252../../deps/v8/include/v8-profiler.h:1142:25: note: declared here1253 1142 | ObjectNameResolver* global_object_name_resolver = nullptr;1254 | ^~~~~~~~~~~~~~~~~~~~~~~~~~~1255[198/1871] CXX obj/src/node_base.node_i18n.o1256In file included from ../../src/memory_tracker.h:6,1257 from ../../src/base_object.h:29,1258 from ../../src/node_i18n.h:29,1259 from ../../src/node_i18n.cc:43:1260../../deps/v8/include/v8-profiler.h: In constructor 'v8::HeapProfiler::HeapSnapshotOptions::HeapSnapshotOptions()':1261../../deps/v8/include/v8-profiler.h:1128:27: warning: 'v8::HeapProfiler::HeapSnapshotOptions::global_object_name_resolver' is deprecated: Use context_name_resolver callback instead. [-Wdeprecated-declarations]1262 1128 | HeapSnapshotOptions() {}1263 | ^1264../../deps/v8/include/v8-profiler.h:1142:25: note: declared here1265 1142 | ObjectNameResolver* global_object_name_resolver = nullptr;1266 | ^~~~~~~~~~~~~~~~~~~~~~~~~~~1267../../deps/v8/include/v8-profiler.h:1128:27: warning: 'v8::HeapProfiler::HeapSnapshotOptions::global_object_name_resolver' is deprecated: Use context_name_resolver callback instead. [-Wdeprecated-declarations]1268 1128 | HeapSnapshotOptions() {}1269 | ^1270../../deps/v8/include/v8-profiler.h:1142:25: note: declared here1271 1142 | ObjectNameResolver* global_object_name_resolver = nullptr;1272 | ^~~~~~~~~~~~~~~~~~~~~~~~~~~1273[199/1871] CXX obj/src/node_base.node_http_parser.o1274In file included from ../../src/util.h:29,1275 from ../../src/node_http_parser.cc:24:1276../../deps/v8/include/v8-profiler.h: In constructor 'v8::HeapProfiler::HeapSnapshotOptions::HeapSnapshotOptions()':1277../../deps/v8/include/v8-profiler.h:1128:27: warning: 'v8::HeapProfiler::HeapSnapshotOptions::global_object_name_resolver' is deprecated: Use context_name_resolver callback instead. [-Wdeprecated-declarations]1278 1128 | HeapSnapshotOptions() {}1279 | ^1280../../deps/v8/include/v8-profiler.h:1142:25: note: declared here1281 1142 | ObjectNameResolver* global_object_name_resolver = nullptr;1282 | ^~~~~~~~~~~~~~~~~~~~~~~~~~~1283../../deps/v8/include/v8-profiler.h:1128:27: warning: 'v8::HeapProfiler::HeapSnapshotOptions::global_object_name_resolver' is deprecated: Use context_name_resolver callback instead. [-Wdeprecated-declarations]1284 1128 | HeapSnapshotOptions() {}1285 | ^1286../../deps/v8/include/v8-profiler.h:1142:25: note: declared here1287 1142 | ObjectNameResolver* global_object_name_resolver = nullptr;1288 | ^~~~~~~~~~~~~~~~~~~~~~~~~~~1289[200/1871] CXX obj/src/node_base.node_ipc_serdes.o1290In file included from ../../src/memory_tracker.h:6,1291 from ../../src/aliased_buffer.h:7,1292 from ../../src/aliased_buffer-inl.h:6,1293 from ../../src/env-inl.h:27,1294 from ../../src/node_ipc_serdes.cc:1:1295../../deps/v8/include/v8-profiler.h: In constructor 'v8::HeapProfiler::HeapSnapshotOptions::HeapSnapshotOptions()':1296../../deps/v8/include/v8-profiler.h:1128:27: warning: 'v8::HeapProfiler::HeapSnapshotOptions::global_object_name_resolver' is deprecated: Use context_name_resolver callback instead. [-Wdeprecated-declarations]1297 1128 | HeapSnapshotOptions() {}1298 | ^1299../../deps/v8/include/v8-profiler.h:1142:25: note: declared here1300 1142 | ObjectNameResolver* global_object_name_resolver = nullptr;1301 | ^~~~~~~~~~~~~~~~~~~~~~~~~~~1302../../deps/v8/include/v8-profiler.h:1128:27: warning: 'v8::HeapProfiler::HeapSnapshotOptions::global_object_name_resolver' is deprecated: Use context_name_resolver callback instead. [-Wdeprecated-declarations]1303 1128 | HeapSnapshotOptions() {}1304 | ^1305../../deps/v8/include/v8-profiler.h:1142:25: note: declared here1306 1142 | ObjectNameResolver* global_object_name_resolver = nullptr;1307 | ^~~~~~~~~~~~~~~~~~~~~~~~~~~1308[201/1871] CXX obj/src/node_base.node_process_object.o1309In file included from ../../src/memory_tracker.h:6,1310 from ../../src/aliased_buffer.h:7,1311 from ../../src/aliased_buffer-inl.h:6,1312 from ../../src/env-inl.h:27,1313 from ../../src/node_process_object.cc:1:1314../../deps/v8/include/v8-profiler.h: In constructor 'v8::HeapProfiler::HeapSnapshotOptions::HeapSnapshotOptions()':1315../../deps/v8/include/v8-profiler.h:1128:27: warning: 'v8::HeapProfiler::HeapSnapshotOptions::global_object_name_resolver' is deprecated: Use context_name_resolver callback instead. [-Wdeprecated-declarations]1316 1128 | HeapSnapshotOptions() {}1317 | ^1318../../deps/v8/include/v8-profiler.h:1142:25: note: declared here1319 1142 | ObjectNameResolver* global_object_name_resolver = nullptr;1320 | ^~~~~~~~~~~~~~~~~~~~~~~~~~~1321../../deps/v8/include/v8-profiler.h:1128:27: warning: 'v8::HeapProfiler::HeapSnapshotOptions::global_object_name_resolver' is deprecated: Use context_name_resolver callback instead. [-Wdeprecated-declarations]1322 1128 | HeapSnapshotOptions() {}1323 | ^1324../../deps/v8/include/v8-profiler.h:1142:25: note: declared here1325 1142 | ObjectNameResolver* global_object_name_resolver = nullptr;1326 | ^~~~~~~~~~~~~~~~~~~~~~~~~~~1327[202/1871] CXX obj/src/node_base.node_diagnostics_channel.o1328In file included from ../../src/memory_tracker.h:6,1329 from ../../src/aliased_buffer.h:7,1330 from ../../src/node_diagnostics_channel.h:11,1331 from ../../src/node_diagnostics_channel.cc:1:1332../../deps/v8/include/v8-profiler.h: In constructor 'v8::HeapProfiler::HeapSnapshotOptions::HeapSnapshotOptions()':1333../../deps/v8/include/v8-profiler.h:1128:27: warning: 'v8::HeapProfiler::HeapSnapshotOptions::global_object_name_resolver' is deprecated: Use context_name_resolver callback instead. [-Wdeprecated-declarations]1334 1128 | HeapSnapshotOptions() {}1335 | ^1336../../deps/v8/include/v8-profiler.h:1142:25: note: declared here1337 1142 | ObjectNameResolver* global_object_name_resolver = nullptr;1338 | ^~~~~~~~~~~~~~~~~~~~~~~~~~~1339../../deps/v8/include/v8-profiler.h:1128:27: warning: 'v8::HeapProfiler::HeapSnapshotOptions::global_object_name_resolver' is deprecated: Use context_name_resolver callback instead. [-Wdeprecated-declarations]1340 1128 | HeapSnapshotOptions() {}1341 | ^1342../../deps/v8/include/v8-profiler.h:1142:25: note: declared here1343 1142 | ObjectNameResolver* global_object_name_resolver = nullptr;1344 | ^~~~~~~~~~~~~~~~~~~~~~~~~~~1345[203/1871] CXX obj/src/node_base.cares_wrap.o1346In file included from ../../src/memory_tracker.h:6,1347 from ../../src/base_object.h:29,1348 from ../../src/async_wrap.h:27,1349 from ../../src/cares_wrap.h:8,1350 from ../../src/cares_wrap.cc:22:1351../../deps/v8/include/v8-profiler.h: In constructor 'v8::HeapProfiler::HeapSnapshotOptions::HeapSnapshotOptions()':1352../../deps/v8/include/v8-profiler.h:1128:27: warning: 'v8::HeapProfiler::HeapSnapshotOptions::global_object_name_resolver' is deprecated: Use context_name_resolver callback instead. [-Wdeprecated-declarations]1353 1128 | HeapSnapshotOptions() {}1354 | ^1355../../deps/v8/include/v8-profiler.h:1142:25: note: declared here1356 1142 | ObjectNameResolver* global_object_name_resolver = nullptr;1357 | ^~~~~~~~~~~~~~~~~~~~~~~~~~~1358../../deps/v8/include/v8-profiler.h:1128:27: warning: 'v8::HeapProfiler::HeapSnapshotOptions::global_object_name_resolver' is deprecated: Use context_name_resolver callback instead. [-Wdeprecated-declarations]1359 1128 | HeapSnapshotOptions() {}1360 | ^1361../../deps/v8/include/v8-profiler.h:1142:25: note: declared here1362 1142 | ObjectNameResolver* global_object_name_resolver = nullptr;1363 | ^~~~~~~~~~~~~~~~~~~~~~~~~~~1364../../src/cares_wrap.cc: In function 'v8::Maybe<int> node::cares_wrap::{anonymous}::ParseGeneralReply(node::Environment*, const unsigned char*, int, int*, v8::Local<v8::Array>, void*, int*)':1365../../src/cares_wrap.cc:244:34: warning: 'int ares_parse_a_reply(const unsigned char*, int, hostent**, ares_addrttl*, int*)' is deprecated: Use ares_dns_parse instead [-Wdeprecated-declarations]1366 244 | status = ares_parse_a_reply(buf,1367 | ~~~~~~~~~~~~~~~~~~^~~~~1368 245 | len,1369 | ~~~~1370 246 | &host,1371 | ~~~~~~1372 247 | static_cast<ares_addrttl*>(addrttls),1373 | ~~~~~~~~~~~~~~~~~~~~~~~~~~~~~~~~~~~~~1374 248 | naddrttls);1375 | ~~~~~~~~~~1376In file included from ../../src/cares_wrap.h:17:1377/nix/store/j239p458yixap89j6wpfib9yjypd3ii5-c-ares-1.34.8-dev/include/ares.h:1106:55: note: declared here1378 1106 | CARES_EXTERN CARES_DEPRECATED_FOR(ares_dns_parse) int ares_parse_a_reply(1379 | ^~~~~~~~~~~~~~~~~~1380../../src/cares_wrap.cc:251:37: warning: 'int ares_parse_aaaa_reply(const unsigned char*, int, hostent**, ares_addr6ttl*, int*)' is deprecated: Use ares_dns_parse instead [-Wdeprecated-declarations]1381 251 | status = ares_parse_aaaa_reply(buf,1382 | ~~~~~~~~~~~~~~~~~~~~~^~~~~1383 252 | len,1384 | ~~~~1385 253 | &host,1386 | ~~~~~~1387 254 | static_cast<ares_addr6ttl*>(addrttls),1388 | ~~~~~~~~~~~~~~~~~~~~~~~~~~~~~~~~~~~~~~1389 255 | naddrttls);1390 | ~~~~~~~~~~1391/nix/store/j239p458yixap89j6wpfib9yjypd3ii5-c-ares-1.34.8-dev/include/ares.h:1110:55: note: declared here1392 1110 | CARES_EXTERN CARES_DEPRECATED_FOR(ares_dns_parse) int ares_parse_aaaa_reply(1393 | ^~~~~~~~~~~~~~~~~~~~~1394../../src/cares_wrap.cc:258:35: warning: 'int ares_parse_ns_reply(const unsigned char*, int, hostent**)' is deprecated: Use ares_dns_parse instead [-Wdeprecated-declarations]1395 258 | status = ares_parse_ns_reply(buf, len, &host);1396 | ~~~~~~~~~~~~~~~~~~~^~~~~~~~~~~~~~~~~1397/nix/store/j239p458yixap89j6wpfib9yjypd3ii5-c-ares-1.34.8-dev/include/ares.h:1121:55: note: declared here1398 1121 | CARES_EXTERN CARES_DEPRECATED_FOR(ares_dns_parse) int ares_parse_ns_reply(1399 | ^~~~~~~~~~~~~~~~~~~1400../../src/cares_wrap.cc:261:36: warning: 'int ares_parse_ptr_reply(const unsigned char*, int, const void*, int, int, hostent**)' is deprecated: Use ares_dns_parse instead [-Wdeprecated-declarations]1401 261 | status = ares_parse_ptr_reply(buf, len, nullptr, 0, AF_INET, &host);1402 | ~~~~~~~~~~~~~~~~~~~~^~~~~~~~~~~~~~~~~~~~~~~~~~~~~~~~~~~~~~1403/nix/store/j239p458yixap89j6wpfib9yjypd3ii5-c-ares-1.34.8-dev/include/ares.h:1117:55: note: declared here1404 1117 | CARES_EXTERN CARES_DEPRECATED_FOR(ares_dns_parse) int ares_parse_ptr_reply(1405 | ^~~~~~~~~~~~~~~~~~~~1406../../src/cares_wrap.cc: In function 'v8::Maybe<int> node::cares_wrap::{anonymous}::ParseMxReply(node::Environment*, const unsigned char*, int, v8::Local<v8::Array>, bool)':1407../../src/cares_wrap.cc:337:35: warning: 'int ares_parse_mx_reply(const unsigned char*, int, ares_mx_reply**)' is deprecated: Use ares_dns_parse instead [-Wdeprecated-declarations]1408 337 | int status = ares_parse_mx_reply(buf, len, &mx_start);1409 | ~~~~~~~~~~~~~~~~~~~^~~~~~~~~~~~~~~~~~~~~1410/nix/store/j239p458yixap89j6wpfib9yjypd3ii5-c-ares-1.34.8-dev/include/ares.h:1127:55: note: declared here1411 1127 | CARES_EXTERN CARES_DEPRECATED_FOR(ares_dns_parse) int ares_parse_mx_reply(1412 | ^~~~~~~~~~~~~~~~~~~1413../../src/cares_wrap.cc: In function 'v8::Maybe<int> node::cares_wrap::{anonymous}::ParseCaaReply(node::Environment*, const unsigned char*, int, v8::Local<v8::Array>, bool)':1414../../src/cares_wrap.cc:383:36: warning: 'int ares_parse_caa_reply(const unsigned char*, int, ares_caa_reply**)' is deprecated: Use ares_dns_parse instead [-Wdeprecated-declarations]1415 383 | int status = ares_parse_caa_reply(buf, len, &caa_start);1416 | ~~~~~~~~~~~~~~~~~~~~^~~~~~~~~~~~~~~~~~~~~~1417/nix/store/j239p458yixap89j6wpfib9yjypd3ii5-c-ares-1.34.8-dev/include/ares.h:1114:55: note: declared here1418 1114 | CARES_EXTERN CARES_DEPRECATED_FOR(ares_dns_parse) int ares_parse_caa_reply(1419 | ^~~~~~~~~~~~~~~~~~~~1420../../src/cares_wrap.cc: In function 'v8::Maybe<int> node::cares_wrap::{anonymous}::ParseTxtReply(node::Environment*, const unsigned char*, int, v8::Local<v8::Array>, bool)':1421../../src/cares_wrap.cc:511:40: warning: 'int ares_parse_txt_reply_ext(const unsigned char*, int, ares_txt_ext**)' is deprecated: Use ares_dns_parse instead [-Wdeprecated-declarations]1422 511 | int status = ares_parse_txt_reply_ext(buf, len, &txt_out);1423 | ~~~~~~~~~~~~~~~~~~~~~~~~^~~~~~~~~~~~~~~~~~~~1424/nix/store/j239p458yixap89j6wpfib9yjypd3ii5-c-ares-1.34.8-dev/include/ares.h:1133:55: note: declared here1425 1133 | CARES_EXTERN CARES_DEPRECATED_FOR(ares_dns_parse) int ares_parse_txt_reply_ext(1426 | ^~~~~~~~~~~~~~~~~~~~~~~~1427../../src/cares_wrap.cc: In function 'v8::Maybe<int> node::cares_wrap::{anonymous}::ParseSrvReply(node::Environment*, const unsigned char*, int, v8::Local<v8::Array>, bool)':1428../../src/cares_wrap.cc:598:36: warning: 'int ares_parse_srv_reply(const unsigned char*, int, ares_srv_reply**)' is deprecated: Use ares_dns_parse instead [-Wdeprecated-declarations]1429 598 | int status = ares_parse_srv_reply(buf, len, &srv_start);1430 | ~~~~~~~~~~~~~~~~~~~~^~~~~~~~~~~~~~~~~~~~~~1431/nix/store/j239p458yixap89j6wpfib9yjypd3ii5-c-ares-1.34.8-dev/include/ares.h:1124:55: note: declared here1432 1124 | CARES_EXTERN CARES_DEPRECATED_FOR(ares_dns_parse) int ares_parse_srv_reply(1433 | ^~~~~~~~~~~~~~~~~~~~1434../../src/cares_wrap.cc: In function 'v8::Maybe<int> node::cares_wrap::{anonymous}::ParseNaptrReply(node::Environment*, const unsigned char*, int, v8::Local<v8::Array>, bool)':1435../../src/cares_wrap.cc:653:38: warning: 'int ares_parse_naptr_reply(const unsigned char*, int, ares_naptr_reply**)' is deprecated: Use ares_dns_parse instead [-Wdeprecated-declarations]1436 653 | int status = ares_parse_naptr_reply(buf, len, &naptr_start);1437 | ~~~~~~~~~~~~~~~~~~~~~~^~~~~~~~~~~~~~~~~~~~~~~~1438/nix/store/j239p458yixap89j6wpfib9yjypd3ii5-c-ares-1.34.8-dev/include/ares.h:1136:55: note: declared here1439 1136 | CARES_EXTERN CARES_DEPRECATED_FOR(ares_dns_parse) int ares_parse_naptr_reply(1440 | ^~~~~~~~~~~~~~~~~~~~~~1441../../src/cares_wrap.cc: In member function 'void node::cares_wrap::ChannelWrap::EnsureServers()':1442../../src/cares_wrap.cc:1000:25: warning: 'int ares_get_servers_ports(const ares_channel_t*, ares_addr_port_node**)' is deprecated: Use ares_get_servers_csv instead [-Wdeprecated-declarations]1443 1000 | ares_get_servers_ports(channel_, &servers);1444 | ~~~~~~~~~~~~~~~~~~~~~~^~~~~~~~~~~~~~~~~~~~1445/nix/store/j239p458yixap89j6wpfib9yjypd3ii5-c-ares-1.34.8-dev/include/ares.h:1196:28: note: declared here1446 1196 | int ares_get_servers_ports(const ares_channel_t *channel,1447 | ^~~~~~~~~~~~~~~~~~~~~~1448../../src/cares_wrap.cc: In static member function 'static v8::Maybe<int> node::cares_wrap::SoaTraits::Parse(node::cares_wrap::QuerySoaWrap*, const std::unique_ptr<node::cares_wrap::ResponseData>&)':1449../../src/cares_wrap.cc:1711:36: warning: 'int ares_parse_soa_reply(const unsigned char*, int, ares_soa_reply**)' is deprecated: Use ares_dns_parse instead [-Wdeprecated-declarations]1450 1711 | int status = ares_parse_soa_reply(buf, len, &soa_out);1451 | ~~~~~~~~~~~~~~~~~~~~^~~~~~~~~~~~~~~~~~~~1452/nix/store/j239p458yixap89j6wpfib9yjypd3ii5-c-ares-1.34.8-dev/include/ares.h:1139:55: note: declared here1453 1139 | CARES_EXTERN CARES_DEPRECATED_FOR(ares_dns_parse) int ares_parse_soa_reply(1454 | ^~~~~~~~~~~~~~~~~~~~1455../../src/cares_wrap.cc: In function 'void node::cares_wrap::{anonymous}::GetServers(const v8::FunctionCallbackInfo<v8::Value>&)':1456../../src/cares_wrap.cc:2092:33: warning: 'int ares_get_servers_ports(const ares_channel_t*, ares_addr_port_node**)' is deprecated: Use ares_get_servers_csv instead [-Wdeprecated-declarations]1457 2092 | int r = ares_get_servers_ports(channel->cares_channel(), &servers);1458 | ~~~~~~~~~~~~~~~~~~~~~~^~~~~~~~~~~~~~~~~~~~~~~~~~~~~~~~~~~~1459/nix/store/j239p458yixap89j6wpfib9yjypd3ii5-c-ares-1.34.8-dev/include/ares.h:1196:28: note: declared here1460 1196 | int ares_get_servers_ports(const ares_channel_t *channel,1461 | ^~~~~~~~~~~~~~~~~~~~~~1462../../src/cares_wrap.cc: In function 'void node::cares_wrap::{anonymous}::SetServers(const v8::FunctionCallbackInfo<v8::Value>&)':1463../../src/cares_wrap.cc:2137:30: warning: 'int ares_set_servers(ares_channel_t*, const ares_addr_node*)' is deprecated: Use ares_set_servers_csv instead [-Wdeprecated-declarations]1464 2137 | int rv = ares_set_servers(channel->cares_channel(), nullptr);1465 | ~~~~~~~~~~~~~~~~^~~~~~~~~~~~~~~~~~~~~~~~~~~~~~~~~~~1466/nix/store/j239p458yixap89j6wpfib9yjypd3ii5-c-ares-1.34.8-dev/include/ares.h:1176:61: note: declared here1467 1176 | CARES_EXTERN CARES_DEPRECATED_FOR(ares_set_servers_csv) int ares_set_servers(1468 | ^~~~~~~~~~~~~~~~1469../../src/cares_wrap.cc:2197:33: warning: 'int ares_set_servers_ports(ares_channel_t*, const ares_addr_port_node*)' is deprecated: Use ares_set_servers_ports_csv instead [-Wdeprecated-declarations]1470 2197 | err = ares_set_servers_ports(channel->cares_channel(), servers.data());1471 | ~~~~~~~~~~~~~~~~~~~~~~^~~~~~~~~~~~~~~~~~~~~~~~~~~~~~~~~~~~~~~~~~1472/nix/store/j239p458yixap89j6wpfib9yjypd3ii5-c-ares-1.34.8-dev/include/ares.h:1181:20: note: declared here1473 1181 | int ares_set_servers_ports(ares_channel_t *channel,1474 | ^~~~~~~~~~~~~~~~~~~~~~1475[204/1871] CXX obj/src/node_base.node_report_utils.o1476In file included from ../../src/memory_tracker.h:6,1477 from ../../src/aliased_buffer.h:7,1478 from ../../src/env.h:27,1479 from ../../src/node_internals.h:27,1480 from ../../src/node_report_utils.cc:2:1481../../deps/v8/include/v8-profiler.h: In constructor 'v8::HeapProfiler::HeapSnapshotOptions::HeapSnapshotOptions()':1482../../deps/v8/include/v8-profiler.h:1128:27: warning: 'v8::HeapProfiler::HeapSnapshotOptions::global_object_name_resolver' is deprecated: Use context_name_resolver callback instead. [-Wdeprecated-declarations]1483 1128 | HeapSnapshotOptions() {}1484 | ^1485../../deps/v8/include/v8-profiler.h:1142:25: note: declared here1486 1142 | ObjectNameResolver* global_object_name_resolver = nullptr;1487 | ^~~~~~~~~~~~~~~~~~~~~~~~~~~1488../../deps/v8/include/v8-profiler.h:1128:27: warning: 'v8::HeapProfiler::HeapSnapshotOptions::global_object_name_resolver' is deprecated: Use context_name_resolver callback instead. [-Wdeprecated-declarations]1489 1128 | HeapSnapshotOptions() {}1490 | ^1491../../deps/v8/include/v8-profiler.h:1142:25: note: declared here1492 1142 | ObjectNameResolver* global_object_name_resolver = nullptr;1493 | ^~~~~~~~~~~~~~~~~~~~~~~~~~~1494[205/1871] CXX obj/src/node_base.node_process_events.o1495In file included from ../../src/memory_tracker.h:6,1496 from ../../src/aliased_buffer.h:7,1497 from ../../src/aliased_buffer-inl.h:6,1498 from ../../src/env-inl.h:27,1499 from ../../src/node_process_events.cc:3:1500../../deps/v8/include/v8-profiler.h: In constructor 'v8::HeapProfiler::HeapSnapshotOptions::HeapSnapshotOptions()':1501../../deps/v8/include/v8-profiler.h:1128:27: warning: 'v8::HeapProfiler::HeapSnapshotOptions::global_object_name_resolver' is deprecated: Use context_name_resolver callback instead. [-Wdeprecated-declarations]1502 1128 | HeapSnapshotOptions() {}1503 | ^1504../../deps/v8/include/v8-profiler.h:1142:25: note: declared here1505 1142 | ObjectNameResolver* global_object_name_resolver = nullptr;1506 | ^~~~~~~~~~~~~~~~~~~~~~~~~~~1507../../deps/v8/include/v8-profiler.h:1128:27: warning: 'v8::HeapProfiler::HeapSnapshotOptions::global_object_name_resolver' is deprecated: Use context_name_resolver callback instead. [-Wdeprecated-declarations]1508 1128 | HeapSnapshotOptions() {}1509 | ^1510../../deps/v8/include/v8-profiler.h:1142:25: note: declared here1511 1142 | ObjectNameResolver* global_object_name_resolver = nullptr;1512 | ^~~~~~~~~~~~~~~~~~~~~~~~~~~1513[206/1871] CXX obj/src/node_base.node_postmortem_metadata.o1514In file included from ../../src/memory_tracker.h:6,1515 from ../../src/base_object.h:29,1516 from ../../src/base_object-inl.h:27,1517 from ../../src/node_postmortem_metadata.cc:1:1518../../deps/v8/include/v8-profiler.h: In constructor 'v8::HeapProfiler::HeapSnapshotOptions::HeapSnapshotOptions()':1519../../deps/v8/include/v8-profiler.h:1128:27: warning: 'v8::HeapProfiler::HeapSnapshotOptions::global_object_name_resolver' is deprecated: Use context_name_resolver callback instead. [-Wdeprecated-declarations]1520 1128 | HeapSnapshotOptions() {}1521 | ^1522../../deps/v8/include/v8-profiler.h:1142:25: note: declared here1523 1142 | ObjectNameResolver* global_object_name_resolver = nullptr;1524 | ^~~~~~~~~~~~~~~~~~~~~~~~~~~1525../../deps/v8/include/v8-profiler.h:1128:27: warning: 'v8::HeapProfiler::HeapSnapshotOptions::global_object_name_resolver' is deprecated: Use context_name_resolver callback instead. [-Wdeprecated-declarations]1526 1128 | HeapSnapshotOptions() {}1527 | ^1528../../deps/v8/include/v8-profiler.h:1142:25: note: declared here1529 1142 | ObjectNameResolver* global_object_name_resolver = nullptr;1530 | ^~~~~~~~~~~~~~~~~~~~~~~~~~~1531[207/1871] CXX obj/src/node_base.node_perf.o1532In file included from ../../src/memory_tracker.h:6,1533 from ../../src/base_object.h:29,1534 from ../../src/base_object-inl.h:27,1535 from ../../src/node_perf.h:6,1536 from ../../src/node_perf.cc:1:1537../../deps/v8/include/v8-profiler.h: In constructor 'v8::HeapProfiler::HeapSnapshotOptions::HeapSnapshotOptions()':1538../../deps/v8/include/v8-profiler.h:1128:27: warning: 'v8::HeapProfiler::HeapSnapshotOptions::global_object_name_resolver' is deprecated: Use context_name_resolver callback instead. [-Wdeprecated-declarations]1539 1128 | HeapSnapshotOptions() {}1540 | ^1541../../deps/v8/include/v8-profiler.h:1142:25: note: declared here1542 1142 | ObjectNameResolver* global_object_name_resolver = nullptr;1543 | ^~~~~~~~~~~~~~~~~~~~~~~~~~~1544../../deps/v8/include/v8-profiler.h:1128:27: warning: 'v8::HeapProfiler::HeapSnapshotOptions::global_object_name_resolver' is deprecated: Use context_name_resolver callback instead. [-Wdeprecated-declarations]1545 1128 | HeapSnapshotOptions() {}1546 | ^1547../../deps/v8/include/v8-profiler.h:1142:25: note: declared here1548 1142 | ObjectNameResolver* global_object_name_resolver = nullptr;1549 | ^~~~~~~~~~~~~~~~~~~~~~~~~~~1550[208/1871] CXX obj/src/node_base.node_serdes.o1551In file included from ../../src/memory_tracker.h:6,1552 from ../../src/base_object.h:29,1553 from ../../src/base_object-inl.h:27,1554 from ../../src/node_serdes.cc:1:1555../../deps/v8/include/v8-profiler.h: In constructor 'v8::HeapProfiler::HeapSnapshotOptions::HeapSnapshotOptions()':1556../../deps/v8/include/v8-profiler.h:1128:27: warning: 'v8::HeapProfiler::HeapSnapshotOptions::global_object_name_resolver' is deprecated: Use context_name_resolver callback instead. [-Wdeprecated-declarations]1557 1128 | HeapSnapshotOptions() {}1558 | ^1559../../deps/v8/include/v8-profiler.h:1142:25: note: declared here1560 1142 | ObjectNameResolver* global_object_name_resolver = nullptr;1561 | ^~~~~~~~~~~~~~~~~~~~~~~~~~~1562../../deps/v8/include/v8-profiler.h:1128:27: warning: 'v8::HeapProfiler::HeapSnapshotOptions::global_object_name_resolver' is deprecated: Use context_name_resolver callback instead. [-Wdeprecated-declarations]1563 1128 | HeapSnapshotOptions() {}1564 | ^1565../../deps/v8/include/v8-profiler.h:1142:25: note: declared here1566 1142 | ObjectNameResolver* global_object_name_resolver = nullptr;1567 | ^~~~~~~~~~~~~~~~~~~~~~~~~~~1568[209/1871] CXX obj/src/node_base.node_report_module.o1569In file included from ../../src/memory_tracker.h:6,1570 from ../../src/aliased_buffer.h:7,1571 from ../../src/env.h:27,1572 from ../../src/node_report_module.cc:1:1573../../deps/v8/include/v8-profiler.h: In constructor 'v8::HeapProfiler::HeapSnapshotOptions::HeapSnapshotOptions()':1574../../deps/v8/include/v8-profiler.h:1128:27: warning: 'v8::HeapProfiler::HeapSnapshotOptions::global_object_name_resolver' is deprecated: Use context_name_resolver callback instead. [-Wdeprecated-declarations]1575 1128 | HeapSnapshotOptions() {}1576 | ^1577../../deps/v8/include/v8-profiler.h:1142:25: note: declared here1578 1142 | ObjectNameResolver* global_object_name_resolver = nullptr;1579 | ^~~~~~~~~~~~~~~~~~~~~~~~~~~1580../../deps/v8/include/v8-profiler.h:1128:27: warning: 'v8::HeapProfiler::HeapSnapshotOptions::global_object_name_resolver' is deprecated: Use context_name_resolver callback instead. [-Wdeprecated-declarations]1581 1128 | HeapSnapshotOptions() {}1582 | ^1583../../deps/v8/include/v8-profiler.h:1142:25: note: declared here1584 1142 | ObjectNameResolver* global_object_name_resolver = nullptr;1585 | ^~~~~~~~~~~~~~~~~~~~~~~~~~~1586[210/1871] CXX obj/src/node_base.node_os.o1587In file included from ../../src/memory_tracker.h:6,1588 from ../../src/aliased_buffer.h:7,1589 from ../../src/aliased_buffer-inl.h:6,1590 from ../../src/env-inl.h:27,1591 from ../../src/node_os.cc:22:1592../../deps/v8/include/v8-profiler.h: In constructor 'v8::HeapProfiler::HeapSnapshotOptions::HeapSnapshotOptions()':1593../../deps/v8/include/v8-profiler.h:1128:27: warning: 'v8::HeapProfiler::HeapSnapshotOptions::global_object_name_resolver' is deprecated: Use context_name_resolver callback instead. [-Wdeprecated-declarations]1594 1128 | HeapSnapshotOptions() {}1595 | ^1596../../deps/v8/include/v8-profiler.h:1142:25: note: declared here1597 1142 | ObjectNameResolver* global_object_name_resolver = nullptr;1598 | ^~~~~~~~~~~~~~~~~~~~~~~~~~~1599../../deps/v8/include/v8-profiler.h:1128:27: warning: 'v8::HeapProfiler::HeapSnapshotOptions::global_object_name_resolver' is deprecated: Use context_name_resolver callback instead. [-Wdeprecated-declarations]1600 1128 | HeapSnapshotOptions() {}1601 | ^1602../../deps/v8/include/v8-profiler.h:1142:25: note: declared here1603 1142 | ObjectNameResolver* global_object_name_resolver = nullptr;1604 | ^~~~~~~~~~~~~~~~~~~~~~~~~~~1605[211/1871] CXX obj/src/node_base.node_locks.o1606In file included from ../../src/memory_tracker.h:6,1607 from ../../src/base_object.h:29,1608 from ../../src/node_locks.h:11,1609 from ../../src/node_locks.cc:1:1610../../deps/v8/include/v8-profiler.h: In constructor 'v8::HeapProfiler::HeapSnapshotOptions::HeapSnapshotOptions()':1611../../deps/v8/include/v8-profiler.h:1128:27: warning: 'v8::HeapProfiler::HeapSnapshotOptions::global_object_name_resolver' is deprecated: Use context_name_resolver callback instead. [-Wdeprecated-declarations]1612 1128 | HeapSnapshotOptions() {}1613 | ^1614../../deps/v8/include/v8-profiler.h:1142:25: note: declared here1615 1142 | ObjectNameResolver* global_object_name_resolver = nullptr;1616 | ^~~~~~~~~~~~~~~~~~~~~~~~~~~1617../../deps/v8/include/v8-profiler.h:1128:27: warning: 'v8::HeapProfiler::HeapSnapshotOptions::global_object_name_resolver' is deprecated: Use context_name_resolver callback instead. [-Wdeprecated-declarations]1618 1128 | HeapSnapshotOptions() {}1619 | ^1620../../deps/v8/include/v8-profiler.h:1142:25: note: declared here1621 1142 | ObjectNameResolver* global_object_name_resolver = nullptr;1622 | ^~~~~~~~~~~~~~~~~~~~~~~~~~~1623[212/1871] CXX obj/src/node_base.node_realm.o1624In file included from ../../src/memory_tracker.h:6,1625 from ../../src/cleanup_queue.h:11,1626 from ../../src/node_realm.h:8,1627 from ../../src/node_realm.cc:1:1628../../deps/v8/include/v8-profiler.h: In constructor 'v8::HeapProfiler::HeapSnapshotOptions::HeapSnapshotOptions()':1629../../deps/v8/include/v8-profiler.h:1128:27: warning: 'v8::HeapProfiler::HeapSnapshotOptions::global_object_name_resolver' is deprecated: Use context_name_resolver callback instead. [-Wdeprecated-declarations]1630 1128 | HeapSnapshotOptions() {}1631 | ^1632../../deps/v8/include/v8-profiler.h:1142:25: note: declared here1633 1142 | ObjectNameResolver* global_object_name_resolver = nullptr;1634 | ^~~~~~~~~~~~~~~~~~~~~~~~~~~1635../../deps/v8/include/v8-profiler.h:1128:27: warning: 'v8::HeapProfiler::HeapSnapshotOptions::global_object_name_resolver' is deprecated: Use context_name_resolver callback instead. [-Wdeprecated-declarations]1636 1128 | HeapSnapshotOptions() {}1637 | ^1638../../deps/v8/include/v8-profiler.h:1142:25: note: declared here1639 1142 | ObjectNameResolver* global_object_name_resolver = nullptr;1640 | ^~~~~~~~~~~~~~~~~~~~~~~~~~~1641[213/1871] CXX obj/src/node_base.node_platform.o1642In file included from ../../src/util.h:29,1643 from ../../src/node_mutex.h:6,1644 from ../../src/node_platform.h:15,1645 from ../../src/node_platform.cc:1:1646../../deps/v8/include/v8-profiler.h: In constructor 'v8::HeapProfiler::HeapSnapshotOptions::HeapSnapshotOptions()':1647../../deps/v8/include/v8-profiler.h:1128:27: warning: 'v8::HeapProfiler::HeapSnapshotOptions::global_object_name_resolver' is deprecated: Use context_name_resolver callback instead. [-Wdeprecated-declarations]1648 1128 | HeapSnapshotOptions() {}1649 | ^1650../../deps/v8/include/v8-profiler.h:1142:25: note: declared here1651 1142 | ObjectNameResolver* global_object_name_resolver = nullptr;1652 | ^~~~~~~~~~~~~~~~~~~~~~~~~~~1653../../deps/v8/include/v8-profiler.h:1128:27: warning: 'v8::HeapProfiler::HeapSnapshotOptions::global_object_name_resolver' is deprecated: Use context_name_resolver callback instead. [-Wdeprecated-declarations]1654 1128 | HeapSnapshotOptions() {}1655 | ^1656../../deps/v8/include/v8-profiler.h:1142:25: note: declared here1657 1142 | ObjectNameResolver* global_object_name_resolver = nullptr;1658 | ^~~~~~~~~~~~~~~~~~~~~~~~~~~1659[214/1871] CXX obj/src/node_base.node_metadata.o1660In file included from ../../src/util.h:29,1661 from ../../src/node_metadata.cc:22:1662../../deps/v8/include/v8-profiler.h: In constructor 'v8::HeapProfiler::HeapSnapshotOptions::HeapSnapshotOptions()':1663../../deps/v8/include/v8-profiler.h:1128:27: warning: 'v8::HeapProfiler::HeapSnapshotOptions::global_object_name_resolver' is deprecated: Use context_name_resolver callback instead. [-Wdeprecated-declarations]1664 1128 | HeapSnapshotOptions() {}1665 | ^1666../../deps/v8/include/v8-profiler.h:1142:25: note: declared here1667 1142 | ObjectNameResolver* global_object_name_resolver = nullptr;1668 | ^~~~~~~~~~~~~~~~~~~~~~~~~~~1669../../deps/v8/include/v8-profiler.h:1128:27: warning: 'v8::HeapProfiler::HeapSnapshotOptions::global_object_name_resolver' is deprecated: Use context_name_resolver callback instead. [-Wdeprecated-declarations]1670 1128 | HeapSnapshotOptions() {}1671 | ^1672../../deps/v8/include/v8-profiler.h:1142:25: note: declared here1673 1142 | ObjectNameResolver* global_object_name_resolver = nullptr;1674 | ^~~~~~~~~~~~~~~~~~~~~~~~~~~1675[215/1871] CXX obj/src/node_base.node_main_instance.o1676In file included from ../../src/util.h:29,1677 from ../../src/node_main_instance.h:11,1678 from ../../src/node_main_instance.cc:1:1679../../deps/v8/include/v8-profiler.h: In constructor 'v8::HeapProfiler::HeapSnapshotOptions::HeapSnapshotOptions()':1680../../deps/v8/include/v8-profiler.h:1128:27: warning: 'v8::HeapProfiler::HeapSnapshotOptions::global_object_name_resolver' is deprecated: Use context_name_resolver callback instead. [-Wdeprecated-declarations]1681 1128 | HeapSnapshotOptions() {}1682 | ^1683../../deps/v8/include/v8-profiler.h:1142:25: note: declared here1684 1142 | ObjectNameResolver* global_object_name_resolver = nullptr;1685 | ^~~~~~~~~~~~~~~~~~~~~~~~~~~1686../../deps/v8/include/v8-profiler.h:1128:27: warning: 'v8::HeapProfiler::HeapSnapshotOptions::global_object_name_resolver' is deprecated: Use context_name_resolver callback instead. [-Wdeprecated-declarations]1687 1128 | HeapSnapshotOptions() {}1688 | ^1689../../deps/v8/include/v8-profiler.h:1142:25: note: declared here1690 1142 | ObjectNameResolver* global_object_name_resolver = nullptr;1691 | ^~~~~~~~~~~~~~~~~~~~~~~~~~~1692[216/1871] CXX obj/src/node_base.node_symbols.o1693In file included from ../../src/memory_tracker.h:6,1694 from ../../src/aliased_buffer.h:7,1695 from ../../src/aliased_buffer-inl.h:6,1696 from ../../src/env-inl.h:27,1697 from ../../src/node_symbols.cc:1:1698../../deps/v8/include/v8-profiler.h: In constructor 'v8::HeapProfiler::HeapSnapshotOptions::HeapSnapshotOptions()':1699../../deps/v8/include/v8-profiler.h:1128:27: warning: 'v8::HeapProfiler::HeapSnapshotOptions::global_object_name_resolver' is deprecated: Use context_name_resolver callback instead. [-Wdeprecated-declarations]1700 1128 | HeapSnapshotOptions() {}1701 | ^1702../../deps/v8/include/v8-profiler.h:1142:25: note: declared here1703 1142 | ObjectNameResolver* global_object_name_resolver = nullptr;1704 | ^~~~~~~~~~~~~~~~~~~~~~~~~~~1705../../deps/v8/include/v8-profiler.h:1128:27: warning: 'v8::HeapProfiler::HeapSnapshotOptions::global_object_name_resolver' is deprecated: Use context_name_resolver callback instead. [-Wdeprecated-declarations]1706 1128 | HeapSnapshotOptions() {}1707 | ^1708../../deps/v8/include/v8-profiler.h:1142:25: note: declared here1709 1142 | ObjectNameResolver* global_object_name_resolver = nullptr;1710 | ^~~~~~~~~~~~~~~~~~~~~~~~~~~1711[217/1871] CXX obj/src/node_base.node_process_methods.o1712In file included from ../../src/memory_tracker.h:6,1713 from ../../src/base_object.h:29,1714 from ../../src/async_wrap.h:27,1715 from ../../src/async_wrap-inl.h:27,1716 from ../../src/node_process_methods.cc:1:1717../../deps/v8/include/v8-profiler.h: In constructor 'v8::HeapProfiler::HeapSnapshotOptions::HeapSnapshotOptions()':1718../../deps/v8/include/v8-profiler.h:1128:27: warning: 'v8::HeapProfiler::HeapSnapshotOptions::global_object_name_resolver' is deprecated: Use context_name_resolver callback instead. [-Wdeprecated-declarations]1719 1128 | HeapSnapshotOptions() {}1720 | ^1721../../deps/v8/include/v8-profiler.h:1142:25: note: declared here1722 1142 | ObjectNameResolver* global_object_name_resolver = nullptr;1723 | ^~~~~~~~~~~~~~~~~~~~~~~~~~~1724../../deps/v8/include/v8-profiler.h:1128:27: warning: 'v8::HeapProfiler::HeapSnapshotOptions::global_object_name_resolver' is deprecated: Use context_name_resolver callback instead. [-Wdeprecated-declarations]1725 1128 | HeapSnapshotOptions() {}1726 | ^1727../../deps/v8/include/v8-profiler.h:1142:25: note: declared here1728 1142 | ObjectNameResolver* global_object_name_resolver = nullptr;1729 | ^~~~~~~~~~~~~~~~~~~~~~~~~~~1730[218/1871] CXX obj/src/node_base.node_shadow_realm.o1731In file included from ../../src/memory_tracker.h:6,1732 from ../../src/cleanup_queue.h:11,1733 from ../../src/node_realm.h:8,1734 from ../../src/node_shadow_realm.h:6,1735 from ../../src/node_shadow_realm.cc:1:1736../../deps/v8/include/v8-profiler.h: In constructor 'v8::HeapProfiler::HeapSnapshotOptions::HeapSnapshotOptions()':1737../../deps/v8/include/v8-profiler.h:1128:27: warning: 'v8::HeapProfiler::HeapSnapshotOptions::global_object_name_resolver' is deprecated: Use context_name_resolver callback instead. [-Wdeprecated-declarations]1738 1128 | HeapSnapshotOptions() {}1739 | ^1740../../deps/v8/include/v8-profiler.h:1142:25: note: declared here1741 1142 | ObjectNameResolver* global_object_name_resolver = nullptr;1742 | ^~~~~~~~~~~~~~~~~~~~~~~~~~~1743../../deps/v8/include/v8-profiler.h:1128:27: warning: 'v8::HeapProfiler::HeapSnapshotOptions::global_object_name_resolver' is deprecated: Use context_name_resolver callback instead. [-Wdeprecated-declarations]1744 1128 | HeapSnapshotOptions() {}1745 | ^1746../../deps/v8/include/v8-profiler.h:1142:25: note: declared here1747 1142 | ObjectNameResolver* global_object_name_resolver = nullptr;1748 | ^~~~~~~~~~~~~~~~~~~~~~~~~~~1749[219/1871] CXX obj/src/node_base.node_report.o1750In file included from ../../src/util.h:29,1751 from ../../src/node_report.h:9,1752 from ../../src/node_report.cc:1:1753../../deps/v8/include/v8-profiler.h: In constructor 'v8::HeapProfiler::HeapSnapshotOptions::HeapSnapshotOptions()':1754../../deps/v8/include/v8-profiler.h:1128:27: warning: 'v8::HeapProfiler::HeapSnapshotOptions::global_object_name_resolver' is deprecated: Use context_name_resolver callback instead. [-Wdeprecated-declarations]1755 1128 | HeapSnapshotOptions() {}1756 | ^1757../../deps/v8/include/v8-profiler.h:1142:25: note: declared here1758 1142 | ObjectNameResolver* global_object_name_resolver = nullptr;1759 | ^~~~~~~~~~~~~~~~~~~~~~~~~~~1760../../deps/v8/include/v8-profiler.h:1128:27: warning: 'v8::HeapProfiler::HeapSnapshotOptions::global_object_name_resolver' is deprecated: Use context_name_resolver callback instead. [-Wdeprecated-declarations]1761 1128 | HeapSnapshotOptions() {}1762 | ^1763../../deps/v8/include/v8-profiler.h:1142:25: note: declared here1764 1142 | ObjectNameResolver* global_object_name_resolver = nullptr;1765 | ^~~~~~~~~~~~~~~~~~~~~~~~~~~1766[220/1871] CXX obj/src/node_base.node_modules.o1767In file included from ../../src/memory_tracker.h:6,1768 from ../../src/aliased_buffer.h:7,1769 from ../../src/node_snapshotable.h:7,1770 from ../../src/node_modules.h:7,1771 from ../../src/node_modules.cc:1:1772../../deps/v8/include/v8-profiler.h: In constructor 'v8::HeapProfiler::HeapSnapshotOptions::HeapSnapshotOptions()':1773../../deps/v8/include/v8-profiler.h:1128:27: warning: 'v8::HeapProfiler::HeapSnapshotOptions::global_object_name_resolver' is deprecated: Use context_name_resolver callback instead. [-Wdeprecated-declarations]1774 1128 | HeapSnapshotOptions() {}1775 | ^1776../../deps/v8/include/v8-profiler.h:1142:25: note: declared here1777 1142 | ObjectNameResolver* global_object_name_resolver = nullptr;1778 | ^~~~~~~~~~~~~~~~~~~~~~~~~~~1779../../deps/v8/include/v8-profiler.h:1128:27: warning: 'v8::HeapProfiler::HeapSnapshotOptions::global_object_name_resolver' is deprecated: Use context_name_resolver callback instead. [-Wdeprecated-declarations]1780 1128 | HeapSnapshotOptions() {}1781 | ^1782../../deps/v8/include/v8-profiler.h:1142:25: note: declared here1783 1142 | ObjectNameResolver* global_object_name_resolver = nullptr;1784 | ^~~~~~~~~~~~~~~~~~~~~~~~~~~1785[221/1871] CXX obj/src/node_base.node_stat_watcher.o1786In file included from ../../src/memory_tracker.h:6,1787 from ../../src/base_object.h:29,1788 from ../../src/async_wrap.h:27,1789 from ../../src/handle_wrap.h:27,1790 from ../../src/node_stat_watcher.h:28,1791 from ../../src/node_stat_watcher.cc:22:1792../../deps/v8/include/v8-profiler.h: In constructor 'v8::HeapProfiler::HeapSnapshotOptions::HeapSnapshotOptions()':1793../../deps/v8/include/v8-profiler.h:1128:27: warning: 'v8::HeapProfiler::HeapSnapshotOptions::global_object_name_resolver' is deprecated: Use context_name_resolver callback instead. [-Wdeprecated-declarations]1794 1128 | HeapSnapshotOptions() {}1795 | ^1796../../deps/v8/include/v8-profiler.h:1142:25: note: declared here1797 1142 | ObjectNameResolver* global_object_name_resolver = nullptr;1798 | ^~~~~~~~~~~~~~~~~~~~~~~~~~~1799../../deps/v8/include/v8-profiler.h:1128:27: warning: 'v8::HeapProfiler::HeapSnapshotOptions::global_object_name_resolver' is deprecated: Use context_name_resolver callback instead. [-Wdeprecated-declarations]1800 1128 | HeapSnapshotOptions() {}1801 | ^1802../../deps/v8/include/v8-profiler.h:1142:25: note: declared here1803 1142 | ObjectNameResolver* global_object_name_resolver = nullptr;1804 | ^~~~~~~~~~~~~~~~~~~~~~~~~~~1805[222/1871] CXX obj/src/node_base.node_types.o1806In file included from ../../src/memory_tracker.h:6,1807 from ../../src/aliased_buffer.h:7,1808 from ../../src/aliased_buffer-inl.h:6,1809 from ../../src/env-inl.h:27,1810 from ../../src/node_types.cc:1:1811../../deps/v8/include/v8-profiler.h: In constructor 'v8::HeapProfiler::HeapSnapshotOptions::HeapSnapshotOptions()':1812../../deps/v8/include/v8-profiler.h:1128:27: warning: 'v8::HeapProfiler::HeapSnapshotOptions::global_object_name_resolver' is deprecated: Use context_name_resolver callback instead. [-Wdeprecated-declarations]1813 1128 | HeapSnapshotOptions() {}1814 | ^1815../../deps/v8/include/v8-profiler.h:1142:25: note: declared here1816 1142 | ObjectNameResolver* global_object_name_resolver = nullptr;1817 | ^~~~~~~~~~~~~~~~~~~~~~~~~~~1818../../deps/v8/include/v8-profiler.h:1128:27: warning: 'v8::HeapProfiler::HeapSnapshotOptions::global_object_name_resolver' is deprecated: Use context_name_resolver callback instead. [-Wdeprecated-declarations]1819 1128 | HeapSnapshotOptions() {}1820 | ^1821../../deps/v8/include/v8-profiler.h:1142:25: note: declared here1822 1142 | ObjectNameResolver* global_object_name_resolver = nullptr;1823 | ^~~~~~~~~~~~~~~~~~~~~~~~~~~1824[223/1871] CXX obj/deps/v8/src/torque/torque_base.torque-parser.o1825[224/1871] CXX obj/src/node_base.node_task_queue.o1826In file included from ../../src/memory_tracker.h:6,1827 from ../../src/base_object.h:29,1828 from ../../src/async_wrap.h:27,1829 from ../../src/node_task_queue.cc:1:1830../../deps/v8/include/v8-profiler.h: In constructor 'v8::HeapProfiler::HeapSnapshotOptions::HeapSnapshotOptions()':1831../../deps/v8/include/v8-profiler.h:1128:27: warning: 'v8::HeapProfiler::HeapSnapshotOptions::global_object_name_resolver' is deprecated: Use context_name_resolver callback instead. [-Wdeprecated-declarations]1832 1128 | HeapSnapshotOptions() {}1833 | ^1834../../deps/v8/include/v8-profiler.h:1142:25: note: declared here1835 1142 | ObjectNameResolver* global_object_name_resolver = nullptr;1836 | ^~~~~~~~~~~~~~~~~~~~~~~~~~~1837../../deps/v8/include/v8-profiler.h:1128:27: warning: 'v8::HeapProfiler::HeapSnapshotOptions::global_object_name_resolver' is deprecated: Use context_name_resolver callback instead. [-Wdeprecated-declarations]1838 1128 | HeapSnapshotOptions() {}1839 | ^1840../../deps/v8/include/v8-profiler.h:1142:25: note: declared here1841 1142 | ObjectNameResolver* global_object_name_resolver = nullptr;1842 | ^~~~~~~~~~~~~~~~~~~~~~~~~~~1843[225/1871] CXX obj/src/tracing/node_base.trace_event_helper.o1844[226/1871] CXX obj/src/node_base.node_messaging.o1845In file included from ../../src/memory_tracker.h:6,1846 from ../../src/aliased_buffer.h:7,1847 from ../../src/env.h:27,1848 from ../../src/node_messaging.h:6,1849 from ../../src/node_messaging.cc:1:1850../../deps/v8/include/v8-profiler.h: In constructor 'v8::HeapProfiler::HeapSnapshotOptions::HeapSnapshotOptions()':1851../../deps/v8/include/v8-profiler.h:1128:27: warning: 'v8::HeapProfiler::HeapSnapshotOptions::global_object_name_resolver' is deprecated: Use context_name_resolver callback instead. [-Wdeprecated-declarations]1852 1128 | HeapSnapshotOptions() {}1853 | ^1854../../deps/v8/include/v8-profiler.h:1142:25: note: declared here1855 1142 | ObjectNameResolver* global_object_name_resolver = nullptr;1856 | ^~~~~~~~~~~~~~~~~~~~~~~~~~~1857../../deps/v8/include/v8-profiler.h:1128:27: warning: 'v8::HeapProfiler::HeapSnapshotOptions::global_object_name_resolver' is deprecated: Use context_name_resolver callback instead. [-Wdeprecated-declarations]1858 1128 | HeapSnapshotOptions() {}1859 | ^1860../../deps/v8/include/v8-profiler.h:1142:25: note: declared here1861 1142 | ObjectNameResolver* global_object_name_resolver = nullptr;1862 | ^~~~~~~~~~~~~~~~~~~~~~~~~~~1863[227/1871] CXX obj/src/tracing/node_base.agent.o1864In file included from ../../src/util.h:29,1865 from ../../src/node_mutex.h:6,1866 from ../../src/tracing/agent_legacy.h:14,1867 from ../../src/tracing/agent.cc:6:1868../../deps/v8/include/v8-profiler.h: In constructor 'v8::HeapProfiler::HeapSnapshotOptions::HeapSnapshotOptions()':1869../../deps/v8/include/v8-profiler.h:1128:27: warning: 'v8::HeapProfiler::HeapSnapshotOptions::global_object_name_resolver' is deprecated: Use context_name_resolver callback instead. [-Wdeprecated-declarations]1870 1128 | HeapSnapshotOptions() {}1871 | ^1872../../deps/v8/include/v8-profiler.h:1142:25: note: declared here1873 1142 | ObjectNameResolver* global_object_name_resolver = nullptr;1874 | ^~~~~~~~~~~~~~~~~~~~~~~~~~~1875../../deps/v8/include/v8-profiler.h:1128:27: warning: 'v8::HeapProfiler::HeapSnapshotOptions::global_object_name_resolver' is deprecated: Use context_name_resolver callback instead. [-Wdeprecated-declarations]1876 1128 | HeapSnapshotOptions() {}1877 | ^1878../../deps/v8/include/v8-profiler.h:1142:25: note: declared here1879 1142 | ObjectNameResolver* global_object_name_resolver = nullptr;1880 | ^~~~~~~~~~~~~~~~~~~~~~~~~~~1881[228/1871] CXX obj/src/node_base.node_trace_events.o1882In file included from ../../src/memory_tracker.h:6,1883 from ../../src/base_object.h:29,1884 from ../../src/base_object-inl.h:27,1885 from ../../src/node_trace_events.cc:1:1886../../deps/v8/include/v8-profiler.h: In constructor 'v8::HeapProfiler::HeapSnapshotOptions::HeapSnapshotOptions()':1887../../deps/v8/include/v8-profiler.h:1128:27: warning: 'v8::HeapProfiler::HeapSnapshotOptions::global_object_name_resolver' is deprecated: Use context_name_resolver callback instead. [-Wdeprecated-declarations]1888 1128 | HeapSnapshotOptions() {}1889 | ^1890../../deps/v8/include/v8-profiler.h:1142:25: note: declared here1891 1142 | ObjectNameResolver* global_object_name_resolver = nullptr;1892 | ^~~~~~~~~~~~~~~~~~~~~~~~~~~1893../../deps/v8/include/v8-profiler.h:1128:27: warning: 'v8::HeapProfiler::HeapSnapshotOptions::global_object_name_resolver' is deprecated: Use context_name_resolver callback instead. [-Wdeprecated-declarations]1894 1128 | HeapSnapshotOptions() {}1895 | ^1896../../deps/v8/include/v8-profiler.h:1142:25: note: declared here1897 1142 | ObjectNameResolver* global_object_name_resolver = nullptr;1898 | ^~~~~~~~~~~~~~~~~~~~~~~~~~~1899[229/1871] CXX obj/deps/v8/third_party/simdutf/simdutf.simdutf.o1900[230/1871] AR obj/tools/v8_gypfiles/libsimdutf.a1901[231/1871] CXX obj/src/node_base.node_sockaddr.o1902In file included from ../../src/memory_tracker.h:6,1903 from ../../src/base_object.h:29,1904 from ../../src/node_sockaddr.h:6,1905 from ../../src/node_sockaddr.cc:1:1906../../deps/v8/include/v8-profiler.h: In constructor 'v8::HeapProfiler::HeapSnapshotOptions::HeapSnapshotOptions()':1907../../deps/v8/include/v8-profiler.h:1128:27: warning: 'v8::HeapProfiler::HeapSnapshotOptions::global_object_name_resolver' is deprecated: Use context_name_resolver callback instead. [-Wdeprecated-declarations]1908 1128 | HeapSnapshotOptions() {}1909 | ^1910../../deps/v8/include/v8-profiler.h:1142:25: note: declared here1911 1142 | ObjectNameResolver* global_object_name_resolver = nullptr;1912 | ^~~~~~~~~~~~~~~~~~~~~~~~~~~1913../../deps/v8/include/v8-profiler.h:1128:27: warning: 'v8::HeapProfiler::HeapSnapshotOptions::global_object_name_resolver' is deprecated: Use context_name_resolver callback instead. [-Wdeprecated-declarations]1914 1128 | HeapSnapshotOptions() {}1915 | ^1916../../deps/v8/include/v8-profiler.h:1142:25: note: declared here1917 1142 | ObjectNameResolver* global_object_name_resolver = nullptr;1918 | ^~~~~~~~~~~~~~~~~~~~~~~~~~~1919[232/1871] CXX obj/src/node_base.node_util.o1920In file included from ../../src/memory_tracker.h:6,1921 from ../../src/base_object.h:29,1922 from ../../src/base_object-inl.h:27,1923 from ../../src/node_util.cc:1:1924../../deps/v8/include/v8-profiler.h: In constructor 'v8::HeapProfiler::HeapSnapshotOptions::HeapSnapshotOptions()':1925../../deps/v8/include/v8-profiler.h:1128:27: warning: 'v8::HeapProfiler::HeapSnapshotOptions::global_object_name_resolver' is deprecated: Use context_name_resolver callback instead. [-Wdeprecated-declarations]1926 1128 | HeapSnapshotOptions() {}1927 | ^1928../../deps/v8/include/v8-profiler.h:1142:25: note: declared here1929 1142 | ObjectNameResolver* global_object_name_resolver = nullptr;1930 | ^~~~~~~~~~~~~~~~~~~~~~~~~~~1931../../deps/v8/include/v8-profiler.h:1128:27: warning: 'v8::HeapProfiler::HeapSnapshotOptions::global_object_name_resolver' is deprecated: Use context_name_resolver callback instead. [-Wdeprecated-declarations]1932 1128 | HeapSnapshotOptions() {}1933 | ^1934../../deps/v8/include/v8-profiler.h:1142:25: note: declared here1935 1142 | ObjectNameResolver* global_object_name_resolver = nullptr;1936 | ^~~~~~~~~~~~~~~~~~~~~~~~~~~1937[233/1871] CXX obj/src/ffi/platforms/node_base.arm64.o1938[234/1871] CXX obj/src/ffi/platforms/node_base.loong64.o1939[235/1871] CXX obj/src/node_base.node_wasm_web_api.o1940In file included from ../../src/memory_tracker.h:6,1941 from ../../src/base_object.h:29,1942 from ../../src/base_object-inl.h:27,1943 from ../../src/node_wasm_web_api.h:6,1944 from ../../src/node_wasm_web_api.cc:1:1945../../deps/v8/include/v8-profiler.h: In constructor 'v8::HeapProfiler::HeapSnapshotOptions::HeapSnapshotOptions()':1946../../deps/v8/include/v8-profiler.h:1128:27: warning: 'v8::HeapProfiler::HeapSnapshotOptions::global_object_name_resolver' is deprecated: Use context_name_resolver callback instead. [-Wdeprecated-declarations]1947 1128 | HeapSnapshotOptions() {}1948 | ^1949../../deps/v8/include/v8-profiler.h:1142:25: note: declared here1950 1142 | ObjectNameResolver* global_object_name_resolver = nullptr;1951 | ^~~~~~~~~~~~~~~~~~~~~~~~~~~1952../../deps/v8/include/v8-profiler.h:1128:27: warning: 'v8::HeapProfiler::HeapSnapshotOptions::global_object_name_resolver' is deprecated: Use context_name_resolver callback instead. [-Wdeprecated-declarations]1953 1128 | HeapSnapshotOptions() {}1954 | ^1955../../deps/v8/include/v8-profiler.h:1142:25: note: declared here1956 1142 | ObjectNameResolver* global_object_name_resolver = nullptr;1957 | ^~~~~~~~~~~~~~~~~~~~~~~~~~~1958[236/1871] CXX obj/src/ffi/platforms/node_base.ppc64.o1959[237/1871] CXX obj/src/ffi/node_base.jit_memory.o1960[238/1871] CXX obj/src/ffi/platforms/node_base.riscv64.o1961[239/1871] CXX obj/src/ffi/platforms/node_base.s390x.o1962[240/1871] CXX obj/src/ffi/platforms/node_base.x64.o1963[241/1871] CXX obj/deps/v8/src/torque/torque_base.implementation-visitor.o1964[242/1871] AR obj/tools/v8_gypfiles/libtorque_base.a1965[243/1871] STAMP obj/tools/v8_gypfiles/torque.actions_depends.stamp1966[244/1871] CXX obj/src/tracing/node_base.traced_value.o1967In file included from ../../src/util.h:29,1968 from ../../src/tracing/traced_value.cc:16:1969../../deps/v8/include/v8-profiler.h: In constructor 'v8::HeapProfiler::HeapSnapshotOptions::HeapSnapshotOptions()':1970../../deps/v8/include/v8-profiler.h:1128:27: warning: 'v8::HeapProfiler::HeapSnapshotOptions::global_object_name_resolver' is deprecated: Use context_name_resolver callback instead. [-Wdeprecated-declarations]1971 1128 | HeapSnapshotOptions() {}1972 | ^1973../../deps/v8/include/v8-profiler.h:1142:25: note: declared here1974 1142 | ObjectNameResolver* global_object_name_resolver = nullptr;1975 | ^~~~~~~~~~~~~~~~~~~~~~~~~~~1976../../deps/v8/include/v8-profiler.h:1128:27: warning: 'v8::HeapProfiler::HeapSnapshotOptions::global_object_name_resolver' is deprecated: Use context_name_resolver callback instead. [-Wdeprecated-declarations]1977 1128 | HeapSnapshotOptions() {}1978 | ^1979../../deps/v8/include/v8-profiler.h:1142:25: note: declared here1980 1142 | ObjectNameResolver* global_object_name_resolver = nullptr;1981 | ^~~~~~~~~~~~~~~~~~~~~~~~~~~1982[245/1871] CXX obj/src/node_base.node_v8.o1983In file included from ../../src/memory_tracker.h:6,1984 from ../../src/aliased_buffer.h:7,1985 from ../../src/node_v8.h:7,1986 from ../../src/node_v8.cc:22:1987../../deps/v8/include/v8-profiler.h: In constructor 'v8::HeapProfiler::HeapSnapshotOptions::HeapSnapshotOptions()':1988../../deps/v8/include/v8-profiler.h:1128:27: warning: 'v8::HeapProfiler::HeapSnapshotOptions::global_object_name_resolver' is deprecated: Use context_name_resolver callback instead. [-Wdeprecated-declarations]1989 1128 | HeapSnapshotOptions() {}1990 | ^1991../../deps/v8/include/v8-profiler.h:1142:25: note: declared here1992 1142 | ObjectNameResolver* global_object_name_resolver = nullptr;1993 | ^~~~~~~~~~~~~~~~~~~~~~~~~~~1994../../deps/v8/include/v8-profiler.h:1128:27: warning: 'v8::HeapProfiler::HeapSnapshotOptions::global_object_name_resolver' is deprecated: Use context_name_resolver callback instead. [-Wdeprecated-declarations]1995 1128 | HeapSnapshotOptions() {}1996 | ^1997../../deps/v8/include/v8-profiler.h:1142:25: note: declared here1998 1142 | ObjectNameResolver* global_object_name_resolver = nullptr;1999 | ^~~~~~~~~~~~~~~~~~~~~~~~~~~2000[246/1871] LINK torqueloading 24,277 hidden lines…
26278ok 5022 module-hooks/test-module-hooks-resolve-short-circuit26279 ---26280 duration_ms: 926.7210026281 ...26282ok 5023 module-hooks/test-module-hooks-resolve-load-builtin-redirect26283 ---26284 duration_ms: 1096.5780026285 ...26286ok 5024 async-hooks/test-async-exec-resource-match26287 ---26288 duration_ms: 884.5830026289 ...26290ok 5025 async-hooks/test-async-local-storage-misc-stores26291 ---26292 duration_ms: 718.6220026293 ...26294ok 5026 async-hooks/test-fsreqcallback-readFile26295 ---26296 duration_ms: 317.8470026297 ...26298ok 5027 async-hooks/test-fsreqcallback-access26299 ---26300 duration_ms: 333.1150026301 ...26302ok 5028 async-hooks/test-getaddrinforeqwrap26303 ---26304 duration_ms: 319.2010026305 ...26306ok 5029 async-hooks/test-async-local-storage-no-mix-contexts26307 ---26308 duration_ms: 709.8980026309 ...26310ok 5030 async-hooks/test-async-local-storage-thenable26311 ---26312 duration_ms: 603.5060026313 ...26314ok 5031 async-hooks/test-graph.http26315 ---26316 duration_ms: 258.6470026317 ...26318ok 5032 async-hooks/test-enable-disable26319 ---26320 duration_ms: 483.8600026321 ...26322ok 5033 async-hooks/test-graph.intervals26323 ---26324 duration_ms: 262.8090026325 ...26326ok 5034 async-hooks/test-async-local-storage-args26327 ---26328 duration_ms: 979.5290026329 ...26330ok 5035 async-hooks/test-graph.shutdown26331 ---26332 duration_ms: 250.8240026333 ...26334ok 5036 async-hooks/test-destroy-not-blocked26335 ---26336 duration_ms: 618.7300026337 ...26338ok 5037 async-hooks/test-async-local-storage-stream-finished26339 ---26340 duration_ms: 717.4840026341 ...26342ok 5038 async-hooks/test-crypto-pbkdf226343 ---26344 duration_ms: 654.9030026345 ...26346ok 5039 async-hooks/test-async-local-storage-dgram26347 ---26348 duration_ms: 1017.9490026349 ...26350ok 5040 module-hooks/test-module-hooks-resolve-load-builtin-override-both26351 ---26352 duration_ms: 1327.7950026353 ...26354ok 5041 async-hooks/test-enable-in-init26355 ---26356 duration_ms: 571.6170026357 ...26358ok 5042 async-hooks/test-getnameinforeqwrap26359 ---26360 duration_ms: 427.4380026361 ...26362ok 5043 async-hooks/test-async-local-storage-tlssocket26363 ---26364 duration_ms: 738.3280026365 ...26366ok 5044 async-hooks/test-filehandle-no-reuse26367 ---26368 duration_ms: 600.6500026369 ...26370ok 5045 async-hooks/test-embedder.api.async-resource.runInAsyncScope26371 ---26372 duration_ms: 709.0160026373 ...26374ok 5046 async-hooks/test-graph.pipe26375 ---26376 duration_ms: 426.5310026377 ...26378ok 5047 async-hooks/test-graph.pipeconnect26379 ---26380 duration_ms: 425.6170026381 ...26382ok 5048 async-hooks/test-graph.fsreq-readFile26383 ---26384 duration_ms: 505.1150026385 ...26386ok 5049 parallel/test-zlib-zip-coverage26387 ---26388 duration_ms: 4924.7970026389 ...26390ok 5050 module-hooks/test-module-hooks-require-esm26391 ---26392 duration_ms: 1662.3690026393 ...26394ok 5051 async-hooks/test-async-wrap-providers26395 ---26396 duration_ms: 860.8100026397 ...26398ok 5052 async-hooks/test-graph.statwatcher26399 ---26400 duration_ms: 420.6460026401 ...26402ok 5053 module-hooks/test-module-hooks-resolve-short-circuit-required-start26403 ---26404 duration_ms: 1324.0920026405 ...26406ok 5054 module-hooks/test-module-hooks-resolve-require-resolve-loaded-with-source26407 ---26408 duration_ms: 1427.9810026409 ...26410ok 5055 async-hooks/test-emit-after-on-destroyed26411 ---26412 duration_ms: 817.7200026413 ...26414ok 5056 async-hooks/test-async-local-storage-socket26415 ---26416 duration_ms: 1069.6890026417 ...26418ok 5057 async-hooks/test-embedder.api.async-resource-no-type26419 ---26420 duration_ms: 951.4420026421 ...26422ok 5058 async-hooks/test-immediate26423 ---26424 duration_ms: 428.3530026425 ...26426ok 5059 async-hooks/test-disable-in-init26427 ---26428 duration_ms: 1015.6940026429 ...26430ok 5060 async-hooks/test-graph.tcp26431 ---26432 duration_ms: 620.7020026433 ...26434ok 5061 async-hooks/test-crypto-randomBytes26435 ---26436 duration_ms: 1133.9870026437 ...26438ok 5062 async-hooks/test-graph.timeouts26439 ---26440 duration_ms: 656.8180026441 ...26442ok 5063 async-hooks/test-tcpwrap26443 ---26444 duration_ms: 364.6580026445 ...26446ok 5064 async-hooks/test-async-local-storage-gcable26447 ---26448 duration_ms: 1430.5580026449 ...26450ok 5065 async-hooks/test-pipeconnectwrap26451 ---26452 duration_ms: 540.8920026453 ...26454ok 5066 async-hooks/test-signalwrap26455 ---26456 duration_ms: 443.7770026457 ...26458ok 5067 async-hooks/test-fseventwrap26459 ---26460 duration_ms: 1034.8250026461 ...26462ok 5068 async-hooks/test-late-hook-enable26463 ---26464 duration_ms: 639.4530026465 ...26466ok 5069 module-hooks/test-module-hooks-resolve-load-import-inline-typescript-override26467 ---26468 duration_ms: 1890.7880026469 ...26470ok 5070 async-hooks/test-no-assert-when-disabled26471 ---26472 duration_ms: 637.7740026473 ...26474ok 5071 module-hooks/test-module-hooks-resolve-load-require-inline-typescript26475 ---26476 duration_ms: 1892.6110026477 ...26478ok 5072 module-hooks/test-module-hooks-load-async-and-sync26479 ---26480 duration_ms: 2870.6620026481 ...26482ok 5073 async-hooks/test-track-promises-true26483 ---26484 duration_ms: 394.1930026485 ...26486ok 5074 async-hooks/test-graph.tls-write26487 ---26488 duration_ms: 854.6560026489 ...26490ok 5075 async-hooks/test-httpparser-reuse26491 ---26492 duration_ms: 819.4500026493 ...26494ok 5076 async-hooks/test-udpsendwrap26495 ---26496 duration_ms: 470.7640026497 ...26498ok 5077 async-hooks/test-promise.chain-promise-before-init-hooks26499 ---26500 duration_ms: 828.6710026501 ...26502ok 5078 sea/test-build-sea # skip Running the resultant binary fails with `/home/iojs/node-tmp/.tmp.2379/sea: error while loading shared libraries: libicui18n.so.71: cannot open shared object file: No such file or directory`.26503 ---26504 duration_ms: 335.5670026505 ...26506ok 5079 async-hooks/test-promise.promise-before-init-hooks26507 ---26508 duration_ms: 844.3760026509 ...26510ok 5080 async-hooks/test-shutdownwrap26511 ---26512 duration_ms: 834.4490026513 ...26514ok 5081 async-hooks/test-httpparser.request26515 ---26516 duration_ms: 1060.8630026517 ...26518ok 5082 async-hooks/test-graph.signal26519 ---26520 duration_ms: 1297.8350026521 ...26522ok 5083 sea/test-build-sea-invalid-exec-argv # skip Running the resultant binary fails with `/home/iojs/node-tmp/.tmp.2379/sea: error while loading shared libraries: libicui18n.so.71: cannot open shared object file: No such file or directory`.26523 ---26524 duration_ms: 331.3260026525 ...26526ok 5084 async-hooks/test-async-exec-resource-http-3206026527 ---26528 duration_ms: 2145.3110026529 ...26530ok 5085 async-hooks/test-improper-unwind26531 ---26532 duration_ms: 1116.2990026533 ...26534ok 5086 sea/test-build-sea-invalid-boolean-fields # skip Running the resultant binary fails with `/home/iojs/node-tmp/.tmp.2379/sea: error while loading shared libraries: libicui18n.so.71: cannot open shared object file: No such file or directory`.26535 ---26536 duration_ms: 405.2170026537 ...26538ok 5087 async-hooks/test-unhandled-rejection-context26539 ---26540 duration_ms: 609.5150026541 ...26542ok 5088 async-hooks/test-timers.setTimeout26543 ---26544 duration_ms: 929.6810026545 ...26546ok 5089 async-hooks/test-track-promises-false-check26547 ---26548 duration_ms: 890.6590026549 ...26550ok 5090 async-hooks/test-queue-microtask26551 ---26552 duration_ms: 1013.5880026553 ...26554ok 5091 async-hooks/test-http-agent-handle-reuse-parallel26555 ---26556 duration_ms: 1238.7870026557 ...26558ok 5092 async-hooks/test-track-promises-validation26559 ---26560 duration_ms: 792.8440026561 ...26562ok 5093 async-hooks/test-emit-before-on-destroyed26563 ---26564 duration_ms: 1735.7160026565 ...26566ok 5094 sea/test-build-sea-missing-output # skip Running the resultant binary fails with `/home/iojs/node-tmp/.tmp.2379/sea: error while loading shared libraries: libicui18n.so.71: cannot open shared object file: No such file or directory`.26567 ---26568 duration_ms: 327.5650026569 ...26570ok 5095 sea/test-build-sea-custom-argv0 # skip Running the resultant binary fails with `/home/iojs/node-tmp/.tmp.2379/sea: error while loading shared libraries: libicui18n.so.71: cannot open shared object file: No such file or directory`.26571 ---26572 duration_ms: 599.9350026573 ...26574ok 5096 async-hooks/test-graph.tls-write-1226575 ---26576 duration_ms: 1340.7020026577 ...26578ok 5097 async-hooks/test-tlswrap26579 ---26580 duration_ms: 1033.8830026581 ...26582ok 5098 async-hooks/test-promise26583 ---26584 duration_ms: 1228.6190026585 ...26586ok 5099 sea/test-single-executable-application-asset-keys # skip Running the resultant binary fails with `/home/iojs/node-tmp/.tmp.2379/sea: error while loading shared libraries: libicui18n.so.71: cannot open shared object file: No such file or directory`.26587 ---26588 duration_ms: 336.7330026589 ...26590ok 5100 sea/test-single-executable-application # skip Running the resultant binary fails with `/home/iojs/node-tmp/.tmp.2379/sea: error while loading shared libraries: libicui18n.so.71: cannot open shared object file: No such file or directory`.26591 ---26592 duration_ms: 393.9500026593 ...26594ok 5101 async-hooks/test-zlib.zlib-binding.deflate26595 ---26596 duration_ms: 816.6590026597 ...26598ok 5102 sea/test-single-executable-application-assets-raw # skip Running the resultant binary fails with `/home/iojs/node-tmp/.tmp.2379/sea: error while loading shared libraries: libicui18n.so.71: cannot open shared object file: No such file or directory`.26599 ---26600 duration_ms: 304.1680026601 ...26602ok 5103 sea/test-single-executable-application-disable-experimental-sea-warning # skip Running the resultant binary fails with `/home/iojs/node-tmp/.tmp.2379/sea: error while loading shared libraries: libicui18n.so.71: cannot open shared object file: No such file or directory`.26603 ---26604 duration_ms: 318.9190026605 ...26606ok 5104 sea/test-single-executable-application-asset-keys-empty # skip Running the resultant binary fails with `/home/iojs/node-tmp/.tmp.2379/sea: error while loading shared libraries: libicui18n.so.71: cannot open shared object file: No such file or directory`.26607 ---26608 duration_ms: 472.5600026609 ...26610ok 5105 sea/test-single-executable-application-assets # skip Running the resultant binary fails with `/home/iojs/node-tmp/.tmp.2379/sea: error while loading shared libraries: libicui18n.so.71: cannot open shared object file: No such file or directory`.26611 ---26612 duration_ms: 427.1090026613 ...26614ok 5106 sea/test-build-sea-already-exists # skip Running the resultant binary fails with `/home/iojs/node-tmp/.tmp.2379/sea: error while loading shared libraries: libicui18n.so.71: cannot open shared object file: No such file or directory`.26615 ---26616 duration_ms: 898.8420026617 ...26618ok 5107 sea/test-single-executable-application-empty # skip Running the resultant binary fails with `/home/iojs/node-tmp/.tmp.2379/sea: error while loading shared libraries: libicui18n.so.71: cannot open shared object file: No such file or directory`.26619 ---26620 duration_ms: 355.4260026621 ...26622ok 5108 async-hooks/test-pipewrap26623 ---26624 duration_ms: 1463.4640026625 ...26626ok 5109 sea/test-build-sea-invalid-json # skip Running the resultant binary fails with `/home/iojs/node-tmp/.tmp.2379/sea: error while loading shared libraries: libicui18n.so.71: cannot open shared object file: No such file or directory`.26627 ---26628 duration_ms: 775.4590026629 ...26630ok 5110 sea/test-single-executable-application-exec-argv # skip Running the resultant binary fails with `/home/iojs/node-tmp/.tmp.2379/sea: error while loading shared libraries: libicui18n.so.71: cannot open shared object file: No such file or directory`.26631 ---26632 duration_ms: 381.7150026633 ...26634ok 5111 async-hooks/test-nexttick-default-trigger26635 ---26636 duration_ms: 1546.7180026637 ...26638ok 5112 async-hooks/test-track-promises-false26639 ---26640 duration_ms: 1319.2800026641 ...26642ok 5113 sea/test-single-executable-application-esm # skip Running the resultant binary fails with `/home/iojs/node-tmp/.tmp.2379/sea: error while loading shared libraries: libicui18n.so.71: cannot open shared object file: No such file or directory`.26643 ---26644 duration_ms: 430.5340026645 ...26646ok 5114 async-hooks/test-track-promises-default26647 ---26648 duration_ms: 1346.6250026649 ...26650ok 5115 async-hooks/test-net-get-connections26651 ---26652 duration_ms: 1582.5160026653 ...26654ok 5116 sea/test-build-sea-config-not-found # skip Running the resultant binary fails with `/home/iojs/node-tmp/.tmp.2379/sea: error while loading shared libraries: libicui18n.so.71: cannot open shared object file: No such file or directory`.26655 ---26656 duration_ms: 994.9800026657 ...26658ok 5117 async-hooks/test-timers.setInterval26659 ---26660 duration_ms: 1504.8980026661 ...26662ok 5118 async-hooks/test-unhandled-exception-valid-ids26663 ---26664 duration_ms: 1223.6840026665 ...26666ok 5119 async-hooks/test-ttywrap.readstream # skip no valid readable TTY available26667 ---26668 duration_ms: 1336.9480026669 ...26670ok 5120 sea/test-build-sea-executable-field # skip Running the resultant binary fails with `/home/iojs/node-tmp/.tmp.2379/sea: error while loading shared libraries: libicui18n.so.71: cannot open shared object file: No such file or directory`.26671 ---26672 duration_ms: 1121.5760026673 ...26674ok 5121 sea/test-build-sea-invalid-assets # skip Running the resultant binary fails with `/home/iojs/node-tmp/.tmp.2379/sea: error while loading shared libraries: libicui18n.so.71: cannot open shared object file: No such file or directory`.26675 ---26676 duration_ms: 1105.6460026677 ...26678ok 5122 sea/test-single-executable-application-assets-nonexistent-file26679 ---26680 duration_ms: 719.7980026681 ...26682ok 5123 async-hooks/test-httpparser.response26683 ---26684 duration_ms: 1876.3010026685 ...26686ok 5124 sea/test-single-executable-application-snapshot # skip Running the resultant binary fails with `/home/iojs/node-tmp/.tmp.2379/sea: error while loading shared libraries: libicui18n.so.71: cannot open shared object file: No such file or directory`.26687 ---26688 duration_ms: 587.2840026689 ...26690ok 5125 sea/test-build-sea-missing-main # skip Running the resultant binary fails with `/home/iojs/node-tmp/.tmp.2379/sea: error while loading shared libraries: libicui18n.so.71: cannot open shared object file: No such file or directory`.26691 ---26692 duration_ms: 1008.6370026693 ...26694ok 5126 async-hooks/test-statwatcher26695 ---26696 duration_ms: 1746.4850026697 ...26698ok 5127 sea/test-single-executable-application-inspect-in-sea-flags # skip Running the resultant binary fails with `/home/iojs/node-tmp/.tmp.2379/sea: error while loading shared libraries: libicui18n.so.71: cannot open shared object file: No such file or directory`.26699 ---26700 duration_ms: 707.6580026701 ...26702ok 5128 sea/test-single-executable-application-vfs # skip Running the resultant binary fails with `/home/iojs/node-tmp/.tmp.2379/sea: error while loading shared libraries: libicui18n.so.71: cannot open shared object file: No such file or directory`.26703 ---26704 duration_ms: 581.6880026705 ...26706ok 5129 async-hooks/test-udpwrap26707 ---26708 duration_ms: 1519.7230026709 ...26710ok 5130 sea/test-single-executable-application-exec-argv-extension-cli # skip Running the resultant binary fails with `/home/iojs/node-tmp/.tmp.2379/sea: error while loading shared libraries: libicui18n.so.71: cannot open shared object file: No such file or directory`.26711 ---26712 duration_ms: 811.5820026713 ...26714ok 5131 es-module/test-esm-assert-strict26715 ---26716 duration_ms: 397.2740026717 ...26718ok 5132 es-module/test-disable-require-module-with-detection26719 ---26720 duration_ms: 417.0250026721 ...26722ok 5133 sea/test-build-sea-vfs-incompatible-options # skip Running the resultant binary fails with `/home/iojs/node-tmp/.tmp.2379/sea: error while loading shared libraries: libicui18n.so.71: cannot open shared object file: No such file or directory`.26723 ---26724 duration_ms: 1128.7380026725 ...26726ok 5134 sea/test-single-executable-application-assets-invalid-type26727 ---26728 duration_ms: 1011.3240026729 ...26730ok 5135 es-module/test-defer-import-with-regular-import26731 ---26732 duration_ms: 498.6640026733 ...26734ok 5136 sea/test-single-executable-application-exec-argv-extension-env # skip Running the resultant binary fails with `/home/iojs/node-tmp/.tmp.2379/sea: error while loading shared libraries: libicui18n.so.71: cannot open shared object file: No such file or directory`.26735 ---26736 duration_ms: 892.5820026737 ...26738ok 5137 sea/test-single-executable-application-exec-argv-empty # skip Running the resultant binary fails with `/home/iojs/node-tmp/.tmp.2379/sea: error while loading shared libraries: libicui18n.so.71: cannot open shared object file: No such file or directory`.26739 ---26740 duration_ms: 928.5400026741 ...26742ok 5138 es-module/test-cjs-defer-static-import-eval26743 ---26744 duration_ms: 618.8210026745 ...26746ok 5139 sea/test-single-executable-application-exec-argv-extension-none # skip Running the resultant binary fails with `/home/iojs/node-tmp/.tmp.2379/sea: error while loading shared libraries: libicui18n.so.71: cannot open shared object file: No such file or directory`.26747 ---26748 duration_ms: 916.1980026749 ...26750ok 5140 async-hooks/test-writewrap26751 ---26752 duration_ms: 1609.9840026753 ...26754ok 5141 sea/test-build-sea-elf-segments # skip Running the resultant binary fails with `/home/iojs/node-tmp/.tmp.2379/sea: error while loading shared libraries: libicui18n.so.71: cannot open shared object file: No such file or directory`.26755 ---26756 duration_ms: 1528.7470026757 ...26758ok 5142 sea/test-single-executable-application-esm-code-cache # skip Running the resultant binary fails with `/home/iojs/node-tmp/.tmp.2379/sea: error while loading shared libraries: libicui18n.so.71: cannot open shared object file: No such file or directory`.26759 ---26760 duration_ms: 1037.7500026761 ...26762ok 5143 async-hooks/test-http-agent-handle-reuse-serial26763 ---26764 duration_ms: 2261.8830026765 ...26766ok 5144 sea/test-build-sea-invalid-executable # skip Running the resultant binary fails with `/home/iojs/node-tmp/.tmp.2379/sea: error while loading shared libraries: libicui18n.so.71: cannot open shared object file: No such file or directory`.26767 ---26768 duration_ms: 1491.4220026769 ...26770ok 5145 sea/test-single-executable-application-inspect # skip Running the resultant binary fails with `/home/iojs/node-tmp/.tmp.2379/sea: error while loading shared libraries: libicui18n.so.71: cannot open shared object file: No such file or directory`.26771 ---26772 duration_ms: 1017.8590026773 ...26774ok 5146 sea/test-single-executable-application-vfs-esm # skip Running the resultant binary fails with `/home/iojs/node-tmp/.tmp.2379/sea: error while loading shared libraries: libicui18n.so.71: cannot open shared object file: No such file or directory`.26775 ---26776 duration_ms: 901.1310026777 ...26778ok 5147 sea/test-single-executable-application-snapshot-and-code-cache # skip Running the resultant binary fails with `/home/iojs/node-tmp/.tmp.2379/sea: error while loading shared libraries: libicui18n.so.71: cannot open shared object file: No such file or directory`.26779 ---26780 duration_ms: 1011.4520026781 ...26782ok 5148 async-hooks/test-improper-order26783 ---26784 duration_ms: 2354.3820026785 ...26786ok 5149 es-module/test-defer-import-eval-with-tla26787 ---26788 duration_ms: 814.5150026789 ...26790ok 5150 es-module/test-esm-custom-exports26791 ---26792 duration_ms: 496.6290026793 ...26794ok 5151 sea/test-single-executable-application-use-code-cache # skip Running the resultant binary fails with `/home/iojs/node-tmp/.tmp.2379/sea: error while loading shared libraries: libicui18n.so.71: cannot open shared object file: No such file or directory`.26795 ---26796 duration_ms: 1098.5330026797 ...26798ok 5152 es-module/test-cjs-prototype-pollution26799 ---26800 duration_ms: 920.6800026801 ...26802ok 5153 es-module/test-esm-cjs-named-error26803 ---26804 duration_ms: 697.3590026805 ...26806ok 5154 es-module/test-esm-data-urls26807 ---26808 duration_ms: 589.6350026809 ...26810ok 5155 sea/test-single-executable-application-snapshot-worker # skip Running the resultant binary fails with `/home/iojs/node-tmp/.tmp.2379/sea: error while loading shared libraries: libicui18n.so.71: cannot open shared object file: No such file or directory`.26811 ---26812 duration_ms: 1316.5160026813 ...26814ok 5156 async-hooks/test-callback-error26815 ---26816 duration_ms: 3289.7310026817 ...26818ok 5157 es-module/test-esm-dynamic-import-commonjs26819 ---26820 duration_ms: 595.6180026821 ...26822ok 5158 es-module/test-esm-forbidden-globals26823 ---26824 duration_ms: 311.7590026825 ...26826ok 5159 es-module/test-defer-import-with-module-tree26827 ---26828 duration_ms: 1118.6770026829 ...26830ok 5160 es-module/test-esm-dynamic-import-mutating-fs26831 ---26832 duration_ms: 683.6270026833 ...26834ok 5161 sea/test-single-executable-blob-config26835 ---26836 duration_ms: 1329.4280026837 ...26838ok 5162 es-module/test-dynamic-import-script-lifetime26839 ---26840 duration_ms: 1204.6730026841 ...26842ok 5163 es-module/test-esm-dynamic-import26843 ---26844 duration_ms: 805.8650026845 ...26846ok 5164 es-module/test-esm-export-not-found26847 ---26848 duration_ms: 599.1520026849 ...26850ok 5165 es-module/test-esm-dns-promises26851 ---26852 duration_ms: 902.5220026853 ...26854ok 5166 es-module/test-esm-dynamic-import-commonjs26855 ---26856 duration_ms: 800.4540026857 ...26858ok 5167 es-module/test-esm-import-attributes-identity26859 ---26860 duration_ms: 237.6620026861 ...26862ok 5168 es-module/test-esm-exports26863 ---26864 duration_ms: 681.6310026865 ...26866ok 5169 es-module/test-esm-import-attributes-errors26867 ---26868 duration_ms: 290.5990026869 ...26870ok 5170 es-module/test-esm-cyclic-dynamic-import26871 ---26872 duration_ms: 1026.2160026873 ...26874ok 5171 es-module/test-esm-encoded-path-native26875 ---26876 duration_ms: 779.6250026877 ...26878ok 5172 es-module/test-esm-cjs-builtins26879 ---26880 duration_ms: 1207.4940026881 ...26882ok 5173 es-module/test-cjs-legacyMainResolve26883 ---26884 duration_ms: 1563.6300026885 ...26886ok 5174 es-module/test-esm-error-cache26887 ---26888 duration_ms: 892.3610026889 ...26890ok 5175 es-module/test-esm-import-attributes-validation26891 ---26892 duration_ms: 476.3690026893 ...26894ok 5176 es-module/test-esm-dynamic-import-attribute26895 ---26896 duration_ms: 1099.9530026897 ...26898ok 5177 es-module/test-defer-import-eval26899 ---26900 duration_ms: 1655.4590026901 ...26902ok 5178 es-module/test-esm-example-loader26903 ---26904 duration_ms: 1009.9310026905 ...26906ok 5179 es-module/test-esm-fs-promises26907 ---26908 duration_ms: 885.4960026909 ...26910ok 5180 es-module/test-esm-default-type26911 ---26912 duration_ms: 1321.5370026913 ...26914ok 5181 es-module/test-esm-double-encoding26915 ---26916 duration_ms: 1299.8730026917 ...26918ok 5182 es-module/test-esm-cjs-main26919 ---26920 duration_ms: 1512.5560026921 ...26922ok 5183 es-module/test-esm-import-meta-resolve-hooks26923 ---26924 duration_ms: 496.7200026925 ...26926ok 5184 es-module/test-esm-dynamic-import-attribute26927 ---26928 duration_ms: 1346.6470026929 ...26930ok 5185 es-module/test-esm-dynamic-import-mutating-fs26931 ---26932 duration_ms: 1319.6750026933 ...26934ok 5186 es-module/test-esm-import-attributes-validation-text26935 ---26936 duration_ms: 779.6510026937 ...26938ok 5187 es-module/test-esm-in-require-cache26939 ---26940 duration_ms: 563.4490026941 ...26942ok 5188 es-module/test-esm-import-text26943 ---26944 duration_ms: 609.5590026945 ...26946ok 5189 es-module/test-esm-basic-imports26947 ---26948 duration_ms: 1807.4290026949 ...26950ok 5190 es-module/test-cjs-esm-warn26951 ---26952 duration_ms: 2056.6350026953 ...26954ok 5191 es-module/test-esm-json-cache26955 ---26956 duration_ms: 383.5460026957 ...26958ok 5192 es-module/test-esm-import-meta26959 ---26960 duration_ms: 796.6100026961 ...26962ok 5193 es-module/test-esm-experimental-warnings26963 ---26964 duration_ms: 1410.3920026965 ...26966ok 5194 es-module/test-esm-child-process-fork-main26967 ---26968 duration_ms: 1909.6970026969 ...26970ok 5195 es-module/test-esm-import-attributes-326971 ---26972 duration_ms: 1091.5090026973 ...26974ok 5196 es-module/test-esm-live-binding26975 ---26976 duration_ms: 449.4810026977 ...26978ok 5197 es-module/test-esm-invalid-data-urls26979 ---26980 duration_ms: 581.1000026981 ...26982ok 5198 es-module/test-esm-encoded-path26983 ---26984 duration_ms: 1509.7500026985 ...26986ok 5199 es-module/test-esm-in-require-cache-226987 ---26988 duration_ms: 685.6670026989 ...26990ok 5200 es-module/test-esm-import-meta-main26991 ---26992 duration_ms: 996.7160026993 ...26994ok 5201 es-module/test-esm-import-json-named-export26995 ---26996 duration_ms: 1100.0770026997 ...26998ok 5202 es-module/test-esm-loader-mock26999 ---27000 duration_ms: 360.7590027001 ...27002ok 5203 es-module/test-esm-cjs-exports27003 ---27004 duration_ms: 2128.5000027005 ...27006ok 5204 parallel/test-zlib-zip-zip6427007 ---27008 duration_ms: 8294.7230027009 ...27010ok 5205 es-module/test-esm-assertionless-json-import27011 ---27012 duration_ms: 2211.2670027013 ...27014ok 5206 es-module/test-esm-imports27015 ---27016 duration_ms: 993.8620027017 ...27018ok 5207 es-module/test-esm-import-attributes-127019 ---27020 duration_ms: 1508.9060027021 ...27022ok 5208 es-module/test-esm-loader-modulemap27023 ---27024 duration_ms: 488.6490027025 ...27026ok 5209 es-module/test-esm-loader-text-format27027 ---27028 duration_ms: 389.7420027029 ...27030ok 5210 es-module/test-esm-loader-cache-clearing27031 ---27032 duration_ms: 797.4690027033 ...27034ok 5211 es-module/test-esm-loader-custom-condition27035 ---27036 duration_ms: 779.6070027037 ...27038ok 5212 es-module/test-esm-import-assertion-warning27039 ---27040 duration_ms: 1697.1130027041 ...27042ok 5213 es-module/test-esm-import-attributes-errors27043 ---27044 duration_ms: 1526.4910027045 ...27046ok 5214 es-module/test-esm-import-attributes-227047 ---27048 duration_ms: 1619.1260027049 ...27050ok 5215 es-module/test-esm-json27051 ---27052 duration_ms: 1001.4060027053 ...27054ok 5216 es-module/test-esm-loader27055 ---27056 duration_ms: 903.7290027057 ...27058ok 5217 es-module/test-esm-loader-dependency27059 ---27060 duration_ms: 808.1600027061 ...27062ok 5218 async-hooks/test-querywrap27063 ---27064 duration_ms: 4218.8200027065 ...27066ok 5219 es-module/test-esm-loader-with-source27067 ---27068 duration_ms: 685.5130027069 ...27070ok 5220 sea/test-single-executable-blob-config-errors27071 ---27072 duration_ms: 2910.8310027073 ...27074ok 5221 es-module/test-esm-long-path-win # skip this test is Windows-specific.27075 ---27076 duration_ms: 514.6230027077 ...27078ok 5222 es-module/test-esm-namespace27079 ---27080 duration_ms: 495.8850027081 ...27082ok 5223 es-module/test-esm-import-text-disabled27083 ---27084 duration_ms: 1494.6350027085 ...27086ok 5224 es-module/test-esm-loader-stringify-text27087 ---27088 duration_ms: 794.3250027089 ...27090ok 5225 es-module/test-esm-invalid-pjson27091 ---27092 duration_ms: 1377.5750027093 ...27094ok 5226 es-module/test-esm-exports-deprecations27095 ---27096 duration_ms: 2311.2850027097 ...27098ok 5227 es-module/test-esm-path-win3227099 ---27100 duration_ms: 336.4100027101 ...27102ok 5228 es-module/test-esm-pkgname27103 ---27104 duration_ms: 333.5840027105 ...27106ok 5229 es-module/test-esm-main-lookup27107 ---27108 duration_ms: 808.6380027109 ...27110ok 5230 es-module/test-esm-loader-event-loop27111 ---27112 duration_ms: 1242.2870027113 ...27114ok 5231 es-module/test-esm-named-exports27115 ---27116 duration_ms: 927.2200027117 ...27118ok 5232 es-module/test-esm-loader-resolve-type27119 ---27120 duration_ms: 1317.1730027121 ...27122ok 5233 es-module/test-esm-process27123 ---27124 duration_ms: 477.6690027125 ...27126ok 5234 es-module/test-esm-prototype-pollution27127 ---27128 duration_ms: 399.6090027129 ...27130ok 5235 es-module/test-esm-extensionless-esm-and-wasm27131 ---27132 duration_ms: 2612.4170027133 ...27134ok 5236 es-module/test-esm-non-js27135 ---27136 duration_ms: 996.6220027137 ...27138ok 5237 es-module/test-esm-loader-not-found27139 ---27140 duration_ms: 1427.7720027141 ...27142ok 5238 es-module/test-esm-loader-search27143 ---27144 duration_ms: 1402.5990027145 ...27146ok 5239 es-module/test-esm-loader-with-syntax-error27147 ---27148 duration_ms: 1285.7840027149 ...27150ok 5240 es-module/test-esm-nowarn-exports27151 ---27152 duration_ms: 1096.9730027153 ...27154ok 5241 es-module/test-esm-loader-invalid-url27155 ---27156 duration_ms: 1636.6690027157 ...27158ok 5242 es-module/test-esm-preserve-symlinks-not-found-plain27159 ---27160 duration_ms: 749.7270027161 ...27162ok 5243 es-module/test-esm-recursive-cjs-dependencies27163 ---27164 duration_ms: 594.2810027165 ...27166ok 5244 es-module/test-esm-initialization27167 ---27168 duration_ms: 2220.7540027169 ...27170ok 5245 es-module/test-esm-no-addons27171 ---27172 duration_ms: 1432.8260027173 ...27174ok 5246 es-module/test-esm-imports-deprecations27175 ---27176 duration_ms: 2422.4090027177 ...27178ok 5247 es-module/test-esm-preserve-symlinks-not-found27179 ---27180 duration_ms: 988.5860027181 ...27182ok 5248 es-module/test-esm-path-posix27183 ---27184 duration_ms: 1198.3200027185 ...27186ok 5249 es-module/test-esm-package-map-exports27187 ---27188 duration_ms: 1310.5400027189 ...27190ok 5250 es-module/test-esm-package-map-flag27191 ---27192 duration_ms: 1402.6520027193 ...27194ok 5251 es-module/test-esm-require-cache27195 ---27196 duration_ms: 882.5860027197 ...27198ok 5252 es-module/test-esm-shared-loader-dep27199 ---27200 duration_ms: 673.9500027201 ...27202ok 5253 es-module/test-esm-loader-invalid-format27203 ---27204 duration_ms: 2127.8910027205 ...27206ok 5254 es-module/test-esm-snapshot27207 ---27208 duration_ms: 773.2910027209 ...27210ok 5255 es-module/test-esm-require-race-condition27211 ---27212 duration_ms: 904.7070027213 ...27214ok 5256 es-module/test-esm-throw-undefined27215 ---27216 duration_ms: 578.3660027217 ...27218ok 5257 es-module/test-esm-resolve-type27219 ---27220 duration_ms: 892.4350027221 ...27222ok 5258 es-module/test-esm-scope-node-modules27223 ---27224 duration_ms: 894.8480027225 ...27226ok 5259 es-module/test-esm-type-field27227 ---27228 duration_ms: 486.8930027229 ...27230ok 5260 es-module/test-esm-package-map-symlink27231 ---27232 duration_ms: 1705.3370027233 ...27234ok 5261 es-module/test-esm-shebang27235 ---27236 duration_ms: 980.8100027237 ...27238ok 5262 es-module/test-esm-import-meta-resolve27239 ---27240 duration_ms: 3087.6920027241 ...27242ok 5263 es-module/test-esm-syntax-error27243 ---27244 duration_ms: 885.2350027245 ...27246ok 5264 es-module/test-esm-preserve-symlinks27247 ---27248 duration_ms: 1829.9280027249 ...27250ok 5265 es-module/test-esm-symlink27251 ---27252 duration_ms: 1187.6170027253 ...27254ok 5266 es-module/test-esm-extension-lookup-deprecation27255 ---27256 duration_ms: 3945.6500027257 ...27258ok 5267 es-module/test-esm-package-map-basic27259 ---27260 duration_ms: 2312.9450027261 ...27262ok 5268 es-module/test-esm-repl27263 ---27264 duration_ms: 1701.6650027265 ...27266ok 5269 es-module/test-esm-tla27267 ---27268 duration_ms: 1219.6030027269 ...27270ok 5270 es-module/test-esm-loader-thenable27271 ---27272 duration_ms: 2834.6870027273 ...27274ok 5271 es-module/test-esm-type-main27275 ---27276 duration_ms: 1087.7810027277 ...27278ok 5272 es-module/test-esm-undefined-cjs-global-like-variables27279 ---27280 duration_ms: 985.6410027281 ...27282ok 5273 es-module/test-esm-package-map-version-fork27283 ---27284 duration_ms: 2419.5130027285 ...27286ok 5274 es-module/test-esm-preserve-symlinks-main27287 ---27288 duration_ms: 2224.7440027289 ...27290ok 5275 es-module/test-esm-type-field-errors-227291 ---27292 duration_ms: 1201.4930027293 ...27294ok 5276 es-module/test-esm-loader-default-resolver27295 ---27296 duration_ms: 3342.5920027297 ...27298ok 5277 es-module/test-esm-package-map-boundaries27299 ---27300 duration_ms: 2638.7730027301 ...27302ok 5278 es-module/test-esm-url-extname27303 ---27304 duration_ms: 1288.2650027305 ...27306ok 5279 es-module/test-esm-symlink-type27307 ---27308 duration_ms: 1772.0640027309 ...27310ok 5280 es-module/test-esm-type-field-errors27311 ---27312 duration_ms: 1505.7690027313 ...27314ok 5281 es-module/test-esm-virtual-json27315 ---27316 duration_ms: 1201.6660027317 ...27318ok 5282 es-module/test-esm-util-types27319 ---27320 duration_ms: 1286.5590027321 ...27322ok 5283 es-module/test-esm-symlink-main27323 ---27324 duration_ms: 1874.4380027325 ...27326ok 5284 es-module/test-esm-repl-imports27327 ---27328 duration_ms: 2314.9010027329 ...27330ok 5285 es-module/test-esm-wasm-reject-wasm-import-names27331 ---27332 duration_ms: 984.7170027333 ...27334ok 5286 es-module/test-esm-wasm-source-phase-dynamic27335 ---27336 duration_ms: 675.6510027337 ...27338ok 5287 es-module/test-esm-wasm-module-instances-warning27339 ---27340 duration_ms: 1185.8980027341 ...27342ok 5288 es-module/test-esm-wasm-escape-import-names27343 ---27344 duration_ms: 1289.6510027345 ...27346ok 5289 es-module/test-esm-loader-entry-url27347 ---27348 duration_ms: 3736.6130027349 ...27350ok 5290 es-module/test-esm-wasm-js-string-builtins27351 ---27352 duration_ms: 1384.1780027353 ...27354ok 5291 es-module/test-esm-wasm-reject-wasm-js-import-names27355 ---27356 duration_ms: 1073.0100027357 ...27358ok 5292 es-module/test-esm-wasm-vm-source-phase-dynamic27359 ---27360 duration_ms: 759.0390027361 ...27362ok 5293 es-module/test-import-cjs-jitless27363 ---27364 duration_ms: 483.8240027365 ...27366ok 5294 es-module/test-esm-wasm-non-identifier-exports27367 ---27368 duration_ms: 1482.6470027369 ...27370ok 5295 es-module/test-esm-wasm-source-phase-no-execute27371 ---27372 duration_ms: 980.7810027373 ...27374ok 5296 es-module/test-esm-wasm-reject-wasm-js-import-module27375 ---27376 duration_ms: 1200.5260027377 ...27378ok 5297 es-module/test-cjs-legacyMainResolve-permission27379 ---27380 duration_ms: 5932.4820027381 ...27382ok 5298 es-module/test-require-module27383 ---27384 duration_ms: 328.1390027385 ...27386ok 5299 es-module/test-esm-wasm-reject-wasm-js-export-names27387 ---27388 duration_ms: 1285.2580027389 ...27390ok 5300 es-module/test-esm-wasm-vm-source-phase-static27391 ---27392 duration_ms: 778.5660027393 ...27394ok 5301 es-module/test-esm-wasm-source-phase-no-execute-dynamic27395 ---27396 duration_ms: 1014.5090027397 ...27398ok 5302 module-hooks/test-module-hooks-preload27399 ---27400 duration_ms: 9022.1270027401 ...27402ok 5303 es-module/test-esm-wasm-no-code-injection27403 ---27404 duration_ms: 1676.2490027405 ...27406ok 5304 es-module/test-esm-wasm-globals-all-types27407 ---27408 duration_ms: 1804.8590027409 ...27410ok 5305 es-module/test-esm-package-map-paths27411 ---27412 duration_ms: 3446.0180027413 ...27414ok 5306 es-module/test-esm-unknown-extension27415 ---27416 duration_ms: 2098.5480027417 ...27418ok 5307 es-module/test-esm-windows27419 ---27420 duration_ms: 976.1530027421 ...27422ok 5308 es-module/test-import-module-conditional-exports-module27423 ---27424 duration_ms: 799.7500027425 ...27426ok 5309 es-module/test-esm-wasm-reject-wasm-export-names27427 ---27428 duration_ms: 1762.5510027429 ...27430ok 5310 es-module/test-require-module-cached-tla27431 ---27432 duration_ms: 575.4770027433 ...27434ok 5311 es-module/test-require-module-conditional-exports27435 ---27436 duration_ms: 483.2550027437 ...27438ok 5312 es-module/test-esm-register-deprecation27439 ---27440 duration_ms: 3131.4520027441 ...27442ok 5313 es-module/test-loaders-unknown-builtin-module27443 ---27444 duration_ms: 792.6520027445 ...27446ok 5314 es-module/test-esm-module-not-found-commonjs-hint27447 ---27448 duration_ms: 3974.6570027449 ...27450ok 5315 es-module/test-esm-wasm-source-phase-identity27451 ---27452 duration_ms: 1491.6560027453 ...27454ok 5316 es-module/test-esm-wasm-top-level-execution27455 ---27456 duration_ms: 1287.6290027457 ...27458ok 5317 es-module/test-require-module-cycle-cjs-esm-esm27459 ---27460 duration_ms: 528.3090027461 ...27462ok 5318 es-module/test-require-as-esm-interop27463 ---27464 duration_ms: 889.9170027465 ...27466ok 5319 es-module/test-esm-wasm-source-phase-not-defined-static27467 ---27468 duration_ms: 1406.9080027469 ...27470ok 5320 es-module/test-require-module-detect-entry-point-aou27471 ---27472 duration_ms: 494.6490027473 ...27474ok 5321 es-module/test-esm-wasm-load-exports27475 ---27476 duration_ms: 2211.1020027477 ...27478ok 5322 es-module/test-esm-cjs-load-error-note27479 ---27480 duration_ms: 6222.0410027481 ...27482ok 5323 es-module/test-require-module-detect-entry-point27483 ---27484 duration_ms: 579.5250027485 ...27486ok 5324 es-module/test-loaders-hidden-from-users27487 ---27488 duration_ms: 1118.9280027489 ...27490ok 5325 es-module/test-esm-package-map-errors27491 ---27492 duration_ms: 4048.6560027493 ...27494ok 5326 es-module/test-import-module-retry-require-errored27495 ---27496 duration_ms: 1312.0030027497 ...27498ok 5327 es-module/test-require-esm-from-imported-cjs27499 ---27500 duration_ms: 1201.9660027501 ...27502ok 5328 es-module/test-esm-wasm-source-phase-not-defined-dynamic27503 ---27504 duration_ms: 1727.5870027505 ...27506ok 5329 es-module/test-require-module-conditional-exports-module27507 ---27508 duration_ms: 902.4850027509 ...27510ok 5330 es-module/test-require-module-dynamic-import-327511 ---27512 duration_ms: 669.7010027513 ...27514ok 5331 es-module/test-extensionless-esm-type-commonjs27515 ---27516 duration_ms: 1389.6910027517 ...27518ok 5332 es-module/test-require-module-dont-detect-cjs27519 ---27520 duration_ms: 785.3840027521 ...27522ok 5333 es-module/test-require-module-tla-nested27523 ---27524 duration_ms: 311.3100027525 ...27526ok 5334 es-module/test-require-module-implicit27527 ---27528 duration_ms: 586.7170027529 ...27530ok 5335 es-module/test-require-module-synchronous-rejection-handling27531 ---27532 duration_ms: 501.3860027533 ...27534ok 5336 es-module/test-esm-import-meta-main-eval27535 ---27536 duration_ms: 5616.9750027537 ...27538ok 5337 es-module/test-import-preload-require-cycle27539 ---27540 duration_ms: 1529.9520027541 ...27542ok 5338 es-module/test-require-module-retry-import-errored-227543 ---27544 duration_ms: 602.4960027545 ...27546ok 5339 es-module/test-require-module-default-extension27547 ---27548 duration_ms: 1014.7650027549 ...27550ok 5340 es-module/test-require-module-instantiated27551 ---27552 duration_ms: 691.7030027553 ...27554ok 5341 es-module/test-require-module-defined-esmodule27555 ---27556 duration_ms: 1010.3410027557 ...27558ok 5342 es-module/test-esm-wasm-source-phase-static27559 ---27560 duration_ms: 1898.4840027561 ...27562ok 5343 es-module/test-require-module-dynamic-import-427563 ---27564 duration_ms: 805.8340027565 ...27566ok 5344 es-module/test-require-module-retry-import-errored27567 ---27568 duration_ms: 690.6310027569 ...27570ok 5345 es-module/test-require-module-tla-retry-require27571 ---27572 duration_ms: 291.3420027573 ...27574ok 5346 es-module/test-require-module-dynamic-import-227575 ---27576 duration_ms: 996.5080027577 ...27578ok 5347 es-module/test-require-module-tla-instantiation-error27579 ---27580 duration_ms: 563.7250027581 ...27582ok 5348 es-module/test-require-module-tla-retry-import-227583 ---27584 duration_ms: 340.6200027585 ...27586ok 5349 es-module/test-require-module-retry-import-evaluating27587 ---27588 duration_ms: 706.6040027589 ...27590ok 5350 es-module/test-require-module-error-catching27591 ---27592 duration_ms: 899.5030027593 ...27594ok 5351 es-module/test-require-module-dynamic-import-127595 ---27596 duration_ms: 1107.6740027597 ...27598ok 5352 es-module/test-import-require-tla-twice27599 ---27600 duration_ms: 1711.4840027601 ...27602ok 5353 es-module/test-require-module-tla-rejected27603 ---27604 duration_ms: 686.6050027605 ...27606ok 5354 es-module/test-require-module-tla-error-metadata27607 ---27608 duration_ms: 890.3720027609 ...27610ok 5355 es-module/test-require-module-tla-resolved27611 ---27612 duration_ms: 698.2610027613 ...27614ok 5356 es-module/test-require-module-tla-retry-import27615 ---27616 duration_ms: 695.6020027617 ...27618ok 5357 es-module/test-require-module-twice27619 ---27620 duration_ms: 606.7030027621 ...27622ok 5358 es-module/test-require-module-tla-execution27623 ---27624 duration_ms: 993.5690027625 ...27626ok 5359 es-module/test-wasm-simple27627 ---27628 duration_ms: 465.5910027629 ...27630ok 5360 es-module/test-require-module-tla-unresolved27631 ---27632 duration_ms: 890.6530027633 ...27634ok 5361 wasi/test-wasi-initialize-validation27635 ---27636 duration_ms: 357.2950027637 ...27638ok 5362 es-module/test-require-module-cycle-esm-cjs-esm-esm27639 ---27640 duration_ms: 2043.4730027641 ...27642ok 5363 es-module/test-require-module-tla-print-execution27643 ---27644 duration_ms: 1434.2520027645 ...27646ok 5364 es-module/test-require-module-errors27647 ---27648 duration_ms: 1808.5790027649 ...27650ok 5365 es-module/test-require-module-cycle-esm-esm-cjs-esm27651 ---27652 duration_ms: 2237.7490027653 ...27654ok 5366 wasi/test-return-on-exit27655 ---27656 duration_ms: 1101.5390027657 ...27658ok 5367 es-module/test-require-module-feature-detect27659 ---27660 duration_ms: 2024.5260027661 ...27662ok 5368 es-module/test-require-module-warning27663 ---27664 duration_ms: 1506.4480027665 ...27666ok 5369 es-module/test-wasm-memory-out-of-bound27667 ---27668 duration_ms: 1296.6950027669 ...27670ok 5370 es-module/test-vm-synthetic-module-leak27671 ---27672 duration_ms: 1324.6410027673 ...27674ok 5371 wasi/test-wasi-options-validation27675 ---27676 duration_ms: 393.6180027677 ...27678ok 5372 es-module/test-require-module-cycle-esm-cjs-esm27679 ---27680 duration_ms: 2452.6820027681 ...27682ok 5373 wasi/test-wasi-not-started27683 ---27684 duration_ms: 784.9620027685 ...27686ok 5374 es-module/test-esm-import-flag27687 ---27688 duration_ms: 7211.6320027689 ...27690ok 5375 es-module/test-vm-compile-function-lineoffset27691 ---27692 duration_ms: 1520.5240027693 ...27694ok 5376 es-module/test-require-module-with-detection27695 ---27696 duration_ms: 1734.4140027697 ...27698ok 5377 wasi/test-wasi-start-validation27699 ---27700 duration_ms: 269.4250027701 ...27702ok 5378 wasi/test-wasi-ftruncate27703 ---27704 duration_ms: 1310.5250027705 ...27706ok 5379 es-module/test-esm-source-map27707 ---27708 duration_ms: 5179.5980027709 ...27710ok 5380 es-module/test-require-module-cycle-esm-esm-cjs-esm-esm27711 ---27712 duration_ms: 2746.8080027713 ...27714ok 5381 es-module/test-vm-compile-function-leak27715 ---27716 duration_ms: 1727.7040027717 ...27718ok 5382 es-module/test-require-module-transpiled27719 ---27720 duration_ms: 1943.9740027721 ...27722ok 5383 es-module/test-vm-main-context-default-loader-eval27723 ---27724 duration_ms: 1716.7220027725 ...27726ok 5384 wasi/test-wasi-worker-terminate27727 ---27728 duration_ms: 385.6840027729 ...27730ok 5385 wasi/test-wasi-getentropy27731 ---27732 duration_ms: 1514.7310027733 ...27734ok 5386 wasi/test-wasi-fd_prestat_get_refresh27735 ---27736 duration_ms: 1696.4860027737 ...27738ok 5387 pseudo-tty/console-dumb-tty27739 ---27740 duration_ms: 421.2120027741 ...27742ok 5388 wasi/test-wasi-cant_dotdot27743 ---27744 duration_ms: 1896.4640027745 ...27746ok 5389 es-module/test-vm-main-context-default-loader27747 ---27748 duration_ms: 2016.3910027749 ...27750ok 5390 pseudo-tty/no_interleaved_stdio27751 ---27752 duration_ms: 472.0880027753 ...27754ok 5391 es-module/test-require-module-preload27755 ---27756 duration_ms: 2739.9230027757 ...27758ok 5392 es-module/test-require-node-modules-warning27759 ---27760 duration_ms: 2244.5150027761 ...27762ok 5393 es-module/test-vm-contextified-script-leak27763 ---27764 duration_ms: 2128.6940027765 ...27766ok 5394 pseudo-tty/ref_keeps_node_running27767 ---27768 duration_ms: 464.7000027769 ...27770ok 5395 pseudo-tty/no_dropped_stdio27771 ---27772 duration_ms: 579.6950027773 ...27774ok 5396 pseudo-tty/readline-dumb-tty27775 ---27776 duration_ms: 590.5690027777 ...27778ok 5397 wasi/test-wasi-stdio27779 ---27780 duration_ms: 860.1820027781 ...27782ok 5398 wasi/test-wasi-notdir27783 ---27784 duration_ms: 1466.8750027785 ...27786ok 5399 wasi/test-wasi-getrusage27787 ---27788 duration_ms: 1925.5400027789 ...27790ok 5400 pseudo-tty/test-fatal-error27791 ---27792 duration_ms: 386.0050027793 ...27794ok 5401 wasi/test-wasi-clock_getres27795 ---27796 duration_ms: 2292.7470027797 ...27798ok 5402 pseudo-tty/test-assert-position-indicator27799 ---27800 duration_ms: 666.5650027801 ...27802ok 5403 pseudo-tty/test-assert-colors27803 ---27804 duration_ms: 698.0420027805 ...27806ok 5404 pseudo-tty/console_colors27807 ---27808 duration_ms: 905.3610027809 ...27810ok 5405 wasi/test-wasi-gettimeofday27811 ---27812 duration_ms: 2122.5930027813 ...27814ok 5406 pseudo-tty/test-handle-wrap-hasref-tty27815 ---27816 duration_ms: 597.2120027817 ...27818ok 5407 pseudo-tty/test-async-wrap-getasyncid-tty27819 ---27820 duration_ms: 684.3610027821 ...27822ok 5408 pseudo-tty/stdin-setrawmode27823 ---27824 duration_ms: 804.6830027825 ...27826ok 5409 pseudo-tty/test-assert-no-color27827 ---27828 duration_ms: 790.9480027829 ...27830ok 5410 es-module/test-vm-source-text-module-leak27831 ---27832 duration_ms: 2521.9120027833 ...27834ok 5411 pseudo-tty/repl-dumb-tty27835 ---27836 duration_ms: 898.6090027837 ...27838ok 5412 pseudo-tty/test-set-raw-mode-modes27839 ---27840 duration_ms: 595.5410027841 ...27842ok 5413 wasi/test-wasi-stat27843 ---27844 duration_ms: 1357.2940027845 ...27846ok 5414 pseudo-tty/test-readable-tty-keepalive27847 ---27848 duration_ms: 717.8020027849 ...27850ok 5415 wasi/test-wasi-main_args27851 ---27852 duration_ms: 2183.5490027853 ...27854ok 5416 pseudo-tty/test-stderr-stdout-handle-sigwinch27855 ---27856 duration_ms: 596.7130027857 ...27858ok 5417 es-module/test-require-module-tla-error-snapshot27859 ---27860 duration_ms: 3346.8260027861 ...27862ok 5418 wasi/test-wasi-write_file27863 ---27864 duration_ms: 1376.0200027865 ...27866ok 5419 wasi/test-wasi-preopen_populates27867 ---27868 duration_ms: 1785.1590027869 ...27870ok 5420 es-module/test-loaders-workers-spawned27871 ---27872 duration_ms: 4288.1900027873 ...27874ok 5421 pseudo-tty/test-tty-color-support27875 ---27876 duration_ms: 400.6280027877 ...27878ok 5422 wasi/test-wasi-sock27879 ---27880 duration_ms: 1563.4400027881 ...27882ok 5423 es-module/test-esm-tla-unfinished27883 ---27884 duration_ms: 5984.6450027885 ...27886ok 5424 pseudo-tty/test-stdout-read27887 ---27888 duration_ms: 700.1600027889 ...27890ok 5425 pseudo-tty/test-tty-stream-constructors27891 ---27892 duration_ms: 392.9830027893 ...27894ok 5426 pseudo-tty/test-stdin-write27895 ---27896 duration_ms: 811.3770027897 ...27898ok 5427 pseudo-tty/test-tty-stdin-call-end27899 ---27900 duration_ms: 485.7030027901 ...27902ok 5428 pseudo-tty/test-tty-wrap27903 ---27904 duration_ms: 354.2960027905 ...27906ok 5429 pseudo-tty/test-set-raw-mode-reset27907 ---27908 duration_ms: 1000.3750027909 ...27910ok 5430 pseudo-tty/test-set-raw-mode-reset-signal27911 ---27912 duration_ms: 920.9210027913 ...27914ok 5431 wasi/test-wasi-readdir27915 ---27916 duration_ms: 1880.9430027917 ...27918ok 5432 pseudo-tty/test-repl-external-module27919 ---27920 duration_ms: 1148.7780027921 ...27922ok 5433 pseudo-tty/test-trace-sigint-disabled27923 ---27924 duration_ms: 777.6880027925 ...27926ok 5434 pseudo-tty/test-stop-trace-sigint27927 ---27928 duration_ms: 987.9570027929 ...27930ok 5435 pseudo-tty/test-tty-stdout-end27931 ---27932 duration_ms: 680.4290027933 ...27934ok 5436 pseudo-tty/test-tty-stdout-resize27935 ---27936 duration_ms: 679.7260027937 ...27938ok 5437 pseudo-tty/test-start-trace-sigint27939 ---27940 duration_ms: 1112.8520027941 ...27942ok 5438 pseudo-tty/test-tty-color-support-warning-227943 ---27944 duration_ms: 791.2600027945 ...27946ok 5439 client-proxy/test-http-proxy-request-invalid-credentials27947 ---27948 duration_ms: 419.6200027949 ...27950ok 5440 pseudo-tty/test-tty-isatty27951 ---27952 duration_ms: 799.7380027953 ...27954ok 5441 pseudo-tty/test-set-raw-mode-reset-process-exit27955 ---27956 duration_ms: 1226.7210027957 ...27958ok 5442 pseudo-tty/test-tty-color-support-warning27959 ---27960 duration_ms: 925.6590027961 ...27962ok 5443 pseudo-tty/test-testpy-env-var-via-comment27963 ---27964 duration_ms: 1090.0660027965 ...27966ok 5444 pseudo-tty/test-tty-stdin-end27967 ---27968 duration_ms: 880.6790027969 ...27970ok 5445 client-proxy/test-http-proxy-request-absolute-path-authority-match27971 ---27972 duration_ms: 630.9150027973 ...27974ok 5446 client-proxy/test-http-proxy-request-invalid-char-in-options27975 ---27976 duration_ms: 598.3820027977 ...27978ok 5447 client-proxy/test-http-proxy-request-authority-construction27979 ---27980 duration_ms: 808.6730027981 ...27982ok 5448 client-proxy/test-http-proxy-request-invalid-char-in-url27983 ---27984 duration_ms: 797.6830027985 ...27986ok 5449 client-proxy/test-http-proxy-perf-hooks27987 ---27988 duration_ms: 915.4910027989 ...27990ok 5450 pseudo-tty/test-trace-sigint-on-idle27991 ---27992 duration_ms: 1286.3010027993 ...27994ok 5451 client-proxy/test-http-proxy-request-invalid-proxy27995 ---27996 duration_ms: 800.6110027997 ...27998ok 5452 pseudo-tty/test-tty-window-size27999 ---28000 duration_ms: 1112.6090028001 ...28002ok 5453 es-module/test-esm-loader-programmatically28003 ---28004 duration_ms: 8664.7140028005 ...28006ok 5454 client-proxy/test-http-proxy-request-invalid-url28007 ---28008 duration_ms: 808.9730028009 ...28010ok 5455 pseudo-tty/test-trace-sigint28011 ---28012 duration_ms: 1615.5120028013 ...28014ok 5456 client-proxy/test-http-proxy-request-origin-form-path28015 ---28016 duration_ms: 788.1940028017 ...28018ok 5457 client-proxy/test-http-proxy-request-validation-errors28019 ---28020 duration_ms: 821.2610028021 ...28022ok 5458 client-proxy/test-http-proxy-request-max-sockets28023 ---28024 duration_ms: 1101.7130028025 ...28026ok 5459 client-proxy/test-http-proxy-request-connection-refused28027 ---28028 duration_ms: 1334.8900028029 ...28030ok 5460 client-proxy/test-http-proxy-request-https-proxy28031 ---28032 duration_ms: 1332.7860028033 ...28034ok 5461 client-proxy/test-http-proxy-request-socket-keep-alive28035 ---28036 duration_ms: 942.3280028037 ...28038ok 5462 client-proxy/test-http-set-global-proxy-from-env-invalid-type28039 ---28040 duration_ms: 495.5960028041 ...28042ok 5463 wasi/test-wasi-exitcode28043 ---28044 duration_ms: 4054.2410028045 ...28046ok 5464 wasi/test-wasi-symlinks28047 ---28048 duration_ms: 2927.0640028049 ...28050ok 5465 client-proxy/test-http-set-global-proxy-from-env-invalid-url28051 ---28052 duration_ms: 560.6610028053 ...28054ok 5466 client-proxy/test-http-request-proxy-post28055 ---28056 duration_ms: 1041.0890028057 ...28058ok 5467 es-module/test-esm-loader-spawn-promisified28059 ---28060 duration_ms: 9181.8190028061 ...28062ok 5468 client-proxy/test-http-set-global-proxy-from-env-fetch-default28063 ---28064 duration_ms: 1011.7820028065 ...28066ok 5469 es-module/test-wasm-web-api28067 ---28068 duration_ms: 4267.1710028069 ...28070ok 5470 client-proxy/test-http-proxy-request-proxy-failure-hang-up28071 ---28072 duration_ms: 1137.1830028073 ...28074ok 5471 client-proxy/test-http-set-global-proxy-from-env-fetch-https28075 ---28076 duration_ms: 997.4490028077 ...28078ok 5472 client-proxy/test-http-proxy-request-proxy-failure-50028079 ---28080 duration_ms: 1185.3630028081 ...28082ok 5473 wasi/test-wasi-io28083 ---28084 duration_ms: 3964.8870028085 ...28086ok 5474 client-proxy/test-http-set-global-proxy-from-env-fetch-no-proxy28087 ---28088 duration_ms: 1016.9450028089 ...28090ok 5475 client-proxy/test-http-set-global-proxy-from-env-http-request-empty28091 ---28092 duration_ms: 882.7160028093 ...28094ok 5476 client-proxy/test-http-proxy-request-no-proxy-asterisk28095 ---28096 duration_ms: 1506.0640028097 ...28098ok 5477 client-proxy/test-http-proxy-request28099 ---28100 duration_ms: 1842.9510028101 ...28102ok 5478 client-proxy/test-http-set-global-proxy-from-env-http-request-default28103 ---28104 duration_ms: 999.7870028105 ...28106ok 5479 client-proxy/test-http-set-global-proxy-from-env-http-request28107 ---28108 duration_ms: 1197.4100028109 ...28110ok 5480 client-proxy/test-http-set-global-proxy-from-env-fetch-empty28111 ---28112 duration_ms: 1296.0500028113 ...28114ok 5481 client-proxy/test-http-request-proxy-post-server-failure28115 ---28116 duration_ms: 1415.7710028117 ...28118ok 5482 client-proxy/test-http-set-global-proxy-from-env-fetch28119 ---28120 duration_ms: 1416.0200028121 ...28122ok 5483 client-proxy/test-http-set-global-proxy-from-env-http-request-restore28123 ---28124 duration_ms: 1102.2500028125 ...28126ok 5484 client-proxy/test-http-proxy-request-no-proxy-port-specific28127 ---28128 duration_ms: 1591.1500028129 ...28130ok 5485 client-proxy/test-http-proxy-request-ipv628131 ---28132 duration_ms: 1817.8710028133 ...28134ok 5486 client-proxy/test-http-set-global-proxy-from-env-fetch-restore28135 ---28136 duration_ms: 1391.1460028137 ...28138ok 5487 client-proxy/test-https-proxy-request-invalid-char-in-options28139 ---28140 duration_ms: 500.1120028141 ...28142ok 5488 client-proxy/test-https-proxy-request-connection-refused28143 ---28144 duration_ms: 712.5420028145 ...28146ok 5489 client-proxy/test-http-proxy-request-no-proxy28147 ---28148 duration_ms: 1809.9440028149 ...28150ok 5490 client-proxy/test-http-set-global-proxy-from-env-override-http28151 ---28152 duration_ms: 996.4120028153 ...28154ok 5491 client-proxy/test-https-proxy-request-invalid-credentials28155 ---28156 duration_ms: 589.4630028157 ...28158ok 5492 client-proxy/test-http-set-global-proxy-from-env-no-proxy28159 ---28160 duration_ms: 1190.7010028161 ...28162ok 5493 client-proxy/test-http-set-global-proxy-from-env-override-fetch28163 ---28164 duration_ms: 1186.0190028165 ...28166ok 5494 client-proxy/test-http-set-global-proxy-from-env-https-request28167 ---28168 duration_ms: 1292.2390028169 ...28170ok 5495 client-proxy/test-https-proxy-request-header-overflow28171 ---28172 duration_ms: 798.7400028173 ...28174ok 5496 client-proxy/test-http-proxy-request-no-proxy-ip28175 ---28176 duration_ms: 2006.6610028177 ...28178ok 5497 client-proxy/test-https-proxy-request-auth-failure28179 ---28180 duration_ms: 995.4570028181 ...28182ok 5498 client-proxy/test-https-proxy-request-socket-keep-alive28183 ---28184 duration_ms: 484.5300028185 ...28186ok 5499 client-proxy/test-https-proxy-request-invalid-url28187 ---28188 duration_ms: 786.3240028189 ...28190ok 5500 client-proxy/test-https-proxy-request-invalid-char-in-url28191 ---28192 duration_ms: 812.6890028193 ...28194ok 5501 client-proxy/test-https-proxy-request-max-sockets28195 ---28196 duration_ms: 796.4980028197 ...28198ok 5502 client-proxy/test-https-proxy-request-handshake-failure28199 ---28200 duration_ms: 1047.8100028201 ...28202ok 5503 client-proxy/test-https-proxy-request-empty-response28203 ---28204 duration_ms: 1113.6060028205 ...28206ok 5504 client-proxy/test-http-proxy-fetch28207 ---28208 duration_ms: 2570.6320028209 ...28210ok 5505 client-proxy/test-https-proxy-request-proxy-failure-50228211 ---28212 duration_ms: 783.5220028213 ...28214ok 5506 wasi/test-wasi-pthread28215 ---28216 duration_ms: 4155.6510028217 ...28218ok 5507 client-proxy/test-https-proxy-request-malformed-response28219 ---28220 duration_ms: 984.8010028221 ...28222ok 5508 client-proxy/test-https-proxy-request-https-proxy28223 ---28224 duration_ms: 1131.6170028225 ...28226ok 5509 client-proxy/test-https-proxy-request-no-proxy28227 ---28228 duration_ms: 991.9970028229 ...28230ok 5510 client-proxy/test-https-proxy-request-proxy-failure-hang-up28231 ---28232 duration_ms: 893.4520028233 ...28234ok 5511 es-module/test-typescript-module28235 ---28236 duration_ms: 5517.4140028237 ...28238ok 5512 client-proxy/test-https-proxy-request-server-failure-hang-up28239 ---28240 duration_ms: 896.3440028241 ...28242ok 5513 client-proxy/test-https-proxy-request-proxy-failure-50028243 ---28244 duration_ms: 1093.0280028245 ...28246ok 5514 client-proxy/test-https-proxy-request-proxy-failure-40428247 ---28248 duration_ms: 1299.9210028249 ...28250ok 5515 client-proxy/test-https-proxy-request-ipv628251 ---28252 duration_ms: 1403.6330028253 ...28254ok 5516 client-proxy/test-https-request-proxy-post28255 ---28256 duration_ms: 1094.5390028257 ...28258ok 5517 client-proxy/test-https-proxy-request28259 ---28260 duration_ms: 1725.5390028261 ...28262ok 5518 es-module/test-esm-loader-chaining28263 ---28264 duration_ms: 11098.1750028265 ...28266ok 5519 client-proxy/test-https-proxy-request-incomplete-headers28267 ---28268 duration_ms: 1745.0640028269 ...28270ok 5520 client-proxy/test-http-proxy-request-no-proxy-domain28271 ---28272 duration_ms: 3031.3110028273 ...28274ok 5521 client-proxy/test-use-env-proxy-cli-http28275 ---28276 duration_ms: 1399.1230028277 ...28278ok 5522 client-proxy/test-https-proxy-fetch28279 ---28280 duration_ms: 2324.3470028281 ...28282ok 5523 client-proxy/test-use-env-proxy-cli-https28283 ---28284 duration_ms: 1596.0420028285 ...28286ok 5524 client-proxy/test-use-env-proxy-precedence28287 ---28288 duration_ms: 1566.4570028289 ...28290ok 5525 client-proxy/test-https-proxy-request-tunnel-timeout-agent28291 ---28292 duration_ms: 1882.4130028293 ...28294ok 5526 pummel/test-array-hash-collision28295 ---28296 duration_ms: 1567.1060028297 ...28298ok 5527 client-proxy/test-https-proxy-request-tunnel-timeout28299 ---28300 duration_ms: 2015.7570028301 ...28302ok 5528 es-module/test-typescript-commonjs28303 ---28304 duration_ms: 6866.7950028305 ...28306ok 5529 es-module/test-esm-detect-ambiguous28307 ---28308 duration_ms: 13366.6000028309 ...28310ok 5530 wasi/test-wasi-poll28311 ---28312 duration_ms: 7683.5340028313 ...28314ok 5531 es-module/test-typescript-eval28315 ---28316 duration_ms: 9274.6200028317 ...28318ok 5532 es-module/test-esm-tla-syntax-errors-not-recognized-as-tla-error28319 ---28320 duration_ms: 12969.6580028321 ...28322ok 5533 pummel/test-blob-slice-with-large-size28323 ---28324 duration_ms: 4401.4160028325 ...28326ok 5534 es-module/test-typescript28327 ---28328 duration_ms: 12166.7000028329 ...28330ok 5535 pummel/test-buffer-large-size-buffer-alloc28331 ---28332 duration_ms: 4414.4860028333 ...28334ok 5536 pummel/test-buffer-large-size-buffer-alloc-unsafe28335 ---28336 duration_ms: 5544.6150028337 ...28338ok 5537 pummel/test-buffer-large-size-buffer-alloc-unsafe-slow28339 ---28340 duration_ms: 3293.6900028341 ...28342ok 5538 pummel/test-buffer-large-size-buffer-write28343 ---28344 duration_ms: 372.5120028345 ...28346ok 5539 pummel/test-buffer-large-size-copy28347 ---28348 duration_ms: 4995.4430028349 ...28350ok 5540 pummel/test-buffer-large-size-slowbuffer28351 ---28352 duration_ms: 3189.7740028353 ...28354ok 5541 pummel/test-child-process-spawn-loop28355 ---28356 duration_ms: 3299.5120028357 ...28358ok 5542 pummel/test-crypto-argon2-nonblocking-constructor28359 ---28360 duration_ms: 5542.5820028361 ...28362ok 5543 pummel/test-crypto-dh-hash28363 ---28364 duration_ms: 670.4870028365 ...28366ok 5544 pummel/test-crypto-dh-keys28367 ---28368 duration_ms: 655.5300028369 ...28370ok 5545 pummel/test-crypto-pqc-sign-verify-slh-dsa28371 ---28372 duration_ms: 24034.5610028373 ...28374ok 5546 pummel/test-dh-regr28375 ---28376 duration_ms: 33053.2170028377 ...28378ok 5547 pummel/test-fs-largefile28379 ---28380 duration_ms: 109.4630028381 ...28382ok 5548 pummel/test-fs-read-file-sync-utf8-memory28383 ---28384 duration_ms: 407.8440028385 ...28386ok 5549 pummel/test-fs-readfile-tostring-fail28387 ---28388 duration_ms: 908.5400028389 ...28390ok 5550 pummel/test-heap-profile-and-snapshot-near-heap-limit28391 ---28392 duration_ms: 1008.6250028393 ...28394ok 5551 pummel/test-heap-profile-near-heap-limit28395 ---28396 duration_ms: 1008.3670028397 ...28398ok 5552 pummel/test-heapdump-dns28399 ---28400 duration_ms: 2510.3890028401 ...28402ok 5553 pummel/test-heapdump-env28403 ---28404 duration_ms: 1217.4140028405 ...28406ok 5554 pummel/test-heapdump-fs-promise28407 ---28408 duration_ms: 2464.4930028409 ...28410ok 5555 pummel/test-heapdump-http228411 ---28412 duration_ms: 3849.3390028413 ...28414ok 5556 pummel/test-heapdump-inspector28415 ---28416 duration_ms: 1709.8280028417 ...28418ok 5557 pummel/test-heapdump-shadow-realm28419 ---28420 duration_ms: 4212.0670028421 ...28422ok 5558 pummel/test-heapdump-tls28423 ---28424 duration_ms: 1710.4470028425 ...28426ok 5559 pummel/test-heapdump-urlpattern28427 ---28428 duration_ms: 1510.2330028429 ...28430ok 5560 pummel/test-heapdump-vm-script28431 ---28432 duration_ms: 909.1420028433 ...28434ok 5561 pummel/test-heapdump-worker28435 ---28436 duration_ms: 1509.3990028437 ...28438ok 5562 pummel/test-heapdump-zlib28439 ---28440 duration_ms: 11721.3730028441 ...28442ok 5563 pummel/test-heapdump-zstd28443 ---28444 duration_ms: 2211.0780028445 ...28446ok 5564 pummel/test-heapsnapshot-near-heap-limit28447 ---28448 duration_ms: 2611.8550028449 ...28450ok 5565 pummel/test-heapsnapshot-near-heap-limit-big28451 ---28452 duration_ms: 2510.4410028453 ...28454ok 5566 pummel/test-heapsnapshot-near-heap-limit-bounded28455 ---28456 duration_ms: 2310.0260028457 ...28458ok 5567 pummel/test-heapsnapshot-near-heap-limit-by-api28459 ---28460 duration_ms: 4413.7790028461 ...28462ok 5568 pummel/test-http-many-keep-alive-connections28463 ---28464 duration_ms: 608.0890028465 ...28466ok 5569 pummel/test-http-upload-timeout28467 ---28468 duration_ms: 3412.1570028469 ...28470ok 5570 pummel/test-https-large-response28471 ---28472 duration_ms: 327.8450028473 ...28474ok 5571 pummel/test-https-no-reader28475 ---28476 duration_ms: 2410.4850028477 ...28478ok 5572 pummel/test-keep-alive # skip test requires `wrk` to be installed first28479 ---28480 duration_ms: 109.5010028481 ...28482ok 5573 pummel/test-net-many-clients28483 ---28484 duration_ms: 262.0040028485 ...28486ok 5574 pummel/test-net-pause28487 ---28488 duration_ms: 2310.4040028489 ...28490ok 5575 pummel/test-net-pingpong28491 ---28492 duration_ms: 327.6500028493 ...28494ok 5576 pummel/test-net-pingpong-delay28495 ---28496 duration_ms: 507.5870028497 ...28498ok 5577 pummel/test-net-timeout28499 ---28500 duration_ms: 3813.3570028501 ...28502ok 5578 pummel/test-net-timeout228503 ---28504 duration_ms: 5315.8180028505 ...28506ok 5579 pummel/test-net-write-callbacks28507 ---28508 duration_ms: 908.9870028509 ...28510ok 5580 pummel/test-next-tick-infinite-calls28511 ---28512 duration_ms: 5015.4050028513 ...28514ok 5581 pummel/test-process-cpuUsage28515 ---28516 duration_ms: 708.7830028517 ...28518ok 5582 pummel/test-process-hrtime28519 ---28520 duration_ms: 2210.6100028521 ...28522ok 5583 pummel/test-regress-GH-89228523 ---28524 duration_ms: 508.8980028525 ...28526ok 5584 pummel/test-repl-paste-big-data28527 ---28528 duration_ms: 608.1460028529 ...28530ok 5585 pummel/test-stream-pipe-multi28531 ---28532 duration_ms: 827.6750028533 ...28534ok 5586 pummel/test-string-decoder-large-buffer28535 ---28536 duration_ms: 109.6760028537 ...28538ok 5587 pummel/test-structuredclone-jstransferable28539 ---28540 duration_ms: 909.2100028541 ...28542ok 5588 pummel/test-timers28543 ---28544 duration_ms: 3212.4510028545 ...28546ok 5589 pummel/test-tls-server-large-request28547 ---28548 duration_ms: 210.3270028549 ...28550ok 5590 pummel/test-tls-throttle28551 ---28552 duration_ms: 169.6700028553 ...28554ok 5591 pummel/test-vm-memleak28555 ---28556 duration_ms: 5515.0310028557 ...28558ok 5592 pummel/test-vm-race28559 ---28560 duration_ms: 5213.4590028561 ...28562ok 5593 pummel/test-watch-file28563 ---28564 duration_ms: 5214.6700028565 ...28566ok 5594 pummel/test-webcrypto-derivebits-pbkdf228567 ---28568 duration_ms: 4313.5860028569 ...28570ok 5595 pummel/test-webcrypto-kangarootwelve-32bit-overflow # skip only relevant when kMaxLength < 2^3228571 ---28572 duration_ms: 136.2870028573 ...28574ok 5596 pummel/test-worker-take-heapsnapshot28575 ---28576 duration_ms: 708.8640028577 ...28578ok 5597 pummel/test-zlib-zip-slow28579 ---28580 duration_ms: 14025.8040028581 ...28582ok 5598 abort/test-abort-backtrace28583 ---28584 duration_ms: 334.0190028585 ...28586ok 5599 abort/test-abort-fatal-error28587 ---28588 duration_ms: 514.1330028589 ...28590ok 5600 abort/test-abort-uncaught-exception28591 ---28592 duration_ms: 413.9840028593 ...28594ok 5601 abort/test-addon-register-signal-handler # skip binding not built yet28595 ---28596 duration_ms: 142.4090028597 ...28598ok 5602 abort/test-addon-uv-handle-leak # skip binding not built yet28599 ---28600 duration_ms: 142.7270028601 ...28602ok 5603 abort/test-http-parser-consume28603 ---28604 duration_ms: 413.5770028605 ...28606ok 5604 abort/test-process-abort-exitcode28607 ---28608 duration_ms: 413.7150028609 ...28610ok 5605 abort/test-signal-handler28611 ---28612 duration_ms: 414.2790028613 ...28614ok 5606 abort/test-worker-abort-uncaught-exception28615 ---28616 duration_ms: 515.3500028617 ...28618ok 5607 abort/test-zlib-invalid-internals-usage28619 ---28620 duration_ms: 334.5720028621 ...28622ok 5608 sequential/test-async-wrap-getasyncid28623 ---28624 duration_ms: 509.1490028625 ...28626ok 5609 sequential/test-buffer-creation-regression28627 ---28628 duration_ms: 135.5780028629 ...28630ok 5610 sequential/test-child-process-emfile28631 ---28632 duration_ms: 327.4790028633 ...28634ok 5611 sequential/test-child-process-execsync28635 ---28636 duration_ms: 909.2820028637 ...28638ok 5612 sequential/test-child-process-exit28639 ---28640 duration_ms: 808.8840028641 ...28642ok 5613 sequential/test-child-process-pass-fd28643 ---28644 duration_ms: 709.2330028645 ...28646ok 5614 sequential/test-cli-syntax-bad28647 ---28648 duration_ms: 908.9360028649 ...28650ok 5615 sequential/test-cli-syntax-file-not-found28651 ---28652 duration_ms: 262.5510028653 ...28654ok 5616 sequential/test-cli-syntax-good28655 ---28656 duration_ms: 262.4920028657 ...28658ok 5617 sequential/test-cli-syntax-require28659 ---28660 duration_ms: 508.4200028661 ...28662ok 5618 sequential/test-cluster-inspect-brk28663 ---28664 duration_ms: 210.3800028665 ...28666ok 5619 sequential/test-cluster-net-listen-ipv6only-none28667 ---28668 duration_ms: 262.7320028669 ...28670ok 5620 sequential/test-cluster-net-listen-ipv6only-rr28671 ---28672 duration_ms: 327.5960028673 ...28674ok 5621 sequential/test-cluster-port-reuse-between-workers28675 ---28676 duration_ms: 407.8320028677 ...28678ok 5622 sequential/test-cluster-send-handle-large-payload28679 ---28680 duration_ms: 262.7310028681 ...28682ok 5623 sequential/test-cpu-prof-default28683 ---28684 duration_ms: 1509.4940028685 ...28686ok 5624 sequential/test-cpu-prof-dir-absolute28687 ---28688 duration_ms: 1409.4600028689 ...28690ok 5625 sequential/test-cpu-prof-dir-and-name28691 ---28692 duration_ms: 1109.2400028693 ...28694ok 5626 sequential/test-cpu-prof-dir-relative28695 ---28696 duration_ms: 1409.7960028697 ...28698ok 5627 sequential/test-cpu-prof-drained28699 ---28700 duration_ms: 1108.5030028701 ...28702ok 5628 sequential/test-cpu-prof-exit28703 ---28704 duration_ms: 407.6300028705 ...28706ok 5629 sequential/test-cpu-prof-invalid-options28707 ---28708 duration_ms: 326.5300028709 ...28710ok 5630 sequential/test-cpu-prof-kill28711 ---28712 duration_ms: 327.4570028713 ...28714ok 5631 sequential/test-cpu-prof-name28715 ---28716 duration_ms: 2310.5840028717 ...28718ok 5632 sequential/test-cpu-prof-worker-argv28719 ---28720 duration_ms: 1308.5300028721 ...28722ok 5633 sequential/test-crypto-timing-safe-equal28723 ---28724 duration_ms: 135.9630028725 ...28726ok 5634 sequential/test-crypto-timing-safe-equal-fast28727 ---28728 duration_ms: 210.6350028729 ...28730ok 5635 sequential/test-debug-prompt28731 ---28732 duration_ms: 708.1750028733 ...28734ok 5636 sequential/test-debugger-custom-port28735 ---28736 duration_ms: 808.2250028737 ...28738ok 5637 sequential/test-debugger-debug-brk28739 ---28740 duration_ms: 209.7700028741 ...28742ok 5638 sequential/test-debugger-invalid-args28743 ---28744 duration_ms: 5414.8120028745 ...28746ok 5639 sequential/test-debugger-launch28747 ---28748 duration_ms: 808.9290028749 ...28750ok 5640 sequential/test-debugger-pid28751 ---28752 duration_ms: 508.4470028753 ...28754ok 5641 sequential/test-deprecation-flags28755 ---28756 duration_ms: 261.9100028757 ...28758ok 5642 sequential/test-dgram-bind-shared-ports28759 ---28760 duration_ms: 408.4110028761 ...28762ok 5643 sequential/test-dgram-implicit-bind-failure28763 ---28764 duration_ms: 135.9090028765 ...28766ok 5644 sequential/test-dgram-pingpong28767 ---28768 duration_ms: 169.1200028769 ...28770ok 5645 sequential/test-diagnostic-dir-cpu-prof28771 ---28772 duration_ms: 2811.2240028773 ...28774ok 5646 sequential/test-diagnostic-dir-heap-prof28775 ---28776 duration_ms: 1609.9330028777 ...28778ok 5647 sequential/test-dtls-interop-openssl-client # skip DTLS is not enabled28779 ---28780 duration_ms: 136.0190028781 ...28782ok 5648 sequential/test-dtls-interop-openssl-server # skip DTLS is not enabled28783 ---28784 duration_ms: 168.9150028785 ...28786ok 5649 sequential/test-error-serdes28787 ---28788 duration_ms: 169.0010028789 ...28790ok 5650 sequential/test-fs-opendir-recursive28791 ---28792 duration_ms: 262.5030028793 ...28794ok 5651 sequential/test-fs-readdir-recursive28795 ---28796 duration_ms: 168.9100028797 ...28798ok 5652 sequential/test-fs-stat-sync-overflow28799 ---28800 duration_ms: 262.3720028801 ...28802ok 5653 sequential/test-gc-http-client28803 ---28804 duration_ms: 1209.5090028805 ...28806ok 5654 sequential/test-gc-http-client-onerror28807 ---28808 duration_ms: 1209.7300028809 ...28810ok 5655 sequential/test-gc-http-client-timeout28811 ---28812 duration_ms: 507.6660028813 ...28814ok 5656 sequential/test-get-heapsnapshot-options28815 ---28816 duration_ms: 2009.8400028817 ...28818ok 5657 sequential/test-heapdump28819 ---28820 duration_ms: 808.7580028821 ...28822ok 5658 sequential/test-heapdump-flag28823 ---28824 duration_ms: 708.8210028825 ...28826ok 5659 sequential/test-heapdump-flag-custom-dir28827 ---28828 duration_ms: 708.7980028829 ...28830ok 5660 sequential/test-http-econnrefused28831 ---28832 duration_ms: 136.2990028833 ...28834ok 5661 sequential/test-http-keep-alive-large-write28835 ---28836 duration_ms: 210.1250028837 ...28838ok 5662 sequential/test-http-keepalive-maxsockets28839 ---28840 duration_ms: 408.7060028841 ...28842ok 5663 sequential/test-http-regr-gh-292828843 ---28844 duration_ms: 135.4090028845 ...28846ok 5664 sequential/test-http-server-keep-alive-timeout-slow-client-headers28847 ---28848 duration_ms: 1910.7290028849 ...28850ok 5665 sequential/test-http-server-keep-alive-timeout-slow-server28851 ---28852 duration_ms: 708.6200028853 ...28854ok 5666 sequential/test-http2-max-session-memory28855 ---28856 duration_ms: 136.3250028857 ...28858ok 5667 sequential/test-http2-ping-flood28859 ---28860 duration_ms: 210.7820028861 ...28862ok 5668 sequential/test-http2-settings-flood28863 ---28864 duration_ms: 136.0980028865 ...28866ok 5669 sequential/test-http2-timeout-large-write28867 ---28868 duration_ms: 2911.9370028869 ...28870ok 5670 sequential/test-http2-timeout-large-write-file28871 ---28872 duration_ms: 2912.2240028873 ...28874ok 5671 sequential/test-https-connect-localport28875 ---28876 duration_ms: 6316.8370028877 ...28878ok 5672 sequential/test-https-server-keep-alive-timeout28879 ---28880 duration_ms: 1910.3300028881 ...28882ok 5673 sequential/test-init28883 ---28884 duration_ms: 327.6880028885 ...28886ok 5674 sequential/test-inspector-network-resource28887 ---28888 duration_ms: 1809.8750028889 ...28890ok 5675 sequential/test-inspector-open-dispose28891 ---28892 duration_ms: 327.2220028893 ...28894ok 5676 sequential/test-inspector-port-cluster28895 ---28896 duration_ms: 608.3020028897 ...28898ok 5677 sequential/test-module-loading28899 ---28900 duration_ms: 169.5200028901 ...28902ok 5678 sequential/test-net-GH-550428903 ---28904 duration_ms: 507.9100028905 ...28906ok 5679 sequential/test-net-better-error-messages-port28907 ---28908 duration_ms: 169.1130028909 ...28910ok 5680 sequential/test-net-connect-econnrefused28911 ---28912 duration_ms: 262.5830028913 ...28914ok 5681 sequential/test-net-connect-handle-econnrefused28915 ---28916 duration_ms: 169.2400028917 ...28918ok 5682 sequential/test-net-connect-local-error28919 ---28920 duration_ms: 168.5480028921 ...28922ok 5683 sequential/test-net-listen-ipv6only28923 ---28924 duration_ms: 168.6000028925 ...28926ok 5684 sequential/test-net-listen-shared-ports28927 ---28928 duration_ms: 508.5300028929 ...28930ok 5685 sequential/test-net-localport28931 ---28932 duration_ms: 168.7860028933 ...28934ok 5686 sequential/test-net-reconnect-error28935 ---28936 duration_ms: 169.3860028937 ...28938ok 5687 sequential/test-net-response-size28939 ---28940 duration_ms: 1409.8050028941 ...28942ok 5688 sequential/test-net-server-address28943 ---28944 duration_ms: 168.7250028945 ...28946ok 5689 sequential/test-net-server-bind28947 ---28948 duration_ms: 326.9880028949 ...28950ok 5690 sequential/test-net-server-listen-ipv6-link-local28951 ---28952 duration_ms: 169.1870028953 ...28954ok 5691 sequential/test-next-tick-error-spin28955 ---28956 duration_ms: 326.6680028957 ...28958ok 5692 sequential/test-perf-hooks28959 ---28960 duration_ms: 1309.9530028961 ...28962ok 5693 sequential/test-performance-eventloopdelay28963 ---28964 duration_ms: 7319.8140028965 ...28966ok 5694 sequential/test-pipe28967 ---28968 duration_ms: 4414.7570028969 ...28970ok 5695 sequential/test-process-title28971 ---28972 duration_ms: 211.0520028973 ...28974ok 5696 sequential/test-process-warnings28975 ---28976 duration_ms: 264.1690028977 ...28978ok 5697 sequential/test-repl-timeout-throw28979 ---28980 duration_ms: 327.1740028981 ...28982ok 5698 sequential/test-require-cache-without-stat28983 ---28984 duration_ms: 109.4920028985 ...28986ok 5699 sequential/test-resolution-inspect-brk28987 ---28988 duration_ms: 168.1920028989 ...28990ok 5700 sequential/test-stream2-fs28991 ---28992 duration_ms: 109.0470028993 ...28994ok 5701 sequential/test-stream2-stderr-sync28995 ---28996 duration_ms: 262.1960028997 ...28998ok 5702 sequential/test-timers-block-eventloop28999 ---29000 duration_ms: 168.6910029001 ...29002ok 5703 sequential/test-timers-set-interval-excludes-callback-duration29003 ---29004 duration_ms: 508.1600029005 ...29006ok 5704 sequential/test-tls-connect29007 ---29008 duration_ms: 135.5560029009 ...29010ok 5705 sequential/test-tls-lookup29011 ---29012 duration_ms: 135.5320029013 ...29014ok 5706 sequential/test-tls-psk-client # skip missing openssl cli29015 ---29016 duration_ms: 108.7620029017 ...29018ok 5707 sequential/test-tls-session-timeout # skip node compiled without OpenSSL CLI.29019 ---29020 duration_ms: 135.5640029021 ...29022ok 5708 sequential/test-util-debug29023 ---29024 duration_ms: 607.6080029025 ...29026ok 5709 sequential/test-vm-break-on-sigint29027 ---29028 duration_ms: 209.7510029029 ...29030ok 5710 sequential/test-vm-timeout-escape-promise-module-229031 ---29032 duration_ms: 135.5150029033 ...29034ok 5711 sequential/test-vm-timeout-rethrow29035 ---29036 duration_ms: 210.5610029037 ...29038ok 5712 sequential/test-watch-mode-restart-esm-loading-error29039 ---29040 duration_ms: 2409.6410029041 ...29042ok 5713 sequential/test-watch-mode-watch-flags29043 ---29044 duration_ms: 407.6110029045 ...29046ok 5714 sequential/test-watch-mode-worker29047 ---29048 duration_ms: 2711.1420029049 ...29050ok 5715 sequential/test-without-async-context-frame29051 ---29052 duration_ms: 1409.3650029053 ...29054ok 5716 sequential/test-worker-eventlooputil29055 ---29056 duration_ms: 327.8180029057 ...29058ok 5717 sequential/test-worker-fshandles-error-on-termination29059 ---29060 duration_ms: 327.3990029061 ...29062ok 5718 sequential/test-worker-fshandles-open-close-on-termination29063 ---29064 duration_ms: 408.1380029065 ...29066ok 5719 sequential/test-worker-heapsnapshot-options29067 ---29068 duration_ms: 808.8600029069 ...29070ok 5720 sequential/test-worker-prof29071 ---29072 duration_ms: 1909.2940029073 ...29074ok 5721 sequential/test-write-heapsnapshot-options29075 ---29076 duration_ms: 1709.7910029077 ...29078ok 5722 sequential/test-zlib-crc32-fast-api29079 ---29080 duration_ms: 135.4980029081 ...29082ok 5723 wpt/test-abort29083 ---29084 duration_ms: 2311.3380029085 ...29086ok 5724 wpt/test-atob29087 ---29088 duration_ms: 261.8590029089 ...29090ok 5725 wpt/test-blob29091 ---29092 duration_ms: 326.8170029093 ...29094ok 5726 wpt/test-broadcastchannel29095 ---29096 duration_ms: 261.9840029097 ...29098ok 5727 wpt/test-compression29099 ---29100 duration_ms: 1009.1170029101 ...29102ok 5728 wpt/test-console29103 ---29104 duration_ms: 326.7980029105 ...29106ok 5729 wpt/test-encoding29107 ---29108 duration_ms: 612.8200029109 ...29110ok 5730 wpt/test-events29111 ---29112 duration_ms: 326.3970029113 ...29114ok 5731 wpt/test-file29115 ---29116 duration_ms: 261.9460029117 ...29118ok 5732 wpt/test-hr-time29119 ---29120 duration_ms: 2310.5570029121 ...29122ok 5733 wpt/test-microtask-queuing29123 ---29124 duration_ms: 262.5130029125 ...29126ok 5734 wpt/test-performance-timeline29127 ---29128 duration_ms: 2410.6140029129 ...29130ok 5735 wpt/test-resource-timing29131 ---29132 duration_ms: 507.8720029133 ...29134ok 5736 wpt/test-streams29135 ---29136 duration_ms: 2712.3180029137 ...29138ok 5737 wpt/test-structured-clone29139 ---29140 duration_ms: 210.3700029141 ...29142ok 5738 wpt/test-timers29143 ---29144 duration_ms: 1008.1370029145 ...29146ok 5739 wpt/test-url # skip Different versions of Ada affect the WPT tests29147 ---29148 duration_ms: 87.8050029149 ...29150ok 5740 wpt/test-urlpattern29151 ---29152 duration_ms: 263.3800029153 ...29154ok 5741 wpt/test-wasm-jsapi29155 ---29156 duration_ms: 1008.3260029157 ...29158ok 5742 wpt/test-wasm-webapi29159 ---29160 duration_ms: 262.1500029161 ...29162ok 5743 wpt/test-web-locks29163 ---29164 duration_ms: 2111.0440029165 ...29166ok 5744 wpt/test-webcrypto29167 ---29168 duration_ms: 6367.8760029169 ...29170ok 5745 wpt/test-webidl29171 ---29172 duration_ms: 409.4510029173 ...29174ok 5746 wpt/test-webstorage29175 ---29176 duration_ms: 1909.6640029177 ...29178ok 5747 wpt/test-workers29179 ---29180 duration_ms: 808.0900029181 ...29182ok 5748 wasm-allocation/test-wasm-allocation29183 ---29184 duration_ms: 114.6520029185 ...29186ok 5749 wasm-allocation/test-wasm-allocation-auto-adapt29187 ---29188 duration_ms: 95.2360029189 ...29190ok 5750 wasm-allocation/test-wasm-allocation-disable-trap-handler29191 ---29192 duration_ms: 95.4110029193 ...29194ok 5751 wasm-allocation/test-wasm-allocation-memory6429195 ---29196 duration_ms: 114.4530029197 ...29198ok 5752 known_issues/test-cli-print-var-crypto29199 ---29200 duration_ms: 211.0720029201 ...29202ok 5753 known_issues/test-cwd-enoent-file29203 ---29204 duration_ms: 169.2350029205 ...29206ok 5754 known_issues/test-dgram-bind-shared-ports-after-port-029207 ---29208 duration_ms: 327.5090029209 ...29210ok 5755 known_issues/test-fs-cp-async-buffer29211 ---29212 duration_ms: 109.4510029213 ...29214ok 5756 known_issues/test-fs-cp-filter29215 ---29216 duration_ms: 109.4850029217 ...29218ok 5757 known_issues/test-fs-cp-non-utf829219 ---29220 duration_ms: 109.3680029221 ...29222ok 5758 known_issues/test-fs-writeFileSync-invalid-windows29223 ---29224 duration_ms: 88.1030029225 ...29226ok 5759 known_issues/test-http-clientrequest-end-contentlength29227 ---29228 duration_ms: 135.4370029229 ...29230ok 5760 known_issues/test-http-clientrequest-end-empty-response-body29231 ---29232 duration_ms: 108.8470029233 ...29234ok 5761 known_issues/test-http-clientrequest-write-chunked29235 ---29236 duration_ms: 109.5900029237 ...29238ok 5762 known_issues/test-http-path-contains-unicode29239 ---29240 duration_ms: 108.9070029241 ...29242ok 5763 known_issues/test-inspector-cluster-port-clash29243 ---29244 duration_ms: 210.4950029245 ...29246ok 5764 known_issues/test-inspector-instrumentation-breakpoint29247 ---29248 duration_ms: 15329.5900029249 ...29250ok 5765 known_issues/test-repl-require-context29251 ---29252 duration_ms: 211.3390029253 ...29254ok 5766 known_issues/test-stdin-is-always-net.socket29255 ---29256 duration_ms: 327.7940029257 ...29258ok 5767 known_issues/test-stream-writable-sync-error29259 ---29260 duration_ms: 136.4740029261 ...29262ok 5768 known_issues/test-url-parse-conformance29263 ---29264 duration_ms: 210.8670029265 ...29266ok 5769 known_issues/test-vm-function-declaration-uses-define29267 ---29268 duration_ms: 136.0010029269 ...29270ok 5770 known_issues/test-vm-timeout-escape-nexttick29271 ---29272 duration_ms: 909.0580029273 ...2927429275Failed tests:29276out/Release/node /build/node-v26.9.0/test/parallel/test-fs-cp-async-file-modes.mjs29277make: *** [Makefile:631: test-ci-js] Error 1