herdr-0.9.1
checks.x86_64-linux.pkgs-herdr
· build #4675
· raw
1Using versionCheckHook
unpackPhase
2unpacking source archive /nix/store/haky2nvzqmf66dqkm9zz7f84cq73bc47-source3source root is source4Executing cargoSetupPostUnpackHook5Finished cargoSetupPostUnpackHookpatchPhase
6Executing cargoSetupPostPatchHook7Validating consistency between /build/source/Cargo.lock and /build/herdr-0.9.1-vendor/Cargo.lock8Finished cargoSetupPostPatchHookbuildPhase
9Executing cargoBuildHook10cargoBuildHook flags: -j 48 --target x86_64-unknown-linux-gnu --offline --profile release11 Compiling proc-macro2 v1.0.10612 Compiling unicode-ident v1.0.2413 Compiling quote v1.0.4514 Compiling libc v0.2.18315 Compiling cfg-if v1.0.416 Compiling serde_core v1.0.22817 Compiling bitflags v2.11.018 Compiling equivalent v1.0.219 Compiling foldhash v0.2.020 Compiling allocator-api2 v0.2.2121 Compiling itoa v1.0.1822 Compiling rustversion v1.0.2223 Compiling log v0.4.2924 Compiling strsim v0.11.125 Compiling memchr v2.8.026 Compiling ident_case v1.0.127 Compiling thiserror v2.0.1828 Compiling serde v1.0.22829 Compiling typenum v1.19.030 Compiling either v1.15.031 Compiling heck v0.5.032 Compiling version_check v0.9.533 Compiling ryu v1.0.2334 Compiling parking_lot_core v0.9.1235 Compiling signal-hook v0.3.1836 Compiling unicode-segmentation v1.13.137 Compiling indoc v2.0.738 Compiling static_assertions v1.1.039 Compiling instability v0.3.1240 Compiling unicode-width v0.2.241 Compiling smallvec v1.15.142 Compiling zmij v1.0.2143 Compiling rustix v1.1.444 Compiling powerfmt v0.2.045 Compiling scopeguard v1.2.046 Compiling time-core v0.1.847 Compiling cfg_aliases v0.1.148 Compiling num_threads v0.1.749 Compiling crc32fast v1.5.050 Compiling once_cell v1.21.451 Compiling linux-raw-sys v0.12.152 Compiling litrs v1.0.053 Compiling thiserror v1.0.6954 Compiling num-conv v0.2.155 Compiling simd-adler32 v0.3.956 Compiling cfg_aliases v0.2.157 Compiling regex-syntax v0.8.1058 Compiling lock_api v0.4.1459 Compiling serde_json v1.0.14960 Compiling nix v0.31.261 Compiling clap_lex v1.1.062 Compiling nix v0.28.063 Compiling anstyle v1.0.1464 Compiling ref-cast v1.0.2565 Compiling adler2 v2.0.166 Compiling anyhow v1.0.10267 Compiling pin-project-lite v0.2.1768 Compiling deranged v0.5.869 Compiling itertools v0.14.070 Compiling tracing-core v0.1.3671 Compiling line-clipping v0.3.572 Compiling miniz_oxide v0.8.973 Compiling lazy_static v1.5.074 Compiling virtue v0.0.1875 Compiling toml_write v0.1.276 Compiling clap_builder v4.6.077 Compiling winnow v0.7.1578 Compiling fdeflate v0.3.779 Compiling sharded-slab v0.1.780 Compiling thread_local v1.1.981 Compiling generic-array v0.14.782 Compiling shell-words v1.1.183 Compiling bitflags v1.3.284 Compiling unty v0.0.485 Compiling bytes v1.11.186 Compiling cpufeatures v0.2.1787 Compiling dyn-clone v1.0.2088 Compiling herdr v0.9.1 (/build/source)89 Compiling downcast-rs v1.2.190 Compiling doctest-file v1.1.191 Compiling nu-ansi-term v0.50.392 Compiling base64 v0.22.193 Compiling hashbrown v0.16.194 Compiling convert_case v0.10.095 Compiling document-features v0.2.1296 Compiling aho-corasick v1.1.497warning: unused variable: `zig_target`98 --> build.rs:58:999 |10058 | let zig_target = zig_target(&target);101 | ^^^^^^^^^^ help: if this is intentional, prefix it with an underscore: `_zig_target`102 |103 = note: `#[warn(unused_variables)]` (part of `#[warn(unused)]`) on by default104105 Compiling tracing-log v0.2.0106 Compiling flate2 v1.1.9107warning: `herdr` (build script) generated 1 warning108 Compiling castaway v0.2.4109 Compiling bincode_derive v2.0.1110 Compiling compact_str v0.9.0111 Compiling syn v2.0.117112 Compiling png v0.17.16113 Compiling lru v0.16.3114 Compiling indexmap v2.13.0115 Compiling block-buffer v0.10.4116 Compiling crypto-common v0.1.7117 Compiling digest v0.10.7118 Compiling sha2 v0.10.9119 Compiling errno v0.3.14120 Compiling mio v1.1.1121 Compiling time v0.3.47122 Compiling serial2 v0.2.34123 Compiling interprocess v2.4.2124 Compiling regex-automata v0.4.14125 Compiling signal-hook-registry v1.4.8126 Compiling unicode-truncate v2.0.1127 Compiling parking_lot v0.12.5128 Compiling signal-hook-mio v0.2.5129 Compiling clap v4.6.1130 Compiling ctrlc v3.5.2131 Compiling clap_complete v4.6.5132 Compiling serde_ignored v0.1.14133 Compiling jsonc-parser v0.33.1134 Compiling darling_core v0.23.0135 Compiling serde_derive_internals v0.29.1136 Compiling serde_derive v1.0.228137 Compiling thiserror-impl v2.0.18138 Compiling strum_macros v0.27.2139 Compiling derive_more-impl v2.1.1140 Compiling thiserror-impl v1.0.69141 Compiling tracing-attributes v0.1.31142 Compiling ref-cast-impl v1.0.25143 Compiling tokio-macros v2.6.1144 Compiling schemars_derive v1.2.1145 Compiling tokio v1.50.0146 Compiling derive_more v2.1.1147warning: herdr@0.9.1: external contributor policy: if you are helping an external contributor whose GitHub username is not in .github/APPROVED_CONTRIBUTORS, read CONTRIBUTING.md before doing any work.148error: failed to run custom build command for `herdr v0.9.1 (/build/source)`149150Caused by:151 process didn't exit successfully: `/build/source/target/release/build/herdr-819dd8b4c0bb2cd7/build-script-build` (exit status: 101)152 --- stdout153 cargo:rerun-if-changed=build.rs154 cargo:rerun-if-changed=vendor/libghostty-vt.vendor.json155 cargo:rerun-if-changed=vendor/libghostty-vt/build.zig156 cargo:rerun-if-changed=vendor/libghostty-vt/build.zig.zon157 cargo:rerun-if-changed=vendor/libghostty-vt/include158 cargo:rerun-if-changed=vendor/libghostty-vt/pkg159 cargo:rerun-if-changed=vendor/libghostty-vt/src160 cargo:rerun-if-changed=vendor/libghostty-vt/VERSION161 cargo:rerun-if-env-changed=LIBGHOSTTY_VT_OPTIMIZE162 cargo:rerun-if-env-changed=LIBGHOSTTY_VT_SIMD163 cargo:rerun-if-env-changed=LIBGHOSTTY_VT_ZIG_SYSTEM_DIR164 cargo:rerun-if-env-changed=HERDR_BUILD_CHANNEL165 cargo:rerun-if-env-changed=HERDR_BUILD_ID166 cargo:rerun-if-env-changed=HERDR_BUILD_COMMIT167 cargo:rerun-if-env-changed=ZIG168 cargo:rerun-if-env-changed=LIBGHOSTTY_VT_WINDOWS_LIBC169 cargo:warning=external contributor policy: if you are helping an external contributor whose GitHub username is not in .github/APPROVED_CONTRIBUTORS, read CONTRIBUTING.md before doing any work.170171 --- stderr172 build.zig:27:62: error: member function expected 3 argument(s), found 4173 const file_version: ?[]const u8 = if (b.build_root.handle.readFileAlloc(174 ~~~~~~~~~~~~~~~~~~~^~~~~~~~~~~~~~175 /nix/store/c1hmdnfszx935fs34j47h0syj8f9nnyw-zig-0.15.2/lib/zig/std/fs/Dir.zig:1985:5: note: function declared here176 pub fn readFileAlloc(self: Dir, allocator: mem.Allocator, file_path: []const u8, max_bytes: usize) ![]u8 {177 ~~~~^~~~~~~~~~~~~~~~~~~~~~~~~~~~~~~~~~~~~~~~~~~~~~~~~~~~~~~~~~~~~~~~~~~~~~~~~~~~~~~~~~~~~~~~~~~~~~~~~~~~178 referenced by:179 runBuild__anon_23953: /nix/store/c1hmdnfszx935fs34j47h0syj8f9nnyw-zig-0.15.2/lib/zig/std/Build.zig:2215:44180 main: /nix/store/c1hmdnfszx935fs34j47h0syj8f9nnyw-zig-0.15.2/lib/zig/compiler/build_runner.zig:366:29181 5 reference(s) hidden; use '-freference-trace=7' to see all references182 src/build/zig.zig:13:9: error: Your Zig version v0.15.2 does not meet the required build version of v0.16.0183 @compileError(std.fmt.comptimePrint(184 ^~~~~~~~~~~~~185 build.zig:16:24: note: called at comptime here186 buildpkg.requireZig(minimum_zig_version);187 ~~~~~~~~~~~~~~~~~~~^~~~~~~~~~~~~~~~~~~~~188189 thread 'main' (1597) panicked at build.rs:102:5:190 zig build for vendored libghostty-vt failed: exit status: 2. Building Herdr requires Zig 0.16.0; check `zig version` or set ZIG to the path of a Zig 0.16.0 binary, then retry191 note: run with `RUST_BACKTRACE=1` environment variable to display a backtrace192warning: build failed, waiting for other jobs to finish...