herdr-0.9.1
checks.aarch64-linux.pkgs-herdr
· build #4675
· raw
1bld3: building 6rlq1mrvzq2k9kjccvwcz9araqlrr87c-herdr-0.9.1.drv2Using versionCheckHook
unpackPhase
3unpacking source archive /nix/store/haky2nvzqmf66dqkm9zz7f84cq73bc47-source4source root is source5Executing cargoSetupPostUnpackHook6Finished cargoSetupPostUnpackHookpatchPhase
7Executing cargoSetupPostPatchHook8Validating consistency between /build/source/Cargo.lock and /build/herdr-0.9.1-vendor/Cargo.lock9Finished cargoSetupPostPatchHookbuildPhase
10Executing cargoBuildHook11cargoBuildHook flags: -j 8 --target aarch64-unknown-linux-gnu --offline --profile release12 Compiling proc-macro2 v1.0.10613 Compiling unicode-ident v1.0.2414 Compiling quote v1.0.4515 Compiling libc v0.2.18316 Compiling cfg-if v1.0.417 Compiling serde_core v1.0.22818 Compiling bitflags v2.11.019 Compiling equivalent v1.0.220 Compiling foldhash v0.2.021 Compiling allocator-api2 v0.2.2122 Compiling itoa v1.0.1823 Compiling log v0.4.2924 Compiling rustversion v1.0.2225 Compiling ident_case v1.0.126 Compiling thiserror v2.0.1827 Compiling strsim v0.11.128 Compiling hashbrown v0.16.129 Compiling memchr v2.8.030 Compiling serde v1.0.22831 Compiling heck v0.5.032 Compiling version_check v0.9.533 Compiling typenum v1.19.034 Compiling either v1.15.035 Compiling generic-array v0.14.736 Compiling castaway v0.2.437 Compiling parking_lot_core v0.9.1238 Compiling syn v2.0.11739 Compiling smallvec v1.15.140 Compiling itertools v0.14.041 Compiling ryu v1.0.2342 Compiling unicode-width v0.2.243 Compiling signal-hook v0.3.1844 Compiling indoc v2.0.745 Compiling instability v0.3.1246 Compiling static_assertions v1.1.047 Compiling unicode-segmentation v1.13.148 Compiling compact_str v0.9.049 Compiling lru v0.16.350 Compiling convert_case v0.10.051 Compiling errno v0.3.1452 Compiling mio v1.1.153 Compiling signal-hook-registry v1.4.854 Compiling powerfmt v0.2.055 Compiling scopeguard v1.2.056 Compiling rustix v1.1.457 Compiling zmij v1.0.2158 Compiling lock_api v0.4.1459 Compiling deranged v0.5.860 Compiling aho-corasick v1.1.461 Compiling num-conv v0.2.162 Compiling unicode-truncate v2.0.163 Compiling once_cell v1.21.464 Compiling linux-raw-sys v0.12.165 Compiling cfg_aliases v0.1.166 Compiling crc32fast v1.5.067 Compiling simd-adler32 v0.3.968 Compiling serde_json v1.0.14969 Compiling litrs v1.0.070 Compiling cfg_aliases v0.2.171 Compiling regex-syntax v0.8.1072 Compiling time-core v0.1.873 Compiling thiserror v1.0.6974 Compiling num_threads v0.1.775 Compiling nix v0.31.276 Compiling tracing-core v0.1.3677 Compiling document-features v0.2.1278 Compiling nix v0.28.079 Compiling time v0.3.4780 Compiling parking_lot v0.12.581 Compiling signal-hook-mio v0.2.582 Compiling darling_core v0.23.083 Compiling line-clipping v0.3.584 Compiling clap_lex v1.1.085 Compiling anyhow v1.0.10286 Compiling ref-cast v1.0.2587 Compiling anstyle v1.0.1488 Compiling pin-project-lite v0.2.1789 Compiling adler2 v2.0.190 Compiling clap_builder v4.6.091 Compiling regex-automata v0.4.1492 Compiling miniz_oxide v0.8.993 Compiling serde_derive v1.0.22894 Compiling thiserror-impl v2.0.1895 Compiling darling_macro v0.23.096 Compiling strum_macros v0.27.297 Compiling darling v0.23.098 Compiling kasuari v0.4.1299 Compiling derive_more-impl v2.1.1100 Compiling thiserror-impl v1.0.69101 Compiling derive_more v2.1.1102 Compiling crossterm v0.29.0103 Compiling strum v0.27.2104 Compiling ratatui-core v0.1.0105 Compiling tracing-attributes v0.1.31106 Compiling toml_datetime v0.6.11107 Compiling serde_spanned v0.6.9108 Compiling ref-cast-impl v1.0.25109 Compiling serde_derive_internals v0.29.1110 Compiling ratatui-widgets v0.3.0111 Compiling crypto-common v0.1.7112 Compiling block-buffer v0.10.4113 Compiling indexmap v2.13.0114 Compiling winnow v0.7.15115 Compiling virtue v0.0.18116 Compiling lazy_static v1.5.0117 Compiling toml_write v0.1.2118 Compiling sharded-slab v0.1.7119 Compiling bincode_derive v2.0.1120 Compiling ratatui-macros v0.7.0121 Compiling digest v0.10.7122 Compiling schemars_derive v1.2.1123 Compiling flate2 v1.1.9124 Compiling toml_edit v0.22.27125 Compiling tracing v0.1.44126 Compiling ratatui-crossterm v0.1.0127 Compiling filedescriptor v0.8.3128 Compiling matchers v0.2.0129 Compiling clap v4.6.1130 Compiling tokio-macros v2.6.1131 Compiling tracing-log v0.2.0132 Compiling fdeflate v0.3.7133 Compiling cpufeatures v0.2.17134 Compiling serial2 v0.2.34135 Compiling thread_local v1.1.9136 Compiling shell-words v1.1.1137 Compiling herdr v0.9.1 (/build/source)138 Compiling downcast-rs v1.2.1139 Compiling nu-ansi-term v0.50.3140 Compiling unty v0.0.4141 Compiling bytes v1.11.1142warning: unused variable: `zig_target`143 --> build.rs:58:9144 |14558 | let zig_target = zig_target(&target);146 | ^^^^^^^^^^ help: if this is intentional, prefix it with an underscore: `_zig_target`147 |148 = note: `#[warn(unused_variables)]` (part of `#[warn(unused)]`) on by default149150 Compiling doctest-file v1.1.1151warning: `herdr` (build script) generated 1 warning152 Compiling bitflags v1.3.2153 Compiling dyn-clone v1.0.20154 Compiling schemars v1.2.1155 Compiling png v0.17.16156 Compiling interprocess v2.4.2157 Compiling tokio v1.50.0158 Compiling tracing-subscriber v0.3.23159 Compiling toml v0.8.23160 Compiling bincode v2.0.1161 Compiling portable-pty v0.9.0 (/build/source/vendor/portable-pty)162warning: herdr@0.9.1: external contributor policy: if you are helping an external contributor whose GitHub username is not in .github/APPROVED_CONTRIBUTORS, read CONTRIBUTING.md before doing any work.163error: failed to run custom build command for `herdr v0.9.1 (/build/source)`164165Caused by:166 process didn't exit successfully: `/build/source/target/release/build/herdr-034112b388ae78e1/build-script-build` (exit status: 101)167 --- stdout168 cargo:rerun-if-changed=build.rs169 cargo:rerun-if-changed=vendor/libghostty-vt.vendor.json170 cargo:rerun-if-changed=vendor/libghostty-vt/build.zig171 cargo:rerun-if-changed=vendor/libghostty-vt/build.zig.zon172 cargo:rerun-if-changed=vendor/libghostty-vt/include173 cargo:rerun-if-changed=vendor/libghostty-vt/pkg174 cargo:rerun-if-changed=vendor/libghostty-vt/src175 cargo:rerun-if-changed=vendor/libghostty-vt/VERSION176 cargo:rerun-if-env-changed=LIBGHOSTTY_VT_OPTIMIZE177 cargo:rerun-if-env-changed=LIBGHOSTTY_VT_SIMD178 cargo:rerun-if-env-changed=LIBGHOSTTY_VT_ZIG_SYSTEM_DIR179 cargo:rerun-if-env-changed=HERDR_BUILD_CHANNEL180 cargo:rerun-if-env-changed=HERDR_BUILD_ID181 cargo:rerun-if-env-changed=HERDR_BUILD_COMMIT182 cargo:rerun-if-env-changed=ZIG183 cargo:rerun-if-env-changed=LIBGHOSTTY_VT_WINDOWS_LIBC184 cargo:warning=external contributor policy: if you are helping an external contributor whose GitHub username is not in .github/APPROVED_CONTRIBUTORS, read CONTRIBUTING.md before doing any work.185186 --- stderr187 build.zig:27:62: error: member function expected 3 argument(s), found 4188 const file_version: ?[]const u8 = if (b.build_root.handle.readFileAlloc(189 ~~~~~~~~~~~~~~~~~~~^~~~~~~~~~~~~~190 /nix/store/ziwpdq2r7n0wzmf731nfa44wl4x13358-zig-0.15.2/lib/zig/std/fs/Dir.zig:1985:5: note: function declared here191 pub fn readFileAlloc(self: Dir, allocator: mem.Allocator, file_path: []const u8, max_bytes: usize) ![]u8 {192 ~~~~^~~~~~~~~~~~~~~~~~~~~~~~~~~~~~~~~~~~~~~~~~~~~~~~~~~~~~~~~~~~~~~~~~~~~~~~~~~~~~~~~~~~~~~~~~~~~~~~~~~~193 referenced by:194 runBuild__anon_23748: /nix/store/ziwpdq2r7n0wzmf731nfa44wl4x13358-zig-0.15.2/lib/zig/std/Build.zig:2215:44195 main: /nix/store/ziwpdq2r7n0wzmf731nfa44wl4x13358-zig-0.15.2/lib/zig/compiler/build_runner.zig:366:29196 5 reference(s) hidden; use '-freference-trace=7' to see all references197 src/build/zig.zig:13:9: error: Your Zig version v0.15.2 does not meet the required build version of v0.16.0198 @compileError(std.fmt.comptimePrint(199 ^~~~~~~~~~~~~200 build.zig:16:24: note: called at comptime here201 buildpkg.requireZig(minimum_zig_version);202 ~~~~~~~~~~~~~~~~~~~^~~~~~~~~~~~~~~~~~~~~203204 thread 'main' (2774) panicked at build.rs:102:5:205 zig build for vendored libghostty-vt failed: exit status: 2. Building Herdr requires Zig 0.16.0; check `zig version` or set ZIG to the path of a Zig 0.16.0 binary, then retry206 note: run with `RUST_BACKTRACE=1` environment variable to display a backtrace207warning: build failed, waiting for other jobs to finish...