nixbot

builds
1Using versionCheckHook
unpackPhase
2unpacking source archive /nix/store/haky2nvzqmf66dqkm9zz7f84cq73bc47-source3source root is source4Executing cargoSetupPostUnpackHook5Finished cargoSetupPostUnpackHook
patchPhase
6Executing cargoSetupPostPatchHook7Validating consistency between /nix/var/nix/builds/nix-64132-1452696665/source/Cargo.lock and /nix/var/nix/builds/nix-64132-1452696665/herdr-0.9.1-vendor/Cargo.lock8Finished cargoSetupPostPatchHook
buildPhase
9Executing cargoBuildHook10cargoBuildHook flags: -j 10 --target aarch64-apple-darwin --offline --profile release11 Compiling proc-macro2 v1.0.10612 Compiling quote v1.0.4513 Compiling unicode-ident v1.0.2414 Compiling libc v0.2.18315 Compiling cfg-if v1.0.416 Compiling bitflags v2.11.017 Compiling serde_core v1.0.22818 Compiling equivalent v1.0.219 Compiling foldhash v0.2.020 Compiling allocator-api2 v0.2.2121 Compiling itoa v1.0.1822 Compiling log v0.4.2923 Compiling rustversion v1.0.2224 Compiling ident_case v1.0.125 Compiling thiserror v2.0.1826 Compiling hashbrown v0.16.127 Compiling memchr v2.8.028 Compiling serde v1.0.22829 Compiling strsim v0.11.130 Compiling typenum v1.19.031 Compiling heck v0.5.032 Compiling either v1.15.033 Compiling version_check v0.9.534 Compiling itertools v0.14.035 Compiling generic-array v0.14.736 Compiling indoc v2.0.737 Compiling errno v0.3.1438 Compiling instability v0.3.1239 Compiling signal-hook-registry v1.4.840 Compiling signal-hook v0.3.1841 Compiling smallvec v1.15.142 Compiling syn v2.0.11743 Compiling unicode-segmentation v1.13.144 Compiling parking_lot_core v0.9.1245 Compiling static_assertions v1.1.046 Compiling unicode-width v0.2.247 Compiling ryu v1.0.2348 Compiling convert_case v0.10.049 Compiling unicode-truncate v2.0.150 Compiling mio v1.1.151 Compiling castaway v0.2.452 Compiling lru v0.16.353 Compiling rustix v1.1.454 Compiling scopeguard v1.2.055 Compiling powerfmt v0.2.056 Compiling objc2 v0.6.457 Compiling zmij v1.0.2158 Compiling deranged v0.5.859 Compiling lock_api v0.4.1460 Compiling num_threads v0.1.761 Compiling aho-corasick v1.1.462 Compiling darling_core v0.23.063 Compiling serde_json v1.0.14964 Compiling num-conv v0.2.165 Compiling once_cell v1.21.466 Compiling crc32fast v1.5.067 Compiling time-core v0.1.868 Compiling objc2-encode v4.1.069 Compiling thiserror v1.0.6970 Compiling compact_str v0.9.071 Compiling regex-syntax v0.8.1072 Compiling litrs v1.0.073 Compiling simd-adler32 v0.3.974 Compiling cfg_aliases v0.1.175 Compiling cfg_aliases v0.2.176 Compiling thiserror-impl v2.0.1877 Compiling serde_derive v1.0.22878 Compiling strum_macros v0.27.279 Compiling derive_more-impl v2.1.180 Compiling document-features v0.2.1281 Compiling nix v0.31.282 Compiling derive_more v2.1.183 Compiling thiserror-impl v1.0.6984 Compiling nix v0.28.085 Compiling darling_macro v0.23.086 Compiling darling v0.23.087 Compiling kasuari v0.4.1288 Compiling regex-automata v0.4.1489 Compiling strum v0.27.290 Compiling time v0.3.4791 Compiling tracing-core v0.1.3692 Compiling ratatui-core v0.1.093 Compiling signal-hook-mio v0.2.594 Compiling parking_lot v0.12.595 Compiling line-clipping v0.3.596 Compiling ref-cast v1.0.2597 Compiling clap_lex v1.1.098 Compiling pin-project-lite v0.2.1799 Compiling anstyle v1.0.14100 Compiling adler2 v2.0.1101 Compiling anyhow v1.0.102102 Compiling clap_builder v4.6.0103 Compiling ratatui-widgets v0.3.0104 Compiling toml_datetime v0.6.11105 Compiling serde_spanned v0.6.9106 Compiling miniz_oxide v0.8.9107 Compiling crossterm v0.29.0108 Compiling block2 v0.6.2109 Compiling ref-cast-impl v1.0.25110 Compiling tracing-attributes v0.1.31111 Compiling block-buffer v0.10.4112 Compiling crypto-common v0.1.7113 Compiling serde_derive_internals v0.29.1114 Compiling indexmap v2.13.0115 Compiling virtue v0.0.18116 Compiling lazy_static v1.5.0117 Compiling toml_write v0.1.2118 Compiling winnow v0.7.15119 Compiling tracing v0.1.44120 Compiling sharded-slab v0.1.7121 Compiling schemars_derive v1.2.1122 Compiling bincode_derive v2.0.1123 Compiling digest v0.10.7124 Compiling clap v4.6.1125 Compiling ratatui-crossterm v0.1.0126 Compiling ratatui-macros v0.7.0127 Compiling filedescriptor v0.8.3128 Compiling dispatch2 v0.3.1129 Compiling matchers v0.2.0130 Compiling toml_edit v0.22.27131 Compiling flate2 v1.1.9132 Compiling tracing-log v0.2.0133 Compiling tokio-macros v2.6.1134 Compiling fdeflate v0.3.7135 Compiling serial2 v0.2.34136 Compiling cpufeatures v0.2.17137 Compiling thread_local v1.1.9138 Compiling shell-words v1.1.1139 Compiling downcast-rs v1.2.1140 Compiling herdr v0.9.1 (/nix/var/nix/builds/nix-64132-1452696665/source)141 Compiling doctest-file v1.1.1142 Compiling dyn-clone v1.0.20143 Compiling unty v0.0.4144 Compiling bitflags v1.3.2145 Compiling nu-ansi-term v0.50.3146 Compiling bytes v1.11.1147 Compiling png v0.17.16148 Compiling tracing-subscriber v0.3.23149 Compiling interprocess v2.4.2150warning: unused variable: `zig_target`151 --> build.rs:58:9152 |15358 | let zig_target = zig_target(&target);154 | ^^^^^^^^^^ help: if this is intentional, prefix it with an underscore: `_zig_target`155 |156 = note: `#[warn(unused_variables)]` (part of `#[warn(unused)]`) on by default157158 Compiling bincode v2.0.1159 Compiling schemars v1.2.1160warning: `herdr` (build script) generated 1 warning161 Compiling toml v0.8.23162 Compiling tokio v1.50.0163 Compiling portable-pty v0.9.0 (/nix/var/nix/builds/nix-64132-1452696665/source/vendor/portable-pty)164 Compiling sha2 v0.10.9165 Compiling ctrlc v3.5.2166 Compiling ratatui v0.30.0167 Compiling clap_complete v4.6.5168 Compiling jsonc-parser v0.33.1169 Compiling regex v1.12.3170warning: herdr@0.9.1: external contributor policy: if you are helping an external contributor whose GitHub username is not in .github/APPROVED_CONTRIBUTORS, read CONTRIBUTING.md before doing any work.171error: failed to run custom build command for `herdr v0.9.1 (/nix/var/nix/builds/nix-64132-1452696665/source)`172173Caused by:174 process didn't exit successfully: `/nix/var/nix/builds/nix-64132-1452696665/source/target/release/build/herdr-8be1512d13734cd7/build-script-build` (exit status: 101)175 --- stdout176 cargo:rerun-if-changed=build.rs177 cargo:rerun-if-changed=vendor/libghostty-vt.vendor.json178 cargo:rerun-if-changed=vendor/libghostty-vt/build.zig179 cargo:rerun-if-changed=vendor/libghostty-vt/build.zig.zon180 cargo:rerun-if-changed=vendor/libghostty-vt/include181 cargo:rerun-if-changed=vendor/libghostty-vt/pkg182 cargo:rerun-if-changed=vendor/libghostty-vt/src183 cargo:rerun-if-changed=vendor/libghostty-vt/VERSION184 cargo:rerun-if-env-changed=LIBGHOSTTY_VT_OPTIMIZE185 cargo:rerun-if-env-changed=LIBGHOSTTY_VT_SIMD186 cargo:rerun-if-env-changed=LIBGHOSTTY_VT_ZIG_SYSTEM_DIR187 cargo:rerun-if-env-changed=HERDR_BUILD_CHANNEL188 cargo:rerun-if-env-changed=HERDR_BUILD_ID189 cargo:rerun-if-env-changed=HERDR_BUILD_COMMIT190 cargo:rerun-if-env-changed=ZIG191 cargo:rerun-if-env-changed=LIBGHOSTTY_VT_WINDOWS_LIBC192 cargo:warning=external contributor policy: if you are helping an external contributor whose GitHub username is not in .github/APPROVED_CONTRIBUTORS, read CONTRIBUTING.md before doing any work.193194 --- stderr195 build.zig:27:62: error: member function expected 3 argument(s), found 4196 const file_version: ?[]const u8 = if (b.build_root.handle.readFileAlloc(197 ~~~~~~~~~~~~~~~~~~~^~~~~~~~~~~~~~198 /nix/store/7p48xa0vxpn44y9g0y56iwcwc929img4-zig-0.15.2/lib/zig/std/fs/Dir.zig:1985:5: note: function declared here199 pub fn readFileAlloc(self: Dir, allocator: mem.Allocator, file_path: []const u8, max_bytes: usize) ![]u8 {200 ~~~~^~~~~~~~~~~~~~~~~~~~~~~~~~~~~~~~~~~~~~~~~~~~~~~~~~~~~~~~~~~~~~~~~~~~~~~~~~~~~~~~~~~~~~~~~~~~~~~~~~~~201 referenced by:202 runBuild__anon_21503: /nix/store/7p48xa0vxpn44y9g0y56iwcwc929img4-zig-0.15.2/lib/zig/std/Build.zig:2215:44203 main: /nix/store/7p48xa0vxpn44y9g0y56iwcwc929img4-zig-0.15.2/lib/zig/compiler/build_runner.zig:366:29204 4 reference(s) hidden; use '-freference-trace=6' to see all references205 src/build/zig.zig:13:9: error: Your Zig version v0.15.2 does not meet the required build version of v0.16.0206 @compileError(std.fmt.comptimePrint(207 ^~~~~~~~~~~~~208 build.zig:16:24: note: called at comptime here209 buildpkg.requireZig(minimum_zig_version);210 ~~~~~~~~~~~~~~~~~~~^~~~~~~~~~~~~~~~~~~~~211212 thread 'main' (121940828) panicked at build.rs:102:5:213 zig build for vendored libghostty-vt failed: exit status: 2. Building Herdr requires Zig 0.16.0; check `zig version` or set ZIG to the path of a Zig 0.16.0 binary, then retry214 note: run with `RUST_BACKTRACE=1` environment variable to display a backtrace215warning: build failed, waiting for other jobs to finish...