nixbot

builds
1Using versionCheckHook
unpackPhase
2unpacking source archive /nix/store/haky2nvzqmf66dqkm9zz7f84cq73bc47-source3source root is source4Executing cargoSetupPostUnpackHook5Finished cargoSetupPostUnpackHook
patchPhase
6Executing cargoSetupPostPatchHook7Validating consistency between /build/source/Cargo.lock and /build/herdr-0.9.1-vendor/Cargo.lock8Finished cargoSetupPostPatchHook
buildPhase
9Executing cargoBuildHook10cargoBuildHook flags: -j 48 --target x86_64-unknown-linux-gnu --offline --profile release11 Compiling proc-macro2 v1.0.10612 Compiling unicode-ident v1.0.2413 Compiling quote v1.0.4514 Compiling libc v0.2.18315 Compiling cfg-if v1.0.416 Compiling serde_core v1.0.22817 Compiling bitflags v2.11.018 Compiling equivalent v1.0.219 Compiling foldhash v0.2.020 Compiling allocator-api2 v0.2.2121 Compiling itoa v1.0.1822 Compiling rustversion v1.0.2223 Compiling log v0.4.2924 Compiling strsim v0.11.125 Compiling ident_case v1.0.126 Compiling serde v1.0.22827 Compiling thiserror v2.0.1828 Compiling memchr v2.8.029 Compiling typenum v1.19.030 Compiling heck v0.5.031 Compiling either v1.15.032 Compiling version_check v0.9.533 Compiling indoc v2.0.734 Compiling ryu v1.0.2335 Compiling signal-hook v0.3.1836 Compiling unicode-segmentation v1.13.137 Compiling static_assertions v1.1.038 Compiling instability v0.3.1239 Compiling smallvec v1.15.140 Compiling parking_lot_core v0.9.1241 Compiling unicode-width v0.2.242 Compiling scopeguard v1.2.043 Compiling zmij v1.0.2144 Compiling rustix v1.1.445 Compiling powerfmt v0.2.046 Compiling num_threads v0.1.747 Compiling linux-raw-sys v0.12.148 Compiling cfg_aliases v0.2.149 Compiling time-core v0.1.850 Compiling once_cell v1.21.451 Compiling num-conv v0.2.152 Compiling simd-adler32 v0.3.953 Compiling thiserror v1.0.6954 Compiling regex-syntax v0.8.1055 Compiling cfg_aliases v0.1.156 Compiling litrs v1.0.057 Compiling crc32fast v1.5.058 Compiling serde_json v1.0.14959 Compiling clap_lex v1.1.060 Compiling pin-project-lite v0.2.1761 Compiling anstyle v1.0.1462 Compiling anyhow v1.0.10263 Compiling nix v0.28.064 Compiling nix v0.31.265 Compiling lock_api v0.4.1466 Compiling adler2 v2.0.167 Compiling line-clipping v0.3.568 Compiling deranged v0.5.869 Compiling ref-cast v1.0.2570 Compiling miniz_oxide v0.8.971 Compiling toml_write v0.1.272 Compiling itertools v0.14.073 Compiling virtue v0.0.1874 Compiling winnow v0.7.1575 Compiling tracing-core v0.1.3676 Compiling clap_builder v4.6.077 Compiling lazy_static v1.5.078 Compiling fdeflate v0.3.779 Compiling thread_local v1.1.980 Compiling dyn-clone v1.0.2081 Compiling generic-array v0.14.782 Compiling unty v0.0.483 Compiling bytes v1.11.184 Compiling shell-words v1.1.185 Compiling bitflags v1.3.286 Compiling cpufeatures v0.2.1787 Compiling sharded-slab v0.1.788 Compiling herdr v0.9.1 (/build/source)89 Compiling nu-ansi-term v0.50.390 Compiling doctest-file v1.1.191 Compiling downcast-rs v1.2.192 Compiling base64 v0.22.193 Compiling hashbrown v0.16.194 Compiling convert_case v0.10.095 Compiling document-features v0.2.1296warning: unused variable: `zig_target`97 --> build.rs:58:998 |9958 | let zig_target = zig_target(&target);100 | ^^^^^^^^^^ help: if this is intentional, prefix it with an underscore: `_zig_target`101 |102 = note: `#[warn(unused_variables)]` (part of `#[warn(unused)]`) on by default103104 Compiling tracing-log v0.2.0105 Compiling aho-corasick v1.1.4106 Compiling castaway v0.2.4107 Compiling bincode_derive v2.0.1108 Compiling flate2 v1.1.9109 Compiling compact_str v0.9.0110warning: `herdr` (build script) generated 1 warning111 Compiling syn v2.0.117112 Compiling png v0.17.16113 Compiling lru v0.16.3114 Compiling indexmap v2.13.0115 Compiling crypto-common v0.1.7116 Compiling block-buffer v0.10.4117 Compiling digest v0.10.7118 Compiling sha2 v0.10.9119 Compiling errno v0.3.14120 Compiling mio v1.1.1121 Compiling time v0.3.47122 Compiling serial2 v0.2.34123 Compiling interprocess v2.4.2124 Compiling signal-hook-registry v1.4.8125 Compiling parking_lot v0.12.5126 Compiling unicode-truncate v2.0.1127 Compiling signal-hook-mio v0.2.5128 Compiling regex-automata v0.4.14129 Compiling ctrlc v3.5.2130 Compiling clap v4.6.1131 Compiling clap_complete v4.6.5132 Compiling serde_ignored v0.1.14133 Compiling jsonc-parser v0.33.1134 Compiling darling_core v0.23.0135 Compiling serde_derive_internals v0.29.1136 Compiling serde_derive v1.0.228137 Compiling thiserror-impl v2.0.18138 Compiling strum_macros v0.27.2139 Compiling derive_more-impl v2.1.1140 Compiling thiserror-impl v1.0.69141 Compiling ref-cast-impl v1.0.25142 Compiling tracing-attributes v0.1.31143 Compiling tokio-macros v2.6.1144 Compiling schemars_derive v1.2.1145 Compiling tokio v1.50.0146warning: herdr@0.9.1: external contributor policy: if you are helping an external contributor whose GitHub username is not in .github/APPROVED_CONTRIBUTORS, read CONTRIBUTING.md before doing any work.147error: failed to run custom build command for `herdr v0.9.1 (/build/source)`148149Caused by:150 process didn't exit successfully: `/build/source/target/release/build/herdr-819dd8b4c0bb2cd7/build-script-build` (exit status: 101)151 --- stdout152 cargo:rerun-if-changed=build.rs153 cargo:rerun-if-changed=vendor/libghostty-vt.vendor.json154 cargo:rerun-if-changed=vendor/libghostty-vt/build.zig155 cargo:rerun-if-changed=vendor/libghostty-vt/build.zig.zon156 cargo:rerun-if-changed=vendor/libghostty-vt/include157 cargo:rerun-if-changed=vendor/libghostty-vt/pkg158 cargo:rerun-if-changed=vendor/libghostty-vt/src159 cargo:rerun-if-changed=vendor/libghostty-vt/VERSION160 cargo:rerun-if-env-changed=LIBGHOSTTY_VT_OPTIMIZE161 cargo:rerun-if-env-changed=LIBGHOSTTY_VT_SIMD162 cargo:rerun-if-env-changed=LIBGHOSTTY_VT_ZIG_SYSTEM_DIR163 cargo:rerun-if-env-changed=HERDR_BUILD_CHANNEL164 cargo:rerun-if-env-changed=HERDR_BUILD_ID165 cargo:rerun-if-env-changed=HERDR_BUILD_COMMIT166 cargo:rerun-if-env-changed=ZIG167 cargo:rerun-if-env-changed=LIBGHOSTTY_VT_WINDOWS_LIBC168 cargo:warning=external contributor policy: if you are helping an external contributor whose GitHub username is not in .github/APPROVED_CONTRIBUTORS, read CONTRIBUTING.md before doing any work.169170 --- stderr171 build.zig:27:62: error: member function expected 3 argument(s), found 4172 const file_version: ?[]const u8 = if (b.build_root.handle.readFileAlloc(173 ~~~~~~~~~~~~~~~~~~~^~~~~~~~~~~~~~174 /nix/store/c1hmdnfszx935fs34j47h0syj8f9nnyw-zig-0.15.2/lib/zig/std/fs/Dir.zig:1985:5: note: function declared here175 pub fn readFileAlloc(self: Dir, allocator: mem.Allocator, file_path: []const u8, max_bytes: usize) ![]u8 {176 ~~~~^~~~~~~~~~~~~~~~~~~~~~~~~~~~~~~~~~~~~~~~~~~~~~~~~~~~~~~~~~~~~~~~~~~~~~~~~~~~~~~~~~~~~~~~~~~~~~~~~~~~177 referenced by:178 runBuild__anon_23953: /nix/store/c1hmdnfszx935fs34j47h0syj8f9nnyw-zig-0.15.2/lib/zig/std/Build.zig:2215:44179 main: /nix/store/c1hmdnfszx935fs34j47h0syj8f9nnyw-zig-0.15.2/lib/zig/compiler/build_runner.zig:366:29180 5 reference(s) hidden; use '-freference-trace=7' to see all references181 src/build/zig.zig:13:9: error: Your Zig version v0.15.2 does not meet the required build version of v0.16.0182 @compileError(std.fmt.comptimePrint(183 ^~~~~~~~~~~~~184 build.zig:16:24: note: called at comptime here185 buildpkg.requireZig(minimum_zig_version);186 ~~~~~~~~~~~~~~~~~~~^~~~~~~~~~~~~~~~~~~~~187188 thread 'main' (1593) panicked at build.rs:102:5:189 zig build for vendored libghostty-vt failed: exit status: 2. Building Herdr requires Zig 0.16.0; check `zig version` or set ZIG to the path of a Zig 0.16.0 binary, then retry190 note: run with `RUST_BACKTRACE=1` environment variable to display a backtrace191warning: build failed, waiting for other jobs to finish...