herdr-0.9.1
checks.aarch64-linux.pkgs-herdr
· build #4665
· raw
1bld3: building 6rlq1mrvzq2k9kjccvwcz9araqlrr87c-herdr-0.9.1.drv2Using versionCheckHook3unpacking source archive /nix/store/haky2nvzqmf66dqkm9zz7f84cq73bc47-source4source root is source5Executing cargoSetupPostUnpackHook6Finished cargoSetupPostUnpackHook7Executing cargoSetupPostPatchHook8Validating consistency between /build/source/Cargo.lock and /build/herdr-0.9.1-vendor/Cargo.lock9Finished cargoSetupPostPatchHook10Executing cargoBuildHook11cargoBuildHook flags: -j 8 --target aarch64-unknown-linux-gnu --offline --profile release12 Compiling proc-macro2 v1.0.10613 Compiling unicode-ident v1.0.2414 Compiling quote v1.0.4515 Compiling libc v0.2.18316 Compiling cfg-if v1.0.417 Compiling serde_core v1.0.22818 Compiling bitflags v2.11.019 Compiling equivalent v1.0.220 Compiling allocator-api2 v0.2.2121 Compiling foldhash v0.2.022 Compiling itoa v1.0.1823 Compiling log v0.4.2924 Compiling rustversion v1.0.2225 Compiling memchr v2.8.026 Compiling ident_case v1.0.127 Compiling hashbrown v0.16.128 Compiling strsim v0.11.129 Compiling serde v1.0.22830 Compiling thiserror v2.0.1831 Compiling either v1.15.032 Compiling heck v0.5.033 Compiling typenum v1.19.034 Compiling version_check v0.9.535 Compiling syn v2.0.11736 Compiling itertools v0.14.037 Compiling castaway v0.2.438 Compiling generic-array v0.14.739 Compiling indoc v2.0.740 Compiling static_assertions v1.1.041 Compiling signal-hook v0.3.1842 Compiling smallvec v1.15.143 Compiling parking_lot_core v0.9.1244 Compiling unicode-segmentation v1.13.145 Compiling ryu v1.0.2346 Compiling instability v0.3.1247 Compiling unicode-width v0.2.248 Compiling compact_str v0.9.049 Compiling errno v0.3.1450 Compiling convert_case v0.10.051 Compiling mio v1.1.152 Compiling signal-hook-registry v1.4.853 Compiling lru v0.16.354 Compiling scopeguard v1.2.055 Compiling powerfmt v0.2.056 Compiling rustix v1.1.457 Compiling zmij v1.0.2158 Compiling deranged v0.5.859 Compiling lock_api v0.4.1460 Compiling unicode-truncate v2.0.161 Compiling aho-corasick v1.1.462 Compiling crc32fast v1.5.063 Compiling cfg_aliases v0.1.164 Compiling regex-syntax v0.8.1065 Compiling time-core v0.1.866 Compiling num-conv v0.2.167 Compiling num_threads v0.1.768 Compiling litrs v1.0.069 Compiling cfg_aliases v0.2.170 Compiling linux-raw-sys v0.12.171 Compiling simd-adler32 v0.3.972 Compiling once_cell v1.21.473 Compiling serde_json v1.0.14974 Compiling thiserror v1.0.6975 Compiling tracing-core v0.1.3676 Compiling document-features v0.2.1277 Compiling nix v0.31.278 Compiling time v0.3.4779 Compiling nix v0.28.080 Compiling darling_core v0.23.081 Compiling parking_lot v0.12.582 Compiling signal-hook-mio v0.2.583 Compiling line-clipping v0.3.584 Compiling regex-automata v0.4.1485 Compiling pin-project-lite v0.2.1786 Compiling anyhow v1.0.10287 Compiling anstyle v1.0.1488 Compiling adler2 v2.0.189 Compiling clap_lex v1.1.090 Compiling ref-cast v1.0.2591 Compiling clap_builder v4.6.092 Compiling miniz_oxide v0.8.993 Compiling serde_derive v1.0.22894 Compiling thiserror-impl v2.0.1895 Compiling darling_macro v0.23.096 Compiling strum_macros v0.27.297 Compiling derive_more-impl v2.1.198 Compiling darling v0.23.099 Compiling kasuari v0.4.12100 Compiling thiserror-impl v1.0.69101 Compiling derive_more v2.1.1102 Compiling crossterm v0.29.0103 Compiling ref-cast-impl v1.0.25104 Compiling strum v0.27.2105 Compiling tracing-attributes v0.1.31106 Compiling ratatui-core v0.1.0107 Compiling toml_datetime v0.6.11108 Compiling serde_spanned v0.6.9109 Compiling serde_derive_internals v0.29.1110 Compiling ratatui-widgets v0.3.0111 Compiling crypto-common v0.1.7112 Compiling block-buffer v0.10.4113 Compiling indexmap v2.13.0114 Compiling virtue v0.0.18115 Compiling toml_write v0.1.2116 Compiling winnow v0.7.15117 Compiling lazy_static v1.5.0118 Compiling sharded-slab v0.1.7119 Compiling bincode_derive v2.0.1120 Compiling ratatui-macros v0.7.0121 Compiling digest v0.10.7122 Compiling flate2 v1.1.9123 Compiling schemars_derive v1.2.1124 Compiling tracing v0.1.44125 Compiling toml_edit v0.22.27126 Compiling ratatui-crossterm v0.1.0127 Compiling filedescriptor v0.8.3128 Compiling matchers v0.2.0129 Compiling clap v4.6.1130 Compiling tokio-macros v2.6.1131 Compiling tracing-log v0.2.0132 Compiling fdeflate v0.3.7133 Compiling cpufeatures v0.2.17134 Compiling serial2 v0.2.34135 Compiling thread_local v1.1.9136 Compiling bytes v1.11.1137 Compiling herdr v0.9.1 (/build/source)138 Compiling bitflags v1.3.2139warning: unused variable: `zig_target`140 --> build.rs:58:9141 |14258 | let zig_target = zig_target(&target);143 | ^^^^^^^^^^ help: if this is intentional, prefix it with an underscore: `_zig_target`144 |145 = note: `#[warn(unused_variables)]` (part of `#[warn(unused)]`) on by default146147 Compiling dyn-clone v1.0.20148 Compiling downcast-rs v1.2.1149 Compiling unty v0.0.4150 Compiling shell-words v1.1.1151warning: `herdr` (build script) generated 1 warning152 Compiling doctest-file v1.1.1153 Compiling nu-ansi-term v0.50.3154 Compiling portable-pty v0.9.0 (/build/source/vendor/portable-pty)155 Compiling tokio v1.50.0156 Compiling interprocess v2.4.2157 Compiling tracing-subscriber v0.3.23158 Compiling bincode v2.0.1159 Compiling schemars v1.2.1160 Compiling png v0.17.16161 Compiling toml v0.8.23162warning: herdr@0.9.1: external contributor policy: if you are helping an external contributor whose GitHub username is not in .github/APPROVED_CONTRIBUTORS, read CONTRIBUTING.md before doing any work.163error: failed to run custom build command for `herdr v0.9.1 (/build/source)`164165Caused by:166 process didn't exit successfully: `/build/source/target/release/build/herdr-034112b388ae78e1/build-script-build` (exit status: 101)167 --- stdout168 cargo:rerun-if-changed=build.rs169 cargo:rerun-if-changed=vendor/libghostty-vt.vendor.json170 cargo:rerun-if-changed=vendor/libghostty-vt/build.zig171 cargo:rerun-if-changed=vendor/libghostty-vt/build.zig.zon172 cargo:rerun-if-changed=vendor/libghostty-vt/include173 cargo:rerun-if-changed=vendor/libghostty-vt/pkg174 cargo:rerun-if-changed=vendor/libghostty-vt/src175 cargo:rerun-if-changed=vendor/libghostty-vt/VERSION176 cargo:rerun-if-env-changed=LIBGHOSTTY_VT_OPTIMIZE177 cargo:rerun-if-env-changed=LIBGHOSTTY_VT_SIMD178 cargo:rerun-if-env-changed=LIBGHOSTTY_VT_ZIG_SYSTEM_DIR179 cargo:rerun-if-env-changed=HERDR_BUILD_CHANNEL180 cargo:rerun-if-env-changed=HERDR_BUILD_ID181 cargo:rerun-if-env-changed=HERDR_BUILD_COMMIT182 cargo:rerun-if-env-changed=ZIG183 cargo:rerun-if-env-changed=LIBGHOSTTY_VT_WINDOWS_LIBC184 cargo:warning=external contributor policy: if you are helping an external contributor whose GitHub username is not in .github/APPROVED_CONTRIBUTORS, read CONTRIBUTING.md before doing any work.185186 --- stderr187 build.zig:27:62: error: member function expected 3 argument(s), found 4188 const file_version: ?[]const u8 = if (b.build_root.handle.readFileAlloc(189 ~~~~~~~~~~~~~~~~~~~^~~~~~~~~~~~~~190 /nix/store/ziwpdq2r7n0wzmf731nfa44wl4x13358-zig-0.15.2/lib/zig/std/fs/Dir.zig:1985:5: note: function declared here191 pub fn readFileAlloc(self: Dir, allocator: mem.Allocator, file_path: []const u8, max_bytes: usize) ![]u8 {192 ~~~~^~~~~~~~~~~~~~~~~~~~~~~~~~~~~~~~~~~~~~~~~~~~~~~~~~~~~~~~~~~~~~~~~~~~~~~~~~~~~~~~~~~~~~~~~~~~~~~~~~~~193 referenced by:194 runBuild__anon_23748: /nix/store/ziwpdq2r7n0wzmf731nfa44wl4x13358-zig-0.15.2/lib/zig/std/Build.zig:2215:44195 main: /nix/store/ziwpdq2r7n0wzmf731nfa44wl4x13358-zig-0.15.2/lib/zig/compiler/build_runner.zig:366:29196 5 reference(s) hidden; use '-freference-trace=7' to see all references197 src/build/zig.zig:13:9: error: Your Zig version v0.15.2 does not meet the required build version of v0.16.0198 @compileError(std.fmt.comptimePrint(199 ^~~~~~~~~~~~~200 build.zig:16:24: note: called at comptime here201 buildpkg.requireZig(minimum_zig_version);202 ~~~~~~~~~~~~~~~~~~~^~~~~~~~~~~~~~~~~~~~~203204 thread 'main' (2797) panicked at build.rs:102:5:205 zig build for vendored libghostty-vt failed: exit status: 2. Building Herdr requires Zig 0.16.0; check `zig version` or set ZIG to the path of a Zig 0.16.0 binary, then retry206 note: run with `RUST_BACKTRACE=1` environment variable to display a backtrace207warning: build failed, waiting for other jobs to finish...